Carbon steel A36
Temperature : [30, 40, 50, 60, 70, 80, 90, 100, 110, 120, 130, 140, 150, 160, 170, 180, 190, 200, 210, 220, 230, 240, 250]
Vitesse : [5916, 5906, 5896, 5889, 5882, 5872, 5865, 5853, 5845, 5836, 5823, 5811, 5804, 5798, 5785, 5770, 5766, 5764, 5745, 5732, 5726, 5712, 5697]

Steel X14CrMoS17
Temperature : [20, 59, 92, 116, 169, 214, 289, 357, 463, 533, 622, 734, 883]
Vitesse : [5955, 5990, 5963, 5942, 5840, 5787, 5817, 5756, 5661, 5502, 5406, 5233, 5240]

X90CrMoV18
Temperature : [20, 55, 98, 130, 164, 267, 288, 355, 483, 532, 644, 754]
Vitesse : [5988, 5961, 5925, 5981, 5881, 5839, 5855, 5809, 5700, 5624, 5468, 5355]

Acier Bas Carbone MT1
Temperature : [50,100,200,300,400,500,550,600,625]
Vitesse : [5904,5875,5840,5712,5625,5483,5420,5338,5320]

Acier Bas Carbone MT2
Temperature : [50,100,200,300,400,500,600,650,700,750]
Vitesse : [5930,5870,5843,5756,5649,5512,5400,5303,5200,5110]

Aluminium
Temperature : [20, 52, 102, 152, 202, 252, 302, 352, 402, 452, 502, 552, 602, 652]
Vitesse : [6278, 6283, 6259, 6228, 6193, 6159, 6119, 6069, 6029, 5984, 5938, 5888, 5839, 5777]
