01/01/2018	16023
08/01/2018	15776
15/01/2018	16023
22/01/2018	17414
29/01/2018	17920
05/02/2018	17909
12/02/2018	19068
19/02/2018	18734
26/02/2018	16467
05/03/2018	16310
12/03/2018	13619
19/03/2018	11153
26/03/2018	8576
02/04/2018	6872
09/04/2018	4816
16/04/2018	2926
23/04/2018	1732
30/04/2018	889
07/05/2018	587
01/10/2018	64
08/10/2018	84
15/10/2018	123
22/10/2018	150
29/10/2018	213
05/11/2018	329
12/11/2018	383
19/11/2018	427
26/11/2018	728
03/12/2018	1179
10/12/2018	1698
24/12/2018	4619
31/12/2018	6682
14/05/2018	387
21/05/2018	141
28/05/2018	139
04/06/2018	63
11/06/2018	37
25/06/2018	20
02/07/2018	19
09/07/2018	14
16/07/2018	22
23/07/2018	14
30/07/2018	25
06/08/2018	15
13/08/2018	18
20/08/2018	11
27/08/2018	17
03/09/2018	26
10/09/2018	19
17/09/2018	22
24/09/2018	14
17/12/2018	3375
18/06/2018	27
