Region of the Americas of WHO,24/09/2018,1
Region of the Americas of WHO,11/06/2018,1
Region of the Americas of WHO,01/01/2018,432
Region of the Americas of WHO,08/01/2018,489
Region of the Americas of WHO,15/01/2018,451
Region of the Americas of WHO,22/01/2018,453
Region of the Americas of WHO,29/01/2018,464
Region of the Americas of WHO,05/02/2018,421
Region of the Americas of WHO,12/02/2018,342
Region of the Americas of WHO,19/02/2018,512
Region of the Americas of WHO,26/02/2018,495
Region of the Americas of WHO,05/03/2018,436
Region of the Americas of WHO,12/03/2018,644
Region of the Americas of WHO,19/03/2018,813
Region of the Americas of WHO,26/03/2018,615
Region of the Americas of WHO,02/04/2018,755
Region of the Americas of WHO,09/04/2018,750
Region of the Americas of WHO,16/04/2018,694
Region of the Americas of WHO,23/04/2018,591
Region of the Americas of WHO,30/04/2018,1143
Region of the Americas of WHO,07/05/2018,1205
Region of the Americas of WHO,14/05/2018,1448
Region of the Americas of WHO,21/05/2018,1761
Region of the Americas of WHO,28/05/2018,2469
Region of the Americas of WHO,04/06/2018,2560
Region of the Americas of WHO,11/06/2018,2996
Region of the Americas of WHO,18/06/2018,3290
Region of the Americas of WHO,25/06/2018,3408
Region of the Americas of WHO,02/07/2018,3353
Region of the Americas of WHO,09/07/2018,3090
Region of the Americas of WHO,16/07/2018,3425
Region of the Americas of WHO,23/07/2018,3106
Region of the Americas of WHO,30/07/2018,2681
Region of the Americas of WHO,06/08/2018,2642
Region of the Americas of WHO,13/08/2018,2616
Region of the Americas of WHO,20/08/2018,2599
Region of the Americas of WHO,27/08/2018,2790
Region of the Americas of WHO,03/09/2018,2773
Region of the Americas of WHO,10/09/2018,2772
Region of the Americas of WHO,17/09/2018,2206
Region of the Americas of WHO,24/09/2018,2116
Region of the Americas of WHO,01/10/2018,1628
Region of the Americas of WHO,08/10/2018,1561
Region of the Americas of WHO,15/10/2018,1350
Region of the Americas of WHO,22/10/2018,1305
Region of the Americas of WHO,29/10/2018,1145
Region of the Americas of WHO,05/11/2018,949
Region of the Americas of WHO,12/11/2018,799
Region of the Americas of WHO,19/11/2018,757
Region of the Americas of WHO,26/11/2018,581
Region of the Americas of WHO,03/12/2018,469
Region of the Americas of WHO,10/12/2018,445
Region of the Americas of WHO,17/12/2018,188
Region of the Americas of WHO,24/12/2018,65
Region of the Americas of WHO,31/12/2018,231
Region of the Americas of WHO,01/01/2018,5
Region of the Americas of WHO,08/01/2018,4
Region of the Americas of WHO,15/01/2018,2
Region of the Americas of WHO,22/01/2018,5
Region of the Americas of WHO,29/01/2018,10
Region of the Americas of WHO,05/02/2018,2
Region of the Americas of WHO,12/02/2018,10
Region of the Americas of WHO,19/02/2018,6
Region of the Americas of WHO,26/02/2018,6
Region of the Americas of WHO,12/03/2018,2
Region of the Americas of WHO,19/03/2018,1
Region of the Americas of WHO,07/05/2018,1
Region of the Americas of WHO,09/07/2018,4
Region of the Americas of WHO,16/07/2018,3
Region of the Americas of WHO,13/08/2018,1
Region of the Americas of WHO,03/09/2018,1
Region of the Americas of WHO,10/09/2018,1
Region of the Americas of WHO,17/09/2018,5
Region of the Americas of WHO,24/09/2018,1
Region of the Americas of WHO,01/10/2018,4
Region of the Americas of WHO,22/10/2018,1
Region of the Americas of WHO,29/10/2018,2
Region of the Americas of WHO,05/11/2018,4
Region of the Americas of WHO,12/11/2018,4
Region of the Americas of WHO,19/11/2018,1
Region of the Americas of WHO,26/11/2018,4
Region of the Americas of WHO,03/12/2018,1
Region of the Americas of WHO,10/12/2018,3
Region of the Americas of WHO,17/12/2018,2
Region of the Americas of WHO,24/12/2018,9
Region of the Americas of WHO,29/01/2018,1
Region of the Americas of WHO,12/02/2018,3
Region of the Americas of WHO,15/10/2018,1
Region of the Americas of WHO,01/01/2018,2
Region of the Americas of WHO,08/01/2018,3
Region of the Americas of WHO,15/01/2018,9
Region of the Americas of WHO,22/01/2018,7
Region of the Americas of WHO,29/01/2018,15
Region of the Americas of WHO,05/02/2018,7
Region of the Americas of WHO,12/02/2018,18
Region of the Americas of WHO,19/02/2018,11
Region of the Americas of WHO,26/02/2018,11
Region of the Americas of WHO,05/03/2018,17
Region of the Americas of WHO,12/03/2018,6
Region of the Americas of WHO,19/03/2018,11
Region of the Americas of WHO,26/03/2018,9
Region of the Americas of WHO,02/04/2018,9
Region of the Americas of WHO,09/04/2018,6
Region of the Americas of WHO,16/04/2018,4
Region of the Americas of WHO,23/04/2018,3
Region of the Americas of WHO,30/04/2018,15
Region of the Americas of WHO,07/05/2018,9
Region of the Americas of WHO,14/05/2018,9
Region of the Americas of WHO,21/05/2018,5
Region of the Americas of WHO,28/05/2018,5
Region of the Americas of WHO,04/06/2018,2
Region of the Americas of WHO,11/06/2018,7
Region of the Americas of WHO,18/06/2018,20
Region of the Americas of WHO,25/06/2018,7
Region of the Americas of WHO,02/07/2018,4
Region of the Americas of WHO,09/07/2018,1
Region of the Americas of WHO,16/07/2018,4
Region of the Americas of WHO,30/07/2018,10
Region of the Americas of WHO,13/08/2018,2
Region of the Americas of WHO,20/08/2018,5
Region of the Americas of WHO,27/08/2018,2
Region of the Americas of WHO,03/09/2018,2
Region of the Americas of WHO,10/09/2018,3
Region of the Americas of WHO,17/09/2018,4
Region of the Americas of WHO,24/09/2018,7
Region of the Americas of WHO,01/10/2018,9
Region of the Americas of WHO,08/10/2018,15
Region of the Americas of WHO,15/10/2018,16
Region of the Americas of WHO,22/10/2018,15
Region of the Americas of WHO,29/10/2018,19
Region of the Americas of WHO,05/11/2018,10
Region of the Americas of WHO,12/11/2018,1
Region of the Americas of WHO,01/01/2018,9
Region of the Americas of WHO,08/01/2018,17
Region of the Americas of WHO,15/01/2018,16
Region of the Americas of WHO,22/01/2018,20
Region of the Americas of WHO,29/01/2018,17
Region of the Americas of WHO,05/02/2018,22
Region of the Americas of WHO,12/02/2018,19
Region of the Americas of WHO,19/02/2018,32
Region of the Americas of WHO,26/02/2018,15
Region of the Americas of WHO,19/03/2018,1
Region of the Americas of WHO,26/03/2018,1
Region of the Americas of WHO,23/04/2018,1
Region of the Americas of WHO,30/04/2018,6
Region of the Americas of WHO,07/05/2018,2
Region of the Americas of WHO,14/05/2018,4
Region of the Americas of WHO,21/05/2018,9
Region of the Americas of WHO,28/05/2018,9
Region of the Americas of WHO,04/06/2018,6
Region of the Americas of WHO,11/06/2018,2
Region of the Americas of WHO,18/06/2018,1
Region of the Americas of WHO,02/07/2018,12
Region of the Americas of WHO,09/07/2018,6
Region of the Americas of WHO,16/07/2018,20
Region of the Americas of WHO,23/07/2018,13
Region of the Americas of WHO,30/07/2018,44
Region of the Americas of WHO,06/08/2018,7
Region of the Americas of WHO,13/08/2018,8
Region of the Americas of WHO,20/08/2018,6
Region of the Americas of WHO,27/08/2018,4
Region of the Americas of WHO,03/09/2018,4
Region of the Americas of WHO,10/09/2018,6
Region of the Americas of WHO,17/09/2018,4
Region of the Americas of WHO,24/09/2018,9
Region of the Americas of WHO,01/10/2018,6
Region of the Americas of WHO,08/10/2018,8
Region of the Americas of WHO,15/10/2018,1
Region of the Americas of WHO,22/10/2018,7
Region of the Americas of WHO,29/10/2018,2
Region of the Americas of WHO,05/11/2018,10
Region of the Americas of WHO,12/11/2018,6
Region of the Americas of WHO,19/11/2018,7
Region of the Americas of WHO,26/11/2018,6
Region of the Americas of WHO,03/12/2018,14
Region of the Americas of WHO,10/12/2018,10
Region of the Americas of WHO,17/12/2018,20
Region of the Americas of WHO,24/12/2018,7
Region of the Americas of WHO,31/12/2018,11
Region of the Americas of WHO,15/01/2018,1
Region of the Americas of WHO,22/01/2018,1
Region of the Americas of WHO,05/02/2018,1
Region of the Americas of WHO,01/01/2018,18
Region of the Americas of WHO,08/01/2018,21
Region of the Americas of WHO,15/01/2018,21
Region of the Americas of WHO,22/01/2018,18
Region of the Americas of WHO,29/01/2018,32
Region of the Americas of WHO,05/02/2018,25
Region of the Americas of WHO,12/02/2018,34
Region of the Americas of WHO,19/02/2018,57
Region of the Americas of WHO,26/02/2018,64
Region of the Americas of WHO,05/03/2018,69
Region of the Americas of WHO,12/03/2018,74
Region of the Americas of WHO,19/03/2018,100
Region of the Americas of WHO,26/03/2018,106
Region of the Americas of WHO,02/04/2018,198
Region of the Americas of WHO,09/04/2018,363
Region of the Americas of WHO,16/04/2018,694
Region of the Americas of WHO,23/04/2018,630
Region of the Americas of WHO,30/04/2018,506
Region of the Americas of WHO,07/05/2018,371
Region of the Americas of WHO,14/05/2018,254
Region of the Americas of WHO,21/05/2018,248
Region of the Americas of WHO,28/05/2018,215
Region of the Americas of WHO,04/06/2018,267
Region of the Americas of WHO,11/06/2018,207
Region of the Americas of WHO,18/06/2018,169
Region of the Americas of WHO,25/06/2018,213
Region of the Americas of WHO,02/07/2018,145
Region of the Americas of WHO,09/07/2018,117
Region of the Americas of WHO,16/07/2018,98
Region of the Americas of WHO,23/07/2018,89
Region of the Americas of WHO,30/07/2018,83
Region of the Americas of WHO,06/08/2018,82
Region of the Americas of WHO,13/08/2018,66
Region of the Americas of WHO,20/08/2018,44
Region of the Americas of WHO,27/08/2018,54
Region of the Americas of WHO,03/09/2018,61
Region of the Americas of WHO,10/09/2018,57
Region of the Americas of WHO,17/09/2018,65
Region of the Americas of WHO,24/09/2018,53
Region of the Americas of WHO,01/10/2018,60
Region of the Americas of WHO,08/10/2018,36
Region of the Americas of WHO,15/10/2018,50
Region of the Americas of WHO,22/10/2018,29
Region of the Americas of WHO,29/10/2018,41
Region of the Americas of WHO,05/11/2018,39
Region of the Americas of WHO,12/11/2018,29
Region of the Americas of WHO,19/11/2018,50
Region of the Americas of WHO,26/11/2018,28
Region of the Americas of WHO,03/12/2018,41
Region of the Americas of WHO,10/12/2018,45
Region of the Americas of WHO,17/12/2018,50
Region of the Americas of WHO,24/12/2018,46
Region of the Americas of WHO,31/12/2018,53
Region of the Americas of WHO,01/01/2018,97
Region of the Americas of WHO,08/01/2018,113
Region of the Americas of WHO,15/01/2018,155
Region of the Americas of WHO,22/01/2018,171
Region of the Americas of WHO,29/01/2018,260
Region of the Americas of WHO,05/02/2018,289
Region of the Americas of WHO,12/02/2018,198
Region of the Americas of WHO,19/02/2018,135
Region of the Americas of WHO,26/02/2018,197
Region of the Americas of WHO,05/03/2018,136
Region of the Americas of WHO,12/03/2018,159
Region of the Americas of WHO,19/03/2018,276
Region of the Americas of WHO,26/03/2018,308
Region of the Americas of WHO,02/04/2018,569
Region of the Americas of WHO,09/04/2018,501
Region of the Americas of WHO,16/04/2018,465
Region of the Americas of WHO,23/04/2018,386
Region of the Americas of WHO,30/04/2018,516
Region of the Americas of WHO,07/05/2018,712
Region of the Americas of WHO,14/05/2018,715
Region of the Americas of WHO,21/05/2018,806
Region of the Americas of WHO,28/05/2018,580
Region of the Americas of WHO,04/06/2018,672
Region of the Americas of WHO,11/06/2018,612
Region of the Americas of WHO,18/06/2018,710
Region of the Americas of WHO,25/06/2018,801
Region of the Americas of WHO,02/07/2018,785
Region of the Americas of WHO,09/07/2018,731
Region of the Americas of WHO,16/07/2018,838
Region of the Americas of WHO,23/07/2018,798
Region of the Americas of WHO,30/07/2018,385
Region of the Americas of WHO,06/08/2018,368
Region of the Americas of WHO,13/08/2018,287
Region of the Americas of WHO,20/08/2018,32
Region of the Americas of WHO,27/08/2018,47
Region of the Americas of WHO,03/09/2018,37
Region of the Americas of WHO,10/09/2018,320
Region of the Americas of WHO,17/09/2018,352
Region of the Americas of WHO,24/09/2018,336
Region of the Americas of WHO,01/10/2018,146
Region of the Americas of WHO,08/10/2018,163
Region of the Americas of WHO,15/10/2018,273
Region of the Americas of WHO,22/10/2018,198
Region of the Americas of WHO,29/10/2018,116
Region of the Americas of WHO,05/11/2018,196
Region of the Americas of WHO,12/11/2018,202
Region of the Americas of WHO,19/11/2018,296
Region of the Americas of WHO,26/11/2018,257
Region of the Americas of WHO,03/12/2018,309
Region of the Americas of WHO,10/12/2018,369
Region of the Americas of WHO,17/12/2018,217
Region of the Americas of WHO,24/12/2018,152
Region of the Americas of WHO,31/12/2018,186
Region of the Americas of WHO,01/01/2018,14886
Region of the Americas of WHO,08/01/2018,15717
Region of the Americas of WHO,15/01/2018,15001
Region of the Americas of WHO,22/01/2018,14146
Region of the Americas of WHO,29/01/2018,14319
Region of the Americas of WHO,05/02/2018,14687
Region of the Americas of WHO,12/02/2018,14351
Region of the Americas of WHO,19/02/2018,14024
Region of the Americas of WHO,26/02/2018,13316
Region of the Americas of WHO,05/03/2018,11535
Region of the Americas of WHO,12/03/2018,10581
Region of the Americas of WHO,19/03/2018,9028
Region of the Americas of WHO,26/03/2018,7787
Region of the Americas of WHO,02/04/2018,7496
Region of the Americas of WHO,09/04/2018,7259
Region of the Americas of WHO,16/04/2018,6175
Region of the Americas of WHO,23/04/2018,5345
Region of the Americas of WHO,30/04/2018,4787
Region of the Americas of WHO,07/05/2018,3874
Region of the Americas of WHO,14/05/2018,3387
Region of the Americas of WHO,21/05/2018,2965
Region of the Americas of WHO,28/05/2018,2649
Region of the Americas of WHO,04/06/2018,2522
Region of the Americas of WHO,11/06/2018,2230
Region of the Americas of WHO,18/06/2018,2206
Region of the Americas of WHO,25/06/2018,1953
Region of the Americas of WHO,02/07/2018,1671
Region of the Americas of WHO,09/07/2018,1717
Region of the Americas of WHO,16/07/2018,1703
Region of the Americas of WHO,23/07/2018,1682
Region of the Americas of WHO,30/07/2018,1733
Region of the Americas of WHO,06/08/2018,1515
Region of the Americas of WHO,13/08/2018,1586
Region of the Americas of WHO,20/08/2018,1673
Region of the Americas of WHO,27/08/2018,1764
Region of the Americas of WHO,03/09/2018,1880
Region of the Americas of WHO,10/09/2018,2235
Region of the Americas of WHO,17/09/2018,2567
Region of the Americas of WHO,24/09/2018,2996
Region of the Americas of WHO,01/10/2018,3384
Region of the Americas of WHO,08/10/2018,3510
Region of the Americas of WHO,15/10/2018,4020
Region of the Americas of WHO,22/10/2018,4470
Region of the Americas of WHO,29/10/2018,4703
Region of the Americas of WHO,05/11/2018,5665
Region of the Americas of WHO,12/11/2018,5449
Region of the Americas of WHO,19/11/2018,6386
Region of the Americas of WHO,26/11/2018,7416
Region of the Americas of WHO,03/12/2018,8559
Region of the Americas of WHO,10/12/2018,9464
Region of the Americas of WHO,17/12/2018,10244
Region of the Americas of WHO,24/12/2018,7972
Region of the Americas of WHO,31/12/2018,14349
Region of the Americas of WHO,22/01/2018,2
Region of the Americas of WHO,29/01/2018,2
Region of the Americas of WHO,05/02/2018,1
Region of the Americas of WHO,05/03/2018,1
Region of the Americas of WHO,19/03/2018,1
Region of the Americas of WHO,01/01/2018,371
Region of the Americas of WHO,08/01/2018,374
Region of the Americas of WHO,15/01/2018,332
Region of the Americas of WHO,22/01/2018,343
Region of the Americas of WHO,29/01/2018,294
Region of the Americas of WHO,05/02/2018,287
Region of the Americas of WHO,12/02/2018,288
Region of the Americas of WHO,19/02/2018,305
Region of the Americas of WHO,26/02/2018,326
Region of the Americas of WHO,05/03/2018,382
Region of the Americas of WHO,12/03/2018,579
Region of the Americas of WHO,19/03/2018,731
Region of the Americas of WHO,26/03/2018,561
Region of the Americas of WHO,02/04/2018,686
Region of the Americas of WHO,09/04/2018,650
Region of the Americas of WHO,16/04/2018,714
Region of the Americas of WHO,23/04/2018,743
Region of the Americas of WHO,30/04/2018,748
Region of the Americas of WHO,07/05/2018,833
Region of the Americas of WHO,14/05/2018,953
Region of the Americas of WHO,21/05/2018,1003
Region of the Americas of WHO,28/05/2018,1249
Region of the Americas of WHO,04/06/2018,1431
Region of the Americas of WHO,11/06/2018,1525
Region of the Americas of WHO,18/06/2018,1630
Region of the Americas of WHO,25/06/2018,2020
Region of the Americas of WHO,02/07/2018,1951
Region of the Americas of WHO,09/07/2018,2147
Region of the Americas of WHO,16/07/2018,1912
Region of the Americas of WHO,23/07/2018,1904
Region of the Americas of WHO,30/07/2018,1739
Region of the Americas of WHO,06/08/2018,1680
Region of the Americas of WHO,13/08/2018,1853
Region of the Americas of WHO,20/08/2018,1761
Region of the Americas of WHO,27/08/2018,1662
Region of the Americas of WHO,03/09/2018,1372
Region of the Americas of WHO,10/09/2018,1229
Region of the Americas of WHO,17/09/2018,815
Region of the Americas of WHO,24/09/2018,995
Region of the Americas of WHO,01/10/2018,938
Region of the Americas of WHO,08/10/2018,773
Region of the Americas of WHO,15/10/2018,760
Region of the Americas of WHO,22/10/2018,785
Region of the Americas of WHO,29/10/2018,554
Region of the Americas of WHO,05/11/2018,779
Region of the Americas of WHO,12/11/2018,644
Region of the Americas of WHO,19/11/2018,663
Region of the Americas of WHO,26/11/2018,617
Region of the Americas of WHO,03/12/2018,532
Region of the Americas of WHO,10/12/2018,492
Region of the Americas of WHO,17/12/2018,446
Region of the Americas of WHO,24/12/2018,366
Region of the Americas of WHO,31/12/2018,327
Region of the Americas of WHO,01/01/2018,162
Region of the Americas of WHO,08/01/2018,161
Region of the Americas of WHO,15/01/2018,139
Region of the Americas of WHO,22/01/2018,131
Region of the Americas of WHO,29/01/2018,141
Region of the Americas of WHO,05/02/2018,180
Region of the Americas of WHO,12/02/2018,162
Region of the Americas of WHO,19/02/2018,205
Region of the Americas of WHO,26/02/2018,236
Region of the Americas of WHO,05/03/2018,282
Region of the Americas of WHO,12/03/2018,204
Region of the Americas of WHO,19/03/2018,221
Region of the Americas of WHO,26/03/2018,199
Region of the Americas of WHO,02/04/2018,247
Region of the Americas of WHO,09/04/2018,276
Region of the Americas of WHO,16/04/2018,257
Region of the Americas of WHO,23/04/2018,248
Region of the Americas of WHO,30/04/2018,305
Region of the Americas of WHO,07/05/2018,320
Region of the Americas of WHO,14/05/2018,320
Region of the Americas of WHO,21/05/2018,358
Region of the Americas of WHO,28/05/2018,350
Region of the Americas of WHO,04/06/2018,362
Region of the Americas of WHO,11/06/2018,340
Region of the Americas of WHO,18/06/2018,315
Region of the Americas of WHO,25/06/2018,329
Region of the Americas of WHO,02/07/2018,339
Region of the Americas of WHO,09/07/2018,314
Region of the Americas of WHO,16/07/2018,285
Region of the Americas of WHO,23/07/2018,259
Region of the Americas of WHO,30/07/2018,209
Region of the Americas of WHO,06/08/2018,194
Region of the Americas of WHO,13/08/2018,185
Region of the Americas of WHO,20/08/2018,166
Region of the Americas of WHO,27/08/2018,170
Region of the Americas of WHO,03/09/2018,159
Region of the Americas of WHO,10/09/2018,161
Region of the Americas of WHO,17/09/2018,168
Region of the Americas of WHO,24/09/2018,154
Region of the Americas of WHO,01/10/2018,143
Region of the Americas of WHO,08/10/2018,148
Region of the Americas of WHO,15/10/2018,140
Region of the Americas of WHO,22/10/2018,143
Region of the Americas of WHO,29/10/2018,144
Region of the Americas of WHO,05/11/2018,149
Region of the Americas of WHO,12/11/2018,151
Region of the Americas of WHO,19/11/2018,151
Region of the Americas of WHO,26/11/2018,141
Region of the Americas of WHO,03/12/2018,138
Region of the Americas of WHO,10/12/2018,141
Region of the Americas of WHO,17/12/2018,142
Region of the Americas of WHO,24/12/2018,142
Region of the Americas of WHO,31/12/2018,146
Region of the Americas of WHO,01/01/2018,14
Region of the Americas of WHO,08/01/2018,53
Region of the Americas of WHO,15/01/2018,49
Region of the Americas of WHO,22/01/2018,46
Region of the Americas of WHO,29/01/2018,32
Region of the Americas of WHO,05/02/2018,36
Region of the Americas of WHO,12/02/2018,35
Region of the Americas of WHO,19/02/2018,43
Region of the Americas of WHO,26/02/2018,46
Region of the Americas of WHO,05/03/2018,51
Region of the Americas of WHO,12/03/2018,53
Region of the Americas of WHO,19/03/2018,35
Region of the Americas of WHO,26/03/2018,18
Region of the Americas of WHO,02/04/2018,40
Region of the Americas of WHO,09/04/2018,29
Region of the Americas of WHO,16/04/2018,43
Region of the Americas of WHO,23/04/2018,30
Region of the Americas of WHO,30/04/2018,29
Region of the Americas of WHO,07/05/2018,44
Region of the Americas of WHO,14/05/2018,44
Region of the Americas of WHO,21/05/2018,47
Region of the Americas of WHO,28/05/2018,44
Region of the Americas of WHO,04/06/2018,47
Region of the Americas of WHO,11/06/2018,34
Region of the Americas of WHO,18/06/2018,42
Region of the Americas of WHO,25/06/2018,51
Region of the Americas of WHO,02/07/2018,48
Region of the Americas of WHO,09/07/2018,34
Region of the Americas of WHO,16/07/2018,41
Region of the Americas of WHO,23/07/2018,37
Region of the Americas of WHO,30/07/2018,54
Region of the Americas of WHO,06/08/2018,38
Region of the Americas of WHO,13/08/2018,38
Region of the Americas of WHO,20/08/2018,60
Region of the Americas of WHO,27/08/2018,65
Region of the Americas of WHO,03/09/2018,48
Region of the Americas of WHO,10/09/2018,32
Region of the Americas of WHO,17/09/2018,49
Region of the Americas of WHO,24/09/2018,40
Region of the Americas of WHO,01/10/2018,33
Region of the Americas of WHO,08/10/2018,37
Region of the Americas of WHO,15/10/2018,52
Region of the Americas of WHO,22/10/2018,45
Region of the Americas of WHO,29/10/2018,41
Region of the Americas of WHO,05/11/2018,49
Region of the Americas of WHO,12/11/2018,63
Region of the Americas of WHO,19/11/2018,49
Region of the Americas of WHO,26/11/2018,75
Region of the Americas of WHO,03/12/2018,43
Region of the Americas of WHO,10/12/2018,81
Region of the Americas of WHO,17/12/2018,58
Region of the Americas of WHO,31/12/2018,16
Region of the Americas of WHO,01/01/2018,24
Region of the Americas of WHO,08/01/2018,29
Region of the Americas of WHO,15/01/2018,23
Region of the Americas of WHO,22/01/2018,42
Region of the Americas of WHO,29/01/2018,23
Region of the Americas of WHO,05/02/2018,26
Region of the Americas of WHO,12/02/2018,29
Region of the Americas of WHO,19/02/2018,27
Region of the Americas of WHO,26/02/2018,38
Region of the Americas of WHO,05/03/2018,35
Region of the Americas of WHO,12/03/2018,31
Region of the Americas of WHO,19/03/2018,49
Region of the Americas of WHO,26/03/2018,57
Region of the Americas of WHO,02/04/2018,41
Region of the Americas of WHO,09/04/2018,27
Region of the Americas of WHO,16/04/2018,20
Region of the Americas of WHO,23/04/2018,17
Region of the Americas of WHO,30/04/2018,17
Region of the Americas of WHO,07/05/2018,13
Region of the Americas of WHO,14/05/2018,20
Region of the Americas of WHO,21/05/2018,21
Region of the Americas of WHO,28/05/2018,21
Region of the Americas of WHO,04/06/2018,25
Region of the Americas of WHO,11/06/2018,17
Region of the Americas of WHO,18/06/2018,19
Region of the Americas of WHO,25/06/2018,34
Region of the Americas of WHO,02/07/2018,27
Region of the Americas of WHO,09/07/2018,25
Region of the Americas of WHO,16/07/2018,15
Region of the Americas of WHO,23/07/2018,12
Region of the Americas of WHO,30/07/2018,12
Region of the Americas of WHO,06/08/2018,5
Region of the Americas of WHO,13/08/2018,3
Region of the Americas of WHO,20/08/2018,4
Region of the Americas of WHO,27/08/2018,2
Region of the Americas of WHO,03/09/2018,3
Region of the Americas of WHO,10/09/2018,11
Region of the Americas of WHO,17/09/2018,24
Region of the Americas of WHO,24/09/2018,21
Region of the Americas of WHO,01/10/2018,22
Region of the Americas of WHO,08/10/2018,15
Region of the Americas of WHO,15/10/2018,22
Region of the Americas of WHO,22/10/2018,30
Region of the Americas of WHO,29/10/2018,26
Region of the Americas of WHO,05/11/2018,28
Region of the Americas of WHO,12/11/2018,28
Region of the Americas of WHO,19/11/2018,49
Region of the Americas of WHO,26/11/2018,37
Region of the Americas of WHO,03/12/2018,31
Region of the Americas of WHO,10/12/2018,52
Region of the Americas of WHO,17/12/2018,37
Region of the Americas of WHO,24/12/2018,27
Region of the Americas of WHO,31/12/2018,9
Region of the Americas of WHO,08/01/2018,5
Region of the Americas of WHO,15/01/2018,4
Region of the Americas of WHO,22/01/2018,4
Region of the Americas of WHO,29/01/2018,5
Region of the Americas of WHO,05/02/2018,5
Region of the Americas of WHO,12/02/2018,5
Region of the Americas of WHO,19/02/2018,7
Region of the Americas of WHO,26/02/2018,8
Region of the Americas of WHO,05/03/2018,5
Region of the Americas of WHO,12/03/2018,5
Region of the Americas of WHO,19/03/2018,1
Region of the Americas of WHO,26/03/2018,5
Region of the Americas of WHO,02/04/2018,5
Region of the Americas of WHO,09/04/2018,6
Region of the Americas of WHO,16/04/2018,2
Region of the Americas of WHO,23/04/2018,1
Region of the Americas of WHO,30/04/2018,5
Region of the Americas of WHO,07/05/2018,5
Region of the Americas of WHO,14/05/2018,1
Region of the Americas of WHO,21/05/2018,5
Region of the Americas of WHO,28/05/2018,2
Region of the Americas of WHO,04/06/2018,2
Region of the Americas of WHO,25/06/2018,1
Region of the Americas of WHO,10/09/2018,2
Region of the Americas of WHO,01/10/2018,1
Region of the Americas of WHO,15/10/2018,1
Region of the Americas of WHO,22/10/2018,2
Region of the Americas of WHO,29/10/2018,3
Region of the Americas of WHO,05/11/2018,1
Region of the Americas of WHO,01/01/2018,19
Region of the Americas of WHO,08/01/2018,19
Region of the Americas of WHO,15/01/2018,31
Region of the Americas of WHO,22/01/2018,14
Region of the Americas of WHO,29/01/2018,21
Region of the Americas of WHO,05/02/2018,22
Region of the Americas of WHO,12/02/2018,20
Region of the Americas of WHO,19/02/2018,28
Region of the Americas of WHO,26/02/2018,32
Region of the Americas of WHO,05/03/2018,58
Region of the Americas of WHO,12/03/2018,13
Region of the Americas of WHO,19/03/2018,26
Region of the Americas of WHO,26/03/2018,25
Region of the Americas of WHO,02/04/2018,18
Region of the Americas of WHO,09/04/2018,25
Region of the Americas of WHO,16/04/2018,21
Region of the Americas of WHO,23/04/2018,15
Region of the Americas of WHO,30/04/2018,19
Region of the Americas of WHO,07/05/2018,16
Region of the Americas of WHO,14/05/2018,11
Region of the Americas of WHO,21/05/2018,21
Region of the Americas of WHO,28/05/2018,6
Region of the Americas of WHO,04/06/2018,12
Region of the Americas of WHO,11/06/2018,17
Region of the Americas of WHO,18/06/2018,26
Region of the Americas of WHO,25/06/2018,21
Region of the Americas of WHO,02/07/2018,15
Region of the Americas of WHO,09/07/2018,23
Region of the Americas of WHO,16/07/2018,18
Region of the Americas of WHO,23/07/2018,15
Region of the Americas of WHO,30/07/2018,29
Region of the Americas of WHO,06/08/2018,13
Region of the Americas of WHO,13/08/2018,12
Region of the Americas of WHO,20/08/2018,16
Region of the Americas of WHO,27/08/2018,20
Region of the Americas of WHO,03/09/2018,19
Region of the Americas of WHO,10/09/2018,28
Region of the Americas of WHO,17/09/2018,22
Region of the Americas of WHO,24/09/2018,21
Region of the Americas of WHO,01/10/2018,22
Region of the Americas of WHO,08/10/2018,23
Region of the Americas of WHO,15/10/2018,14
Region of the Americas of WHO,22/10/2018,19
Region of the Americas of WHO,29/10/2018,18
Region of the Americas of WHO,05/11/2018,15
Region of the Americas of WHO,12/11/2018,25
Region of the Americas of WHO,19/11/2018,21
Region of the Americas of WHO,26/11/2018,22
Region of the Americas of WHO,03/12/2018,17
Region of the Americas of WHO,10/12/2018,9
Region of the Americas of WHO,17/12/2018,13
Region of the Americas of WHO,24/12/2018,6
Region of the Americas of WHO,31/12/2018,13
Region of the Americas of WHO,01/01/2018,188
Region of the Americas of WHO,08/01/2018,257
Region of the Americas of WHO,15/01/2018,311
Region of the Americas of WHO,22/01/2018,304
Region of the Americas of WHO,29/01/2018,252
Region of the Americas of WHO,05/02/2018,180
Region of the Americas of WHO,12/02/2018,173
Region of the Americas of WHO,19/02/2018,153
Region of the Americas of WHO,26/02/2018,114
Region of the Americas of WHO,05/03/2018,122
Region of the Americas of WHO,12/03/2018,95
Region of the Americas of WHO,19/03/2018,91
Region of the Americas of WHO,26/03/2018,89
Region of the Americas of WHO,02/04/2018,87
Region of the Americas of WHO,09/04/2018,71
Region of the Americas of WHO,16/04/2018,87
Region of the Americas of WHO,23/04/2018,66
Region of the Americas of WHO,30/04/2018,66
Region of the Americas of WHO,07/05/2018,66
Region of the Americas of WHO,14/05/2018,61
Region of the Americas of WHO,21/05/2018,82
Region of the Americas of WHO,28/05/2018,83
Region of the Americas of WHO,04/06/2018,62
Region of the Americas of WHO,11/06/2018,65
Region of the Americas of WHO,18/06/2018,66
Region of the Americas of WHO,25/06/2018,37
Region of the Americas of WHO,02/07/2018,54
Region of the Americas of WHO,09/07/2018,35
Region of the Americas of WHO,16/07/2018,49
Region of the Americas of WHO,23/07/2018,52
Region of the Americas of WHO,30/07/2018,40
Region of the Americas of WHO,06/08/2018,41
Region of the Americas of WHO,13/08/2018,40
Region of the Americas of WHO,20/08/2018,27
Region of the Americas of WHO,27/08/2018,48
Region of the Americas of WHO,03/09/2018,27
Region of the Americas of WHO,10/09/2018,33
Region of the Americas of WHO,17/09/2018,38
Region of the Americas of WHO,24/09/2018,25
Region of the Americas of WHO,01/10/2018,37
Region of the Americas of WHO,08/10/2018,38
Region of the Americas of WHO,15/10/2018,38
Region of the Americas of WHO,22/10/2018,39
Region of the Americas of WHO,29/10/2018,46
Region of the Americas of WHO,05/11/2018,55
Region of the Americas of WHO,12/11/2018,54
Region of the Americas of WHO,19/11/2018,61
Region of the Americas of WHO,26/11/2018,83
Region of the Americas of WHO,03/12/2018,75
Region of the Americas of WHO,10/12/2018,93
Region of the Americas of WHO,17/12/2018,49
Region of the Americas of WHO,24/12/2018,22
Region of the Americas of WHO,31/12/2018,111
Region of the Americas of WHO,01/01/2018,19
Region of the Americas of WHO,08/01/2018,37
Region of the Americas of WHO,15/01/2018,23
Region of the Americas of WHO,22/01/2018,32
Region of the Americas of WHO,29/01/2018,30
Region of the Americas of WHO,05/02/2018,22
Region of the Americas of WHO,12/02/2018,28
Region of the Americas of WHO,19/02/2018,28
Region of the Americas of WHO,26/02/2018,30
Region of the Americas of WHO,05/03/2018,30
Region of the Americas of WHO,12/03/2018,33
Region of the Americas of WHO,19/03/2018,39
Region of the Americas of WHO,26/03/2018,8
Region of the Americas of WHO,02/04/2018,25
Region of the Americas of WHO,09/04/2018,42
Region of the Americas of WHO,16/04/2018,31
Region of the Americas of WHO,23/04/2018,23
Region of the Americas of WHO,30/04/2018,23
Region of the Americas of WHO,07/05/2018,27
Region of the Americas of WHO,14/05/2018,29
Region of the Americas of WHO,21/05/2018,23
Region of the Americas of WHO,28/05/2018,35
Region of the Americas of WHO,04/06/2018,34
Region of the Americas of WHO,11/06/2018,42
Region of the Americas of WHO,18/06/2018,40
Region of the Americas of WHO,25/06/2018,45
Region of the Americas of WHO,02/07/2018,41
Region of the Americas of WHO,09/07/2018,33
Region of the Americas of WHO,16/07/2018,43
Region of the Americas of WHO,23/07/2018,27
Region of the Americas of WHO,30/07/2018,19
Region of the Americas of WHO,06/08/2018,26
Region of the Americas of WHO,13/08/2018,38
Region of the Americas of WHO,20/08/2018,32
Region of the Americas of WHO,27/08/2018,48
Region of the Americas of WHO,03/09/2018,41
Region of the Americas of WHO,10/09/2018,45
Region of the Americas of WHO,17/09/2018,41
Region of the Americas of WHO,24/09/2018,42
Region of the Americas of WHO,01/10/2018,36
Region of the Americas of WHO,08/10/2018,34
Region of the Americas of WHO,15/10/2018,45
Region of the Americas of WHO,22/10/2018,39
Region of the Americas of WHO,29/10/2018,33
Region of the Americas of WHO,05/11/2018,39
Region of the Americas of WHO,12/11/2018,58
Region of the Americas of WHO,19/11/2018,41
Region of the Americas of WHO,26/11/2018,40
Region of the Americas of WHO,03/12/2018,25
Region of the Americas of WHO,10/12/2018,33
Region of the Americas of WHO,31/12/2018,7
Region of the Americas of WHO,01/01/2018,33
Region of the Americas of WHO,08/01/2018,25
Region of the Americas of WHO,15/01/2018,35
Region of the Americas of WHO,22/01/2018,49
Region of the Americas of WHO,29/01/2018,18
Region of the Americas of WHO,05/02/2018,23
Region of the Americas of WHO,12/02/2018,25
Region of the Americas of WHO,19/02/2018,19
Region of the Americas of WHO,26/02/2018,23
Region of the Americas of WHO,05/03/2018,15
Region of the Americas of WHO,12/03/2018,14
Region of the Americas of WHO,19/03/2018,9
Region of the Americas of WHO,26/03/2018,3
Region of the Americas of WHO,02/04/2018,3
Region of the Americas of WHO,09/04/2018,2
Region of the Americas of WHO,16/04/2018,6
Region of the Americas of WHO,23/04/2018,3
Region of the Americas of WHO,30/04/2018,2
Region of the Americas of WHO,07/05/2018,0
Region of the Americas of WHO,14/05/2018,1
Region of the Americas of WHO,21/05/2018,3
Region of the Americas of WHO,28/05/2018,7
Region of the Americas of WHO,04/06/2018,4
Region of the Americas of WHO,11/06/2018,12
Region of the Americas of WHO,18/06/2018,5
Region of the Americas of WHO,25/06/2018,3
Region of the Americas of WHO,02/07/2018,9
Region of the Americas of WHO,09/07/2018,4
Region of the Americas of WHO,16/07/2018,6
Region of the Americas of WHO,23/07/2018,1
Region of the Americas of WHO,30/07/2018,1
Region of the Americas of WHO,06/08/2018,9
Region of the Americas of WHO,13/08/2018,7
Region of the Americas of WHO,20/08/2018,5
Region of the Americas of WHO,27/08/2018,2
Region of the Americas of WHO,03/09/2018,0
Region of the Americas of WHO,10/09/2018,4
Region of the Americas of WHO,17/09/2018,3
Region of the Americas of WHO,24/09/2018,6
Region of the Americas of WHO,01/10/2018,9
Region of the Americas of WHO,08/10/2018,6
Region of the Americas of WHO,15/10/2018,10
Region of the Americas of WHO,22/10/2018,4
Region of the Americas of WHO,29/10/2018,10
Region of the Americas of WHO,05/11/2018,24
Region of the Americas of WHO,12/11/2018,8
Region of the Americas of WHO,19/11/2018,2
Region of the Americas of WHO,26/11/2018,1
Region of the Americas of WHO,03/12/2018,6
Region of the Americas of WHO,10/12/2018,8
Region of the Americas of WHO,17/12/2018,3
Region of the Americas of WHO,24/12/2018,2
Region of the Americas of WHO,31/12/2018,6
Region of the Americas of WHO,01/01/2018,7
Region of the Americas of WHO,08/01/2018,9
Region of the Americas of WHO,15/01/2018,5
Region of the Americas of WHO,22/01/2018,8
Region of the Americas of WHO,29/01/2018,6
Region of the Americas of WHO,05/02/2018,5
Region of the Americas of WHO,12/02/2018,0
Region of the Americas of WHO,19/02/2018,1
Region of the Americas of WHO,26/02/2018,2
Region of the Americas of WHO,05/03/2018,1
Region of the Americas of WHO,12/03/2018,1
Region of the Americas of WHO,19/03/2018,0
Region of the Americas of WHO,26/03/2018,0
Region of the Americas of WHO,02/04/2018,0
Region of the Americas of WHO,09/04/2018,0
Region of the Americas of WHO,16/04/2018,0
Region of the Americas of WHO,23/04/2018,0
Region of the Americas of WHO,30/04/2018,0
Region of the Americas of WHO,07/05/2018,0
Region of the Americas of WHO,14/05/2018,0
Region of the Americas of WHO,21/05/2018,0
Region of the Americas of WHO,28/05/2018,0
Region of the Americas of WHO,04/06/2018,0
Region of the Americas of WHO,11/06/2018,0
Region of the Americas of WHO,18/06/2018,0
Region of the Americas of WHO,25/06/2018,0
Region of the Americas of WHO,02/07/2018,0
Region of the Americas of WHO,09/07/2018,0
Region of the Americas of WHO,16/07/2018,0
Region of the Americas of WHO,23/07/2018,0
Region of the Americas of WHO,30/07/2018,0
Region of the Americas of WHO,06/08/2018,0
Region of the Americas of WHO,13/08/2018,0
Region of the Americas of WHO,20/08/2018,0
Region of the Americas of WHO,27/08/2018,0
Region of the Americas of WHO,03/09/2018,0
Region of the Americas of WHO,10/09/2018,0
Region of the Americas of WHO,17/09/2018,0
Region of the Americas of WHO,24/09/2018,0
Region of the Americas of WHO,01/10/2018,0
Region of the Americas of WHO,08/10/2018,0
Region of the Americas of WHO,15/10/2018,0
Region of the Americas of WHO,22/10/2018,0
Region of the Americas of WHO,29/10/2018,0
Region of the Americas of WHO,05/11/2018,0
Region of the Americas of WHO,12/11/2018,3
Region of the Americas of WHO,19/11/2018,3
Region of the Americas of WHO,26/11/2018,3
Region of the Americas of WHO,03/12/2018,3
Region of the Americas of WHO,10/12/2018,4
Region of the Americas of WHO,17/12/2018,0
Region of the Americas of WHO,24/12/2018,1
Region of the Americas of WHO,31/12/2018,0
Region of the Americas of WHO,01/01/2018,22
Region of the Americas of WHO,08/01/2018,42
Region of the Americas of WHO,15/01/2018,21
Region of the Americas of WHO,22/01/2018,51
Region of the Americas of WHO,29/01/2018,38
Region of the Americas of WHO,05/02/2018,37
Region of the Americas of WHO,12/02/2018,34
Region of the Americas of WHO,19/02/2018,41
Region of the Americas of WHO,26/02/2018,62
Region of the Americas of WHO,05/03/2018,47
Region of the Americas of WHO,12/03/2018,68
Region of the Americas of WHO,19/03/2018,48
Region of the Americas of WHO,26/03/2018,32
Region of the Americas of WHO,02/04/2018,45
Region of the Americas of WHO,09/04/2018,54
Region of the Americas of WHO,16/04/2018,53
Region of the Americas of WHO,23/04/2018,32
Region of the Americas of WHO,30/04/2018,24
Region of the Americas of WHO,07/05/2018,36
Region of the Americas of WHO,14/05/2018,39
Region of the Americas of WHO,21/05/2018,45
Region of the Americas of WHO,28/05/2018,43
Region of the Americas of WHO,04/06/2018,34
Region of the Americas of WHO,11/06/2018,27
Region of the Americas of WHO,18/06/2018,54
Region of the Americas of WHO,25/06/2018,21
Region of the Americas of WHO,02/07/2018,45
Region of the Americas of WHO,09/07/2018,34
Region of the Americas of WHO,16/07/2018,29
Region of the Americas of WHO,23/07/2018,28
Region of the Americas of WHO,30/07/2018,46
Region of the Americas of WHO,06/08/2018,61
Region of the Americas of WHO,13/08/2018,71
Region of the Americas of WHO,20/08/2018,67
Region of the Americas of WHO,27/08/2018,60
Region of the Americas of WHO,03/09/2018,35
Region of the Americas of WHO,10/09/2018,46
Region of the Americas of WHO,17/09/2018,53
Region of the Americas of WHO,24/09/2018,37
Region of the Americas of WHO,01/10/2018,30
Region of the Americas of WHO,08/10/2018,37
Region of the Americas of WHO,15/10/2018,36
Region of the Americas of WHO,22/10/2018,21
Region of the Americas of WHO,29/10/2018,20
Region of the Americas of WHO,05/11/2018,16
Region of the Americas of WHO,12/11/2018,23
Region of the Americas of WHO,19/11/2018,14
Region of the Americas of WHO,26/11/2018,23
Region of the Americas of WHO,03/12/2018,15
Region of the Americas of WHO,10/12/2018,8
Region of the Americas of WHO,17/12/2018,5
Region of the Americas of WHO,24/12/2018,7
Region of the Americas of WHO,31/12/2018,18
Region of the Americas of WHO,12/03/2018,1
Region of the Americas of WHO,01/01/2018,7
Region of the Americas of WHO,08/01/2018,15
Region of the Americas of WHO,15/01/2018,45
Region of the Americas of WHO,22/01/2018,31
Region of the Americas of WHO,29/01/2018,64
Region of the Americas of WHO,05/02/2018,41
Region of the Americas of WHO,12/02/2018,20
Region of the Americas of WHO,19/02/2018,50
Region of the Americas of WHO,26/02/2018,25
Region of the Americas of WHO,05/03/2018,64
Region of the Americas of WHO,12/03/2018,75
Region of the Americas of WHO,19/03/2018,54
Region of the Americas of WHO,26/03/2018,34
Region of the Americas of WHO,02/04/2018,66
Region of the Americas of WHO,09/04/2018,38
Region of the Americas of WHO,16/04/2018,71
Region of the Americas of WHO,23/04/2018,90
Region of the Americas of WHO,30/04/2018,74
Region of the Americas of WHO,07/05/2018,47
Region of the Americas of WHO,14/05/2018,30
Region of the Americas of WHO,21/05/2018,43
Region of the Americas of WHO,28/05/2018,22
Region of the Americas of WHO,04/06/2018,51
Region of the Americas of WHO,11/06/2018,34
Region of the Americas of WHO,18/06/2018,62
Region of the Americas of WHO,25/06/2018,53
Region of the Americas of WHO,02/07/2018,21
Region of the Americas of WHO,09/07/2018,11
Region of the Americas of WHO,16/07/2018,30
Region of the Americas of WHO,23/07/2018,58
Region of the Americas of WHO,30/07/2018,44
Region of the Americas of WHO,06/08/2018,56
Region of the Americas of WHO,13/08/2018,43
Region of the Americas of WHO,20/08/2018,25
Region of the Americas of WHO,27/08/2018,57
Region of the Americas of WHO,03/09/2018,36
Region of the Americas of WHO,10/09/2018,36
Region of the Americas of WHO,17/09/2018,49
Region of the Americas of WHO,24/09/2018,56
Region of the Americas of WHO,01/10/2018,80
Region of the Americas of WHO,08/10/2018,71
Region of the Americas of WHO,15/10/2018,86
Region of the Americas of WHO,22/10/2018,94
Region of the Americas of WHO,29/10/2018,55
Region of the Americas of WHO,05/11/2018,108
Region of the Americas of WHO,12/11/2018,116
Region of the Americas of WHO,19/11/2018,1
Region of the Americas of WHO,26/11/2018,22
Region of the Americas of WHO,03/12/2018,105
Region of the Americas of WHO,10/12/2018,120
Region of the Americas of WHO,17/12/2018,130
Region of the Americas of WHO,24/12/2018,53
Region of the Americas of WHO,31/12/2018,14
Region of the Americas of WHO,01/01/2018,26
Region of the Americas of WHO,08/01/2018,27
Region of the Americas of WHO,15/01/2018,41
Region of the Americas of WHO,22/01/2018,31
Region of the Americas of WHO,29/01/2018,21
Region of the Americas of WHO,05/02/2018,24
Region of the Americas of WHO,12/02/2018,26
Region of the Americas of WHO,19/02/2018,31
Region of the Americas of WHO,26/02/2018,36
Region of the Americas of WHO,05/03/2018,61
Region of the Americas of WHO,12/03/2018,40
Region of the Americas of WHO,19/03/2018,34
Region of the Americas of WHO,26/03/2018,35
Region of the Americas of WHO,02/04/2018,44
Region of the Americas of WHO,09/04/2018,57
Region of the Americas of WHO,16/04/2018,47
Region of the Americas of WHO,23/04/2018,35
Region of the Americas of WHO,30/04/2018,43
Region of the Americas of WHO,07/05/2018,77
Region of the Americas of WHO,14/05/2018,44
Region of the Americas of WHO,21/05/2018,42
Region of the Americas of WHO,28/05/2018,45
Region of the Americas of WHO,04/06/2018,34
Region of the Americas of WHO,11/06/2018,46
Region of the Americas of WHO,18/06/2018,35
Region of the Americas of WHO,25/06/2018,37
Region of the Americas of WHO,02/07/2018,44
Region of the Americas of WHO,09/07/2018,47
Region of the Americas of WHO,16/07/2018,29
Region of the Americas of WHO,23/07/2018,22
Region of the Americas of WHO,30/07/2018,36
Region of the Americas of WHO,06/08/2018,37
Region of the Americas of WHO,13/08/2018,38
Region of the Americas of WHO,20/08/2018,32
Region of the Americas of WHO,27/08/2018,42
Region of the Americas of WHO,03/09/2018,40
Region of the Americas of WHO,10/09/2018,34
Region of the Americas of WHO,17/09/2018,43
Region of the Americas of WHO,24/09/2018,24
Region of the Americas of WHO,01/10/2018,11
Region of the Americas of WHO,08/10/2018,47
Region of the Americas of WHO,15/10/2018,23
Region of the Americas of WHO,22/10/2018,19
Region of the Americas of WHO,29/10/2018,45
Region of the Americas of WHO,05/11/2018,65
Region of the Americas of WHO,12/11/2018,61
Region of the Americas of WHO,19/11/2018,74
Region of the Americas of WHO,26/11/2018,38
Region of the Americas of WHO,03/12/2018,55
Region of the Americas of WHO,10/12/2018,49
Region of the Americas of WHO,17/12/2018,28
Region of the Americas of WHO,24/12/2018,22
Region of the Americas of WHO,31/12/2018,41
Region of the Americas of WHO,01/01/2018,16
Region of the Americas of WHO,08/01/2018,3
Region of the Americas of WHO,15/01/2018,11
Region of the Americas of WHO,22/01/2018,26
Region of the Americas of WHO,29/01/2018,25
Region of the Americas of WHO,05/02/2018,36
Region of the Americas of WHO,12/02/2018,37
Region of the Americas of WHO,19/02/2018,33
Region of the Americas of WHO,26/02/2018,29
Region of the Americas of WHO,05/03/2018,30
Region of the Americas of WHO,12/03/2018,27
Region of the Americas of WHO,19/03/2018,16
Region of the Americas of WHO,26/03/2018,23
Region of the Americas of WHO,02/04/2018,21
Region of the Americas of WHO,09/04/2018,23
Region of the Americas of WHO,16/04/2018,26
Region of the Americas of WHO,23/04/2018,23
Region of the Americas of WHO,30/04/2018,19
Region of the Americas of WHO,07/05/2018,22
Region of the Americas of WHO,14/05/2018,33
Region of the Americas of WHO,21/05/2018,36
Region of the Americas of WHO,28/05/2018,20
Region of the Americas of WHO,04/06/2018,25
Region of the Americas of WHO,11/06/2018,27
Region of the Americas of WHO,18/06/2018,20
Region of the Americas of WHO,25/06/2018,27
Region of the Americas of WHO,02/07/2018,14
Region of the Americas of WHO,09/07/2018,23
Region of the Americas of WHO,16/07/2018,14
Region of the Americas of WHO,23/07/2018,11
Region of the Americas of WHO,30/07/2018,8
Region of the Americas of WHO,06/08/2018,11
Region of the Americas of WHO,13/08/2018,12
Region of the Americas of WHO,20/08/2018,12
Region of the Americas of WHO,27/08/2018,9
Region of the Americas of WHO,03/09/2018,8
Region of the Americas of WHO,10/09/2018,19
Region of the Americas of WHO,17/09/2018,6
Region of the Americas of WHO,24/09/2018,25
Region of the Americas of WHO,01/10/2018,17
Region of the Americas of WHO,08/10/2018,18
Region of the Americas of WHO,15/10/2018,29
Region of the Americas of WHO,22/10/2018,24
Region of the Americas of WHO,29/10/2018,30
Region of the Americas of WHO,05/11/2018,22
Region of the Americas of WHO,12/11/2018,16
Region of the Americas of WHO,19/11/2018,56
Region of the Americas of WHO,26/11/2018,34
Region of the Americas of WHO,03/12/2018,32
Region of the Americas of WHO,10/12/2018,36
Region of the Americas of WHO,17/12/2018,21
Region of the Americas of WHO,31/12/2018,23
Region of the Americas of WHO,01/01/2018,13
Region of the Americas of WHO,08/01/2018,8
Region of the Americas of WHO,15/01/2018,20
Region of the Americas of WHO,22/01/2018,16
Region of the Americas of WHO,29/01/2018,23
Region of the Americas of WHO,05/02/2018,16
Region of the Americas of WHO,12/02/2018,19
Region of the Americas of WHO,19/02/2018,20
Region of the Americas of WHO,26/02/2018,18
Region of the Americas of WHO,05/03/2018,14
Region of the Americas of WHO,12/03/2018,8
Region of the Americas of WHO,19/03/2018,2
Region of the Americas of WHO,26/03/2018,1
Region of the Americas of WHO,02/04/2018,3
Region of the Americas of WHO,09/04/2018,0
Region of the Americas of WHO,16/04/2018,0
Region of the Americas of WHO,23/04/2018,3
Region of the Americas of WHO,30/04/2018,0
Region of the Americas of WHO,07/05/2018,0
Region of the Americas of WHO,14/05/2018,0
Region of the Americas of WHO,21/05/2018,0
Region of the Americas of WHO,28/05/2018,0
Region of the Americas of WHO,04/06/2018,0
Region of the Americas of WHO,11/06/2018,0
Region of the Americas of WHO,18/06/2018,0
Region of the Americas of WHO,25/06/2018,0
Region of the Americas of WHO,02/07/2018,0
Region of the Americas of WHO,09/07/2018,0
Region of the Americas of WHO,16/07/2018,0
Region of the Americas of WHO,23/07/2018,0
Region of the Americas of WHO,30/07/2018,0
Region of the Americas of WHO,06/08/2018,0
Region of the Americas of WHO,13/08/2018,0
Region of the Americas of WHO,20/08/2018,0
Region of the Americas of WHO,27/08/2018,0
Region of the Americas of WHO,03/09/2018,0
Region of the Americas of WHO,10/09/2018,1
Region of the Americas of WHO,17/09/2018,0
Region of the Americas of WHO,24/09/2018,0
Region of the Americas of WHO,01/10/2018,0
Region of the Americas of WHO,08/10/2018,0
Region of the Americas of WHO,15/10/2018,0
Region of the Americas of WHO,22/10/2018,0
Region of the Americas of WHO,29/10/2018,0
Region of the Americas of WHO,05/11/2018,0
Region of the Americas of WHO,12/11/2018,2
Region of the Americas of WHO,19/11/2018,0
Region of the Americas of WHO,26/11/2018,1
Region of the Americas of WHO,03/12/2018,1
Region of the Americas of WHO,10/12/2018,2
Region of the Americas of WHO,17/12/2018,1
Region of the Americas of WHO,24/12/2018,0
Region of the Americas of WHO,31/12/2018,1
Region of the Americas of WHO,01/01/2018,589
Region of the Americas of WHO,08/01/2018,770
Region of the Americas of WHO,15/01/2018,918
Region of the Americas of WHO,22/01/2018,882
Region of the Americas of WHO,29/01/2018,711
Region of the Americas of WHO,05/02/2018,784
Region of the Americas of WHO,12/02/2018,666
Region of the Americas of WHO,19/02/2018,661
Region of the Americas of WHO,26/02/2018,613
Region of the Americas of WHO,05/03/2018,595
Region of the Americas of WHO,12/03/2018,493
Region of the Americas of WHO,19/03/2018,453
Region of the Americas of WHO,26/03/2018,338
Region of the Americas of WHO,02/04/2018,352
Region of the Americas of WHO,09/04/2018,324
Region of the Americas of WHO,16/04/2018,317
Region of the Americas of WHO,23/04/2018,278
Region of the Americas of WHO,30/04/2018,276
Region of the Americas of WHO,07/05/2018,270
Region of the Americas of WHO,14/05/2018,273
Region of the Americas of WHO,21/05/2018,250
Region of the Americas of WHO,28/05/2018,265
Region of the Americas of WHO,04/06/2018,257
Region of the Americas of WHO,11/06/2018,227
Region of the Americas of WHO,18/06/2018,238
Region of the Americas of WHO,25/06/2018,265
Region of the Americas of WHO,02/07/2018,352
Region of the Americas of WHO,09/07/2018,440
Region of the Americas of WHO,16/07/2018,365
Region of the Americas of WHO,23/07/2018,307
Region of the Americas of WHO,30/07/2018,244
Region of the Americas of WHO,06/08/2018,250
Region of the Americas of WHO,13/08/2018,208
Region of the Americas of WHO,20/08/2018,206
Region of the Americas of WHO,27/08/2018,218
Region of the Americas of WHO,03/09/2018,309
Region of the Americas of WHO,10/09/2018,311
Region of the Americas of WHO,17/09/2018,364
Region of the Americas of WHO,24/09/2018,348
Region of the Americas of WHO,01/10/2018,451
Region of the Americas of WHO,08/10/2018,491
Region of the Americas of WHO,15/10/2018,514
Region of the Americas of WHO,22/10/2018,583
Region of the Americas of WHO,29/10/2018,662
Region of the Americas of WHO,05/11/2018,712
Region of the Americas of WHO,12/11/2018,642
Region of the Americas of WHO,19/11/2018,824
Region of the Americas of WHO,26/11/2018,919
Region of the Americas of WHO,03/12/2018,941
Region of the Americas of WHO,10/12/2018,988
Region of the Americas of WHO,17/12/2018,687
Region of the Americas of WHO,24/12/2018,213
Region of the Americas of WHO,31/12/2018,1194
Region of the Americas of WHO,01/01/2018,47
Region of the Americas of WHO,08/01/2018,49
Region of the Americas of WHO,15/01/2018,43
Region of the Americas of WHO,22/01/2018,48
Region of the Americas of WHO,29/01/2018,79
Region of the Americas of WHO,05/02/2018,64
Region of the Americas of WHO,12/02/2018,78
Region of the Americas of WHO,19/02/2018,109
Region of the Americas of WHO,26/02/2018,86
Region of the Americas of WHO,05/03/2018,114
Region of the Americas of WHO,12/03/2018,68
Region of the Americas of WHO,19/03/2018,53
Region of the Americas of WHO,26/03/2018,65
Region of the Americas of WHO,02/04/2018,90
Region of the Americas of WHO,09/04/2018,81
Region of the Americas of WHO,16/04/2018,82
Region of the Americas of WHO,23/04/2018,61
Region of the Americas of WHO,30/04/2018,75
Region of the Americas of WHO,07/05/2018,74
Region of the Americas of WHO,14/05/2018,62
Region of the Americas of WHO,21/05/2018,81
Region of the Americas of WHO,28/05/2018,69
Region of the Americas of WHO,04/06/2018,73
Region of the Americas of WHO,11/06/2018,67
Region of the Americas of WHO,18/06/2018,56
Region of the Americas of WHO,25/06/2018,59
Region of the Americas of WHO,02/07/2018,61
Region of the Americas of WHO,09/07/2018,55
Region of the Americas of WHO,16/07/2018,46
Region of the Americas of WHO,23/07/2018,104
Region of the Americas of WHO,30/07/2018,106
Region of the Americas of WHO,06/08/2018,98
Region of the Americas of WHO,13/08/2018,135
Region of the Americas of WHO,20/08/2018,279
Region of the Americas of WHO,27/08/2018,528
Region of the Americas of WHO,03/09/2018,482
Region of the Americas of WHO,10/09/2018,427
Region of the Americas of WHO,17/09/2018,326
Region of the Americas of WHO,24/09/2018,433
Region of the Americas of WHO,01/10/2018,296
Region of the Americas of WHO,08/10/2018,375
Region of the Americas of WHO,15/10/2018,449
Region of the Americas of WHO,22/10/2018,401
Region of the Americas of WHO,29/10/2018,349
Region of the Americas of WHO,05/11/2018,303
Region of the Americas of WHO,12/11/2018,265
Region of the Americas of WHO,19/11/2018,239
Region of the Americas of WHO,26/11/2018,219
Region of the Americas of WHO,03/12/2018,469
Region of the Americas of WHO,10/12/2018,212
Region of the Americas of WHO,17/12/2018,127
Region of the Americas of WHO,24/12/2018,56
Region of the Americas of WHO,31/12/2018,133
Region of the Americas of WHO,01/01/2018,52
Region of the Americas of WHO,08/01/2018,48
Region of the Americas of WHO,15/01/2018,32
Region of the Americas of WHO,22/01/2018,41
Region of the Americas of WHO,29/01/2018,38
Region of the Americas of WHO,05/02/2018,40
Region of the Americas of WHO,12/02/2018,30
Region of the Americas of WHO,19/02/2018,34
Region of the Americas of WHO,26/02/2018,35
Region of the Americas of WHO,05/03/2018,39
Region of the Americas of WHO,12/03/2018,45
Region of the Americas of WHO,19/03/2018,46
Region of the Americas of WHO,26/03/2018,37
Region of the Americas of WHO,02/04/2018,64
Region of the Americas of WHO,09/04/2018,60
Region of the Americas of WHO,16/04/2018,62
Region of the Americas of WHO,23/04/2018,54
Region of the Americas of WHO,30/04/2018,52
Region of the Americas of WHO,07/05/2018,62
Region of the Americas of WHO,14/05/2018,56
Region of the Americas of WHO,21/05/2018,64
Region of the Americas of WHO,28/05/2018,56
Region of the Americas of WHO,04/06/2018,76
Region of the Americas of WHO,11/06/2018,54
Region of the Americas of WHO,18/06/2018,48
Region of the Americas of WHO,25/06/2018,78
Region of the Americas of WHO,02/07/2018,81
Region of the Americas of WHO,09/07/2018,65
Region of the Americas of WHO,16/07/2018,84
Region of the Americas of WHO,23/07/2018,93
Region of the Americas of WHO,30/07/2018,77
Region of the Americas of WHO,06/08/2018,108
Region of the Americas of WHO,13/08/2018,105
Region of the Americas of WHO,20/08/2018,148
Region of the Americas of WHO,27/08/2018,121
Region of the Americas of WHO,03/09/2018,128
Region of the Americas of WHO,10/09/2018,118
Region of the Americas of WHO,17/09/2018,91
Region of the Americas of WHO,24/09/2018,107
Region of the Americas of WHO,01/10/2018,102
Region of the Americas of WHO,08/10/2018,150
Region of the Americas of WHO,15/10/2018,124
Region of the Americas of WHO,22/10/2018,115
Region of the Americas of WHO,29/10/2018,110
Region of the Americas of WHO,05/11/2018,109
Region of the Americas of WHO,12/11/2018,107
Region of the Americas of WHO,19/11/2018,79
Region of the Americas of WHO,26/11/2018,90
Region of the Americas of WHO,03/12/2018,92
Region of the Americas of WHO,10/12/2018,73
Region of the Americas of WHO,17/12/2018,58
Region of the Americas of WHO,24/12/2018,44
Region of the Americas of WHO,31/12/2018,62
Region of the Americas of WHO,01/01/2018,54
Region of the Americas of WHO,08/01/2018,44
Region of the Americas of WHO,15/01/2018,62
Region of the Americas of WHO,22/01/2018,43
Region of the Americas of WHO,29/01/2018,53
Region of the Americas of WHO,05/02/2018,54
Region of the Americas of WHO,12/02/2018,39
Region of the Americas of WHO,19/02/2018,44
Region of the Americas of WHO,26/02/2018,65
Region of the Americas of WHO,05/03/2018,78
Region of the Americas of WHO,12/03/2018,81
Region of the Americas of WHO,19/03/2018,70
Region of the Americas of WHO,26/03/2018,76
Region of the Americas of WHO,02/04/2018,83
Region of the Americas of WHO,09/04/2018,97
Region of the Americas of WHO,16/04/2018,94
Region of the Americas of WHO,23/04/2018,76
Region of the Americas of WHO,30/04/2018,120
Region of the Americas of WHO,07/05/2018,99
Region of the Americas of WHO,14/05/2018,129
Region of the Americas of WHO,21/05/2018,156
Region of the Americas of WHO,28/05/2018,144
Region of the Americas of WHO,04/06/2018,180
Region of the Americas of WHO,11/06/2018,200
Region of the Americas of WHO,18/06/2018,231
Region of the Americas of WHO,25/06/2018,213
Region of the Americas of WHO,02/07/2018,235
Region of the Americas of WHO,09/07/2018,255
Region of the Americas of WHO,16/07/2018,262
Region of the Americas of WHO,23/07/2018,188
Region of the Americas of WHO,30/07/2018,209
Region of the Americas of WHO,06/08/2018,309
Region of the Americas of WHO,13/08/2018,303
Region of the Americas of WHO,20/08/2018,307
Region of the Americas of WHO,27/08/2018,237
Region of the Americas of WHO,03/09/2018,212
Region of the Americas of WHO,10/09/2018,229
Region of the Americas of WHO,17/09/2018,172
Region of the Americas of WHO,24/09/2018,134
Region of the Americas of WHO,01/10/2018,142
Region of the Americas of WHO,08/10/2018,125
Region of the Americas of WHO,15/10/2018,147
Region of the Americas of WHO,22/10/2018,133
Region of the Americas of WHO,29/10/2018,144
Region of the Americas of WHO,05/11/2018,92
Region of the Americas of WHO,12/11/2018,76
Region of the Americas of WHO,19/11/2018,74
Region of the Americas of WHO,26/11/2018,91
Region of the Americas of WHO,03/12/2018,59
Region of the Americas of WHO,10/12/2018,73
Region of the Americas of WHO,17/12/2018,65
Region of the Americas of WHO,24/12/2018,59
Region of the Americas of WHO,31/12/2018,90
Region of the Americas of WHO,01/01/2018,75
Region of the Americas of WHO,08/01/2018,33
Region of the Americas of WHO,15/01/2018,40
Region of the Americas of WHO,22/01/2018,67
Region of the Americas of WHO,29/01/2018,75
Region of the Americas of WHO,05/02/2018,75
Region of the Americas of WHO,12/02/2018,91
Region of the Americas of WHO,19/02/2018,57
Region of the Americas of WHO,26/02/2018,47
Region of the Americas of WHO,05/03/2018,38
Region of the Americas of WHO,12/03/2018,39
Region of the Americas of WHO,19/03/2018,41
Region of the Americas of WHO,26/03/2018,39
Region of the Americas of WHO,02/04/2018,52
Region of the Americas of WHO,09/04/2018,38
Region of the Americas of WHO,16/04/2018,56
Region of the Americas of WHO,23/04/2018,88
Region of the Americas of WHO,30/04/2018,89
Region of the Americas of WHO,07/05/2018,70
Region of the Americas of WHO,14/05/2018,95
Region of the Americas of WHO,21/05/2018,112
Region of the Americas of WHO,28/05/2018,202
Region of the Americas of WHO,04/06/2018,294
Region of the Americas of WHO,11/06/2018,301
Region of the Americas of WHO,18/06/2018,304
Region of the Americas of WHO,25/06/2018,406
Region of the Americas of WHO,02/07/2018,316
Region of the Americas of WHO,09/07/2018,289
Region of the Americas of WHO,16/07/2018,95
Region of the Americas of WHO,24/09/2018,43
Region of the Americas of WHO,01/10/2018,46
Region of the Americas of WHO,08/10/2018,65
Region of the Americas of WHO,15/10/2018,43
Region of the Americas of WHO,22/10/2018,26
Region of the Americas of WHO,29/10/2018,38
Region of the Americas of WHO,05/11/2018,37
Region of the Americas of WHO,12/11/2018,56
Region of the Americas of WHO,19/11/2018,46
Region of the Americas of WHO,26/11/2018,31
Region of the Americas of WHO,03/12/2018,43
Region of the Americas of WHO,10/12/2018,32
Region of the Americas of WHO,17/12/2018,37
Region of the Americas of WHO,24/12/2018,17
Region of the Americas of WHO,31/12/2018,22
Region of the Americas of WHO,15/01/2018,2
Region of the Americas of WHO,09/07/2018,1
Region of the Americas of WHO,20/08/2018,1
Region of the Americas of WHO,22/10/2018,1
Region of the Americas of WHO,05/11/2018,1
Region of the Americas of WHO,01/01/2018,3
Region of the Americas of WHO,08/01/2018,2
Region of the Americas of WHO,15/01/2018,5
Region of the Americas of WHO,22/01/2018,11
Region of the Americas of WHO,29/01/2018,4
Region of the Americas of WHO,05/02/2018,3
Region of the Americas of WHO,12/02/2018,3
Region of the Americas of WHO,19/02/2018,8
Region of the Americas of WHO,26/02/2018,8
Region of the Americas of WHO,05/03/2018,6
Region of the Americas of WHO,12/03/2018,7
Region of the Americas of WHO,19/03/2018,8
Region of the Americas of WHO,26/03/2018,4
Region of the Americas of WHO,02/04/2018,2
Region of the Americas of WHO,16/04/2018,3
Region of the Americas of WHO,23/04/2018,4
Region of the Americas of WHO,30/04/2018,2
Region of the Americas of WHO,14/05/2018,2
Region of the Americas of WHO,21/05/2018,1
Region of the Americas of WHO,28/05/2018,8
Region of the Americas of WHO,04/06/2018,4
Region of the Americas of WHO,11/06/2018,3
Region of the Americas of WHO,18/06/2018,1
Region of the Americas of WHO,02/07/2018,2
Region of the Americas of WHO,09/07/2018,1
Region of the Americas of WHO,16/07/2018,5
Region of the Americas of WHO,23/07/2018,1
Region of the Americas of WHO,30/07/2018,3
Region of the Americas of WHO,06/08/2018,2
Region of the Americas of WHO,13/08/2018,2
Region of the Americas of WHO,20/08/2018,2
Region of the Americas of WHO,27/08/2018,2
Region of the Americas of WHO,03/09/2018,3
Region of the Americas of WHO,10/09/2018,1
Region of the Americas of WHO,17/09/2018,4
Region of the Americas of WHO,24/09/2018,2
Region of the Americas of WHO,22/10/2018,1
Region of the Americas of WHO,29/10/2018,1
Region of the Americas of WHO,15/01/2018,4
Region of the Americas of WHO,12/02/2018,4
Region of the Americas of WHO,19/02/2018,3
Region of the Americas of WHO,26/02/2018,1
Region of the Americas of WHO,05/03/2018,2
Region of the Americas of WHO,12/03/2018,4
Region of the Americas of WHO,26/03/2018,1
Region of the Americas of WHO,02/04/2018,3
Region of the Americas of WHO,09/04/2018,2
Region of the Americas of WHO,03/09/2018,2
Region of the Americas of WHO,12/11/2018,4
Region of the Americas of WHO,01/01/2018,6
Region of the Americas of WHO,08/01/2018,6
Region of the Americas of WHO,15/01/2018,7
Region of the Americas of WHO,22/01/2018,9
Region of the Americas of WHO,29/01/2018,7
Region of the Americas of WHO,05/02/2018,7
Region of the Americas of WHO,12/02/2018,8
Region of the Americas of WHO,19/02/2018,7
Region of the Americas of WHO,26/02/2018,3
Region of the Americas of WHO,05/03/2018,2
Region of the Americas of WHO,12/03/2018,4
Region of the Americas of WHO,19/03/2018,6
Region of the Americas of WHO,26/03/2018,4
Region of the Americas of WHO,02/04/2018,6
Region of the Americas of WHO,09/04/2018,7
Region of the Americas of WHO,16/04/2018,6
Region of the Americas of WHO,23/04/2018,2
Region of the Americas of WHO,30/04/2018,7
Region of the Americas of WHO,07/05/2018,8
Region of the Americas of WHO,14/05/2018,5
Region of the Americas of WHO,21/05/2018,4
Region of the Americas of WHO,28/05/2018,2
Region of the Americas of WHO,04/06/2018,4
Region of the Americas of WHO,11/06/2018,8
Region of the Americas of WHO,18/06/2018,12
Region of the Americas of WHO,25/06/2018,7
Region of the Americas of WHO,02/07/2018,9
Region of the Americas of WHO,09/07/2018,11
Region of the Americas of WHO,16/07/2018,6
Region of the Americas of WHO,23/07/2018,7
Region of the Americas of WHO,30/07/2018,8
Region of the Americas of WHO,06/08/2018,7
Region of the Americas of WHO,13/08/2018,10
Region of the Americas of WHO,20/08/2018,7
Region of the Americas of WHO,27/08/2018,3
Region of the Americas of WHO,03/09/2018,6
Region of the Americas of WHO,10/09/2018,9
Region of the Americas of WHO,17/09/2018,6
Region of the Americas of WHO,24/09/2018,4
Region of the Americas of WHO,01/10/2018,6
Region of the Americas of WHO,08/10/2018,2
Region of the Americas of WHO,15/10/2018,1
Region of the Americas of WHO,22/10/2018,6
Region of the Americas of WHO,29/10/2018,7
Region of the Americas of WHO,05/11/2018,4
Region of the Americas of WHO,12/11/2018,8
Region of the Americas of WHO,19/11/2018,8
Region of the Americas of WHO,26/11/2018,3
Region of the Americas of WHO,03/12/2018,5
Region of the Americas of WHO,10/12/2018,4
Region of the Americas of WHO,17/12/2018,2
Region of the Americas of WHO,31/12/2018,7
Region of the Americas of WHO,08/01/2018,1
Region of the Americas of WHO,15/01/2018,4
Region of the Americas of WHO,29/01/2018,5
Region of the Americas of WHO,05/02/2018,1
Region of the Americas of WHO,12/02/2018,1
Region of the Americas of WHO,19/02/2018,2
Region of the Americas of WHO,26/02/2018,4
Region of the Americas of WHO,05/03/2018,2
Region of the Americas of WHO,12/03/2018,3
Region of the Americas of WHO,19/03/2018,1
Region of the Americas of WHO,16/04/2018,1
Region of the Americas of WHO,23/04/2018,2
Region of the Americas of WHO,30/04/2018,2
Region of the Americas of WHO,07/05/2018,2
Region of the Americas of WHO,21/05/2018,1
Region of the Americas of WHO,04/06/2018,1
Region of the Americas of WHO,11/06/2018,2
Region of the Americas of WHO,18/06/2018,1
Region of the Americas of WHO,25/06/2018,1
Region of the Americas of WHO,02/07/2018,1
Region of the Americas of WHO,16/07/2018,3
Region of the Americas of WHO,23/07/2018,4
Region of the Americas of WHO,30/07/2018,3
Region of the Americas of WHO,06/08/2018,3
Region of the Americas of WHO,13/08/2018,9
Region of the Americas of WHO,20/08/2018,13
Region of the Americas of WHO,27/08/2018,10
Region of the Americas of WHO,03/09/2018,18
Region of the Americas of WHO,10/09/2018,23
Region of the Americas of WHO,17/09/2018,2
Region of the Americas of WHO,24/09/2018,1
Region of the Americas of WHO,01/10/2018,2
Region of the Americas of WHO,08/10/2018,3
Region of the Americas of WHO,22/10/2018,4
Region of the Americas of WHO,29/10/2018,9
Region of the Americas of WHO,05/11/2018,11
Region of the Americas of WHO,12/11/2018,14
Region of the Americas of WHO,19/11/2018,9
Region of the Americas of WHO,18/06/2018,1
Region of the Americas of WHO,25/06/2018,1
Region of the Americas of WHO,01/01/2018,67694
Region of the Americas of WHO,08/01/2018,75166
Region of the Americas of WHO,15/01/2018,75347
Region of the Americas of WHO,22/01/2018,87183
Region of the Americas of WHO,29/01/2018,88640
Region of the Americas of WHO,05/02/2018,87821
Region of the Americas of WHO,12/02/2018,80394
Region of the Americas of WHO,19/02/2018,64484
Region of the Americas of WHO,26/02/2018,51836
Region of the Americas of WHO,05/03/2018,43972
Region of the Americas of WHO,12/03/2018,39288
Region of the Americas of WHO,19/03/2018,35156
Region of the Americas of WHO,26/03/2018,32335
Region of the Americas of WHO,02/04/2018,28954
Region of the Americas of WHO,09/04/2018,26496
Region of the Americas of WHO,16/04/2018,22326
Region of the Americas of WHO,23/04/2018,20328
Region of the Americas of WHO,30/04/2018,17895
Region of the Americas of WHO,07/05/2018,15554
Region of the Americas of WHO,14/05/2018,13456
Region of the Americas of WHO,21/05/2018,12137
Region of the Americas of WHO,28/05/2018,11048
Region of the Americas of WHO,04/06/2018,9986
Region of the Americas of WHO,11/06/2018,9203
Region of the Americas of WHO,18/06/2018,8712
Region of the Americas of WHO,25/06/2018,7917
Region of the Americas of WHO,02/07/2018,6929
Region of the Americas of WHO,09/07/2018,7127
Region of the Americas of WHO,16/07/2018,6993
Region of the Americas of WHO,23/07/2018,6944
Region of the Americas of WHO,30/07/2018,6467
Region of the Americas of WHO,06/08/2018,6942
Region of the Americas of WHO,13/08/2018,7217
Region of the Americas of WHO,20/08/2018,8002
Region of the Americas of WHO,27/08/2018,8927
Region of the Americas of WHO,03/09/2018,10074
Region of the Americas of WHO,10/09/2018,12351
Region of the Americas of WHO,17/09/2018,13259
Region of the Americas of WHO,24/09/2018,14017
Region of the Americas of WHO,01/10/2018,17285
Region of the Americas of WHO,08/10/2018,18878
Region of the Americas of WHO,15/10/2018,21214
Region of the Americas of WHO,22/10/2018,22391
Region of the Americas of WHO,29/10/2018,23498
Region of the Americas of WHO,05/11/2018,24610
Region of the Americas of WHO,12/11/2018,25681
Region of the Americas of WHO,19/11/2018,25612
Region of the Americas of WHO,26/11/2018,29735
Region of the Americas of WHO,03/12/2018,30463
Region of the Americas of WHO,10/12/2018,34960
Region of the Americas of WHO,17/12/2018,40554
Region of the Americas of WHO,24/12/2018,45340
Region of the Americas of WHO,31/12/2018,46494
Region of the Americas of WHO,01/01/2018,2
Region of the Americas of WHO,08/01/2018,6
Region of the Americas of WHO,15/01/2018,5
Region of the Americas of WHO,22/01/2018,2
Region of the Americas of WHO,29/01/2018,6
Region of the Americas of WHO,05/02/2018,2
Region of the Americas of WHO,12/02/2018,4
Region of the Americas of WHO,19/02/2018,7
Region of the Americas of WHO,26/02/2018,6
Region of the Americas of WHO,05/03/2018,7
Region of the Americas of WHO,12/03/2018,12
Region of the Americas of WHO,19/03/2018,9
Region of the Americas of WHO,26/03/2018,4
Region of the Americas of WHO,02/04/2018,7
Region of the Americas of WHO,09/04/2018,10
Region of the Americas of WHO,16/04/2018,9
Region of the Americas of WHO,23/04/2018,14
Region of the Americas of WHO,30/04/2018,4
Region of the Americas of WHO,07/05/2018,21
Region of the Americas of WHO,14/05/2018,20
Region of the Americas of WHO,21/05/2018,42
Region of the Americas of WHO,28/05/2018,43
Region of the Americas of WHO,04/06/2018,28
Region of the Americas of WHO,11/06/2018,44
Region of the Americas of WHO,18/06/2018,56
Region of the Americas of WHO,25/06/2018,53
Region of the Americas of WHO,02/07/2018,35
Region of the Americas of WHO,09/07/2018,54
Region of the Americas of WHO,16/07/2018,37
Region of the Americas of WHO,23/07/2018,35
Region of the Americas of WHO,30/07/2018,52
Region of the Americas of WHO,06/08/2018,65
Region of the Americas of WHO,13/08/2018,57
Region of the Americas of WHO,20/08/2018,55
Region of the Americas of WHO,27/08/2018,52
Region of the Americas of WHO,03/09/2018,42
Region of the Americas of WHO,10/09/2018,56
Region of the Americas of WHO,17/09/2018,15
Region of the Americas of WHO,24/09/2018,12
Region of the Americas of WHO,01/10/2018,11
Region of the Americas of WHO,08/10/2018,17
Region of the Americas of WHO,15/10/2018,15
Region of the Americas of WHO,22/10/2018,9
Region of the Americas of WHO,29/10/2018,7
Region of the Americas of WHO,05/11/2018,7
Region of the Americas of WHO,12/11/2018,7
Region of the Americas of WHO,19/11/2018,13
Region of the Americas of WHO,01/01/2018,5
Region of the Americas of WHO,08/01/2018,5
Region of the Americas of WHO,15/01/2018,13
Region of the Americas of WHO,22/01/2018,2
Region of the Americas of WHO,29/01/2018,4
Region of the Americas of WHO,05/02/2018,1
Region of the Americas of WHO,12/02/2018,5
Region of the Americas of WHO,19/02/2018,7
Region of the Americas of WHO,26/02/2018,6
Region of the Americas of WHO,05/03/2018,17
Region of the Americas of WHO,12/03/2018,5
Region of the Americas of WHO,19/03/2018,2
Region of the Americas of WHO,26/03/2018,6
Region of the Americas of WHO,02/04/2018,8
Region of the Americas of WHO,09/04/2018,11
Region of the Americas of WHO,16/04/2018,16
Region of the Americas of WHO,23/04/2018,18
Region of the Americas of WHO,30/04/2018,24
Region of the Americas of WHO,07/05/2018,15
Region of the Americas of WHO,14/05/2018,14
Region of the Americas of WHO,21/05/2018,18
Region of the Americas of WHO,28/05/2018,25
Region of the Americas of WHO,04/06/2018,24
Region of the Americas of WHO,11/06/2018,15
Region of the Americas of WHO,18/06/2018,9
Region of the Americas of WHO,25/06/2018,8
Region of the Americas of WHO,02/07/2018,17
Region of the Americas of WHO,09/07/2018,9
Region of the Americas of WHO,16/07/2018,4
Region of the Americas of WHO,23/07/2018,3
Region of the Americas of WHO,30/07/2018,3
Region of the Americas of WHO,06/08/2018,3
Region of the Americas of WHO,13/08/2018,5
Region of the Americas of WHO,20/08/2018,8
Region of the Americas of WHO,27/08/2018,5
Region of the Americas of WHO,03/09/2018,5
Region of the Americas of WHO,10/09/2018,4
Region of the Americas of WHO,17/09/2018,14
Region of the Americas of WHO,24/09/2018,5
Region of the Americas of WHO,01/10/2018,10
Region of the Americas of WHO,08/10/2018,6
Region of the Americas of WHO,15/10/2018,8
Region of the Americas of WHO,22/10/2018,14
Region of the Americas of WHO,29/10/2018,21
Region of the Americas of WHO,05/11/2018,17
Region of the Americas of WHO,12/11/2018,15
Region of the Americas of WHO,19/11/2018,20
Region of the Americas of WHO,26/11/2018,14
Region of the Americas of WHO,03/12/2018,12
Region of the Americas of WHO,10/12/2018,6
Region of the Americas of WHO,17/12/2018,2
Region of the Americas of WHO,31/12/2018,5
