PatientID,Timestamp,DOB,Gender,Pregnancy,Haemoglobin
1023235,01/07/2018 10:09,02/03/2012,male,nA,120
3024920,14/03/2017 05:02,27/09/1964,female,No,101
4502840,04/01/2018 15:30,12/05/1986,female,y,105
4248234,07/04/2018 01:43,05/04/2004,female,no,75
7583409,11/11/2018 17:03,19/11/1984,male,NA,145
3023750,11/12/2018 20:30,29/12/2007,male,NA,88
3589340,08/12/2018 02:44,15/11/2006,female,No,110
3888304,04/01/2019 07:34,18/03/2018,female,NA,65
4118234,14/01/2019 02:23,18/02/2004,female,no,90
4502840,26/01/2018 11:03,03/02/1986,female,y,98
4127849,13/01/2019 03:05,03/06/1996,male,Y,120
1248940,13/01/2019 03:15,03/01/1996,male,NA,200
1249201,25/01/2019 05:01,04/12/1964,male,NA,1000
1238410,26/03/2019 04:01,04/12/1825,male,NA,120
1245588,26/03/2019 13:12,04/12/1995,male,NA,2
1295019,21/06/2018 15:12,01/06/1931,female,Y,110
1256905,21/12/2018 16:17,01/04/2018,female,nO,120
