('Start Date', 'End Date', 'Number of Infections')
(('01/01/2018', '07/01/2018'), 6826)
(('08/01/2018', '14/01/2018'), 7883)
(('15/01/2018', '21/01/2018'), 9070)
(('22/01/2018', '28/01/2018'), 8417)
(('29/01/2018', '04/02/2018'), 7523)
(('05/02/2018', '11/02/2018'), 6944)
(('12/02/2018', '18/02/2018'), 5540)
(('19/02/2018', '25/02/2018'), 5423)
(('26/02/2018', '04/03/2018'), 4187)
(('05/03/2018', '11/03/2018'), 3721)
(('12/03/2018', '18/03/2018'), 2809)
(('19/03/2018', '25/03/2018'), 1967)
(('26/03/2018', '01/04/2018'), 1385)
(('02/04/2018', '08/04/2018'), 863)
(('09/04/2018', '15/04/2018'), 688)
(('16/04/2018', '22/04/2018'), 568)
(('23/04/2018', '29/04/2018'), 463)
(('30/04/2018', '06/05/2018'), 388)
(('07/05/2018', '13/05/2018'), 349)
(('14/05/2018', '20/05/2018'), 315)
(('21/05/2018', '27/05/2018'), 262)
(('28/05/2018', '03/06/2018'), 262)
(('04/06/2018', '10/06/2018'), 225)
(('11/06/2018', '17/06/2018'), 267)
(('18/06/2018', '24/06/2018'), 259)
(('25/06/2018', '01/07/2018'), 235)
(('02/07/2018', '08/07/2018'), 296)
(('09/07/2018', '15/07/2018'), 345)
(('16/07/2018', '22/07/2018'), 326)
(('23/07/2018', '29/07/2018'), 344)
(('30/07/2018', '05/08/2018'), 285)
(('06/08/2018', '12/08/2018'), 337)
(('13/08/2018', '19/08/2018'), 412)
(('20/08/2018', '26/08/2018'), 445)
(('27/08/2018', '02/09/2018'), 449)
(('03/09/2018', '09/09/2018'), 472)
(('10/09/2018', '16/09/2018'), 831)
(('17/09/2018', '23/09/2018'), 533)
(('24/09/2018', '30/09/2018'), 473)
(('01/10/2018', '07/10/2018'), 482)
(('08/10/2018', '14/10/2018'), 367)
(('15/10/2018', '21/10/2018'), 329)
(('22/10/2018', '28/10/2018'), 385)
(('29/10/2018', '04/11/2018'), 469)
(('05/11/2018', '11/11/2018'), 604)
(('12/11/2018', '18/11/2018'), 699)
(('19/11/2018', '25/11/2018'), 1033)
(('26/11/2018', '02/12/2018'), 1385)
(('03/12/2018', '09/12/2018'), 1711)
(('10/12/2018', '16/12/2018'), 2149)
(('17/12/2018', '23/12/2018'), 3468)
(('24/12/2018', '30/12/2018'), 4063)
(('31/12/2018', '06/01/2019'), 5264)
