4.857957313413120000e+14 1.430510997772216797e+00
1.215197914071040000e+15 3.834148168563842773e+00
1.337387720376320000e+15 9.009904265403747559e-01
2.121454535573504000e+15 1.970758676528930664e+00
2.165586398281728000e+15 2.333092451095581055e+00
2.286840572805120000e+15 6.153561472892761230e-01
2.463818726768640000e+15 1.062570095062255859e+01
2.607733954052096000e+15 1.671273946762084961e+00
2.629729823752192000e+15 3.801452398300170898e+00
2.629730629058560000e+15 1.337367177009582520e+00
3.148901443960832000e+15 1.598122954368591309e+00
3.215795559596032000e+15 3.631719589233398438e+00
3.259917758627840000e+15 2.502398252487182617e+00
3.270706179604480000e+15 3.312137365341186523e+00
3.491566014431232000e+15 1.799071192741394043e+00
3.502619381202944000e+15 2.629909276962280273e+00
4.154600517009408000e+15 1.871051430702209473e+00
4.718409732325376000e+15 3.104356288909912109e+00
4.740155151745024000e+15 2.254519224166870117e+00
5.049853969170432000e+15 4.971651077270507812e+00
5.358926258241536000e+15 2.517127275466918945e+00
5.679600327720960000e+15 4.395959377288818359e+00
5.679689448292352000e+15 3.222735166549682617e+00
5.734436859543552000e+15 3.918426275253295898e+00
5.878145391525888000e+15 3.570710659027099609e+00
5.988957695246336000e+15 4.063630580902099609e+00
6.253877720514560000e+15 2.480753660202026367e+00
6.386790315327488000e+15 3.617743015289306641e+00
6.419320934498304000e+15 2.908915996551513672e+00
6.773665936965632000e+15 3.657436847686767578e+00
6.784735141429248000e+15 4.188339710235595703e+00
6.850394453966848000e+15 4.902227878570556641e+00
7.005230709342208000e+15 3.626045465469360352e+00
7.016451311403008000e+15 3.074058771133422852e+00
7.325462934061056000e+15 5.663204669952392578e+00
7.359150510047232000e+15 6.804024219512939453e+00
7.502371563241472000e+15 4.895896911621093750e+00
7.590784001900544000e+15 3.705171108245849609e+00
7.602409404628992000e+15 4.758325576782226562e+00
7.613343854493696000e+15 4.265796661376953125e+00
7.856034739650560000e+15 4.622593402862548828e+00
8.176369506713600000e+15 5.863525867462158203e+00
8.187252416970752000e+15 4.321117401123046875e+00
8.198263102504960000e+15 5.335864067077636719e+00
8.287400316895232000e+15 3.709625244140625000e+00
8.364642082488320000e+15 5.389562606811523438e+00
8.551912857141248000e+15 4.386310577392578125e+00
8.596556357828608000e+15 6.043192863464355469e+00
8.618348485017600000e+15 5.686366558074951172e+00
8.950135782375424000e+15 4.844766139984130859e+00
9.004941712556032000e+15 6.605209827423095703e+00
9.060377392316416000e+15 5.759869098663330078e+00
9.060748906987520000e+15 4.557903289794921875e+00
9.380815238594560000e+15 6.749569416046142578e+00
9.469250762702848000e+15 4.944428443908691406e+00
9.535706791673856000e+15 8.226939201354980469e+00
9.690277295947776000e+15 6.021549701690673828e+00
9.867004462759936000e+15 1.023120594024658203e+01
9.944142075396096000e+15 5.990107536315917969e+00
1.001050576257024000e+16 7.112921714782714844e+00
1.001082895885926400e+16 4.177783012390136719e+00
1.017620882207539200e+16 5.221659660339355469e+00
1.024305569307033600e+16 4.474652290344238281e+00
1.047465214083072000e+16 7.249014854431152344e+00
1.047472193404928000e+16 1.128147983551025391e+01
1.047486796293734400e+16 9.931453704833984375e+00
1.050801007807692800e+16 6.388190269470214844e+00
1.055210758104678400e+16 7.917933940887451172e+00
1.056322295640883200e+16 7.210270881652832031e+00
1.069582362922188800e+16 7.706898689270019531e+00
1.069582899793100800e+16 1.034502887725830078e+01
1.075122333863116800e+16 7.155724525451660156e+00
1.076220449626521600e+16 6.588634967803955078e+00
1.087284500129382400e+16 1.118508529663085938e+01
1.088324633834291200e+16 9.428092956542968750e+00
1.106041159181926400e+16 7.731020450592041016e+00
1.109318863473868800e+16 9.736012458801269531e+00
1.111558366796185600e+16 1.348330783843994141e+01
1.118172294309478400e+16 9.029956817626953125e+00
1.118172831180390400e+16 1.089687538146972656e+01
1.143624377879756800e+16 1.048713588714599609e+01
1.150272450383052800e+16 4.132418632507324219e+00
1.163518559020646400e+16 9.112613677978515625e+00
1.175620810493132800e+16 1.193596744537353516e+01
1.175683517015654400e+16 1.234834384918212891e+01
1.197714873883033600e+16 6.945977687835693359e+00
1.199999259613593600e+16 6.254270076751708984e+00
1.202161131402035200e+16 1.026555824279785156e+01
1.203244966399180800e+16 6.024779319763183594e+00
1.214338330053836800e+16 9.060049057006835938e+00
1.216497410113536000e+16 1.360966491699218750e+01
1.244160650221977600e+16 5.634905338287353516e+00
1.244168810659840000e+16 9.475788116455078125e+00
1.248585218156134400e+16 8.458630561828613281e+00
1.252984445783244800e+16 7.483185291290283203e+00
1.259639712356761600e+16 8.198001861572265625e+00
1.267333287274086400e+16 9.886690139770507812e+00
1.279536685226393600e+16 8.445584297180175781e+00
1.280626103681024000e+16 8.125642776489257812e+00
1.287214798261452800e+16 9.330954551696777344e+00
1.298296565504409600e+16 7.007835865020751953e+00
1.300546376748236800e+16 1.177816867828369141e+01
1.321460397873561600e+16 8.516539573669433594e+00
1.325939834014924800e+16 8.081306457519531250e+00
1.339174024118272000e+16 9.638634681701660156e+00
1.353597920162611200e+16 7.769815444946289062e+00
1.362384779005132800e+16 2.131094551086425781e+01
1.362412266795827200e+16 7.615448474884033203e+00
1.426470415525478400e+16 2.116426467895507812e+01
1.430868032539852800e+16 9.128739356994628906e+00
1.430874904487526400e+16 7.742553710937500000e+00
1.441960966697779200e+16 8.780203819274902344e+00
1.444162566933708800e+16 1.015948772430419922e+01
1.478421695692800000e+16 7.651950359344482422e+00
1.493873162662707200e+16 1.030770301818847656e+01
1.523696663946854400e+16 7.633500099182128906e+00
1.529218273902592000e+16 7.912511348724365234e+00
1.546953911854694400e+16 9.269238471984863281e+00
1.568994825024307200e+16 1.912285232543945312e+01
1.606543683983769600e+16 7.587753772735595703e+00
1.617643060592640000e+16 7.971941471099853516e+00
1.630947043914547200e+16 6.961103439331054688e+00
1.651922375698022400e+16 2.864883613586425781e+01
1.661757528683315200e+16 8.092069625854492188e+00
1.738068682237542400e+16 9.922039031982421875e+00
1.761284913207705600e+16 8.970100402832031250e+00
1.769036362809344000e+16 1.674212074279785156e+01
1.781244377851494400e+16 2.039009857177734375e+01
1.801069517393100800e+16 1.048903083801269531e+01
1.805491293598515200e+16 1.051123332977294922e+01
1.812104039995801600e+16 1.198864173889160156e+01
1.813238126110310400e+16 1.198614501953125000e+01
1.846342016040960000e+16 1.267370223999023438e+01
1.898311335070924800e+16 1.504355525970458984e+01
1.915958711445094400e+16 1.593772125244140625e+01
1.924810424293785600e+16 1.004208374023437500e+01
1.942459733403238400e+16 1.211669635772705078e+01
1.944674648037785600e+16 9.201436042785644531e+00
1.959111536358195200e+16 1.548660755157470703e+01
1.966722862651801600e+16 1.498582267761230469e+01
2.001028913928601600e+16 1.490908336639404297e+01
2.025322107948236800e+16 1.447319793701171875e+01
2.079465754171801600e+16 1.024161052703857422e+01
2.112649100997427200e+16 1.169741344451904297e+01
2.123695112637644800e+16 1.684554672241210938e+01
2.127020061569843200e+16 2.900197219848632812e+01
2.148023954885836800e+16 1.762564086914062500e+01
2.160118368043008000e+16 1.222329330444335938e+01
2.165636756773273600e+16 1.273079109191894531e+01
2.178891240597094400e+16 1.208720970153808594e+01
2.204346438018662400e+16 2.264088058471679688e+01
2.222046857238937600e+16 1.826408004760742188e+01
2.248538859765760000e+16 1.006970405578613281e+01
2.250800804292198400e+16 1.696541976928710938e+01
2.302768190586880000e+16 1.323063182830810547e+01
2.336906308642406400e+16 1.268306255340576172e+01
2.361230426426572800e+16 2.064742088317871094e+01
2.369047696402022400e+16 1.832807731628417969e+01
2.401028237636403200e+16 1.788867759704589844e+01
2.443032158797824000e+16 1.501453208923339844e+01
2.526980730571980800e+16 1.853190803527832031e+01
2.637476280454348800e+16 2.107072830200195312e+01
2.738098130019942400e+16 2.021334075927734375e+01
2.825376804687052800e+16 1.403432178497314453e+01
2.836383302628147200e+16 1.567972278594970703e+01
3.034147863501209600e+16 1.609119606018066406e+01
3.399909640660582400e+16 3.009567642211914062e+01
