2.391463046790146250e+14 2.487275484804715997e-01
2.723591459512998750e+14 2.796790902989099714e-01
2.775315101597770625e+14 2.844609757844155373e-01
2.998925647500946875e+14 3.050236610705310270e-01
5.220932687371138750e+14 5.016713320360628448e-01
5.405670572052726250e+14 5.175162760037085308e-01
5.687880670673260000e+14 5.415984894820982110e-01
8.258026749460551250e+14 7.551023488778652037e-01
8.904823034563112500e+14 8.074347547282635373e-01
9.671516101820361250e+14 8.688530556601212762e-01
9.994870469853612500e+14 8.945685777373268976e-01
1.632048980574757750e+15 1.379571274462970232e+00
1.824733294486922500e+15 1.521796156301933545e+00
1.887878727770413250e+15 1.567945083854924038e+00
2.108841583425371000e+15 1.727790581052816465e+00
2.133964717037410000e+15 1.745811248691649276e+00
2.220044545048967500e+15 1.807330439371634734e+00
2.461719465347238000e+15 1.978280211642340580e+00
2.531813526694859500e+15 2.027400345053931741e+00
2.586479703732669000e+15 2.065572126251206342e+00
2.604530316208379000e+15 2.078150482004650801e+00
2.716112594874276500e+15 2.155626964932377820e+00
2.783400594948746500e+15 2.202122019178160528e+00
2.825649622684127000e+15 2.231230932400558586e+00
2.857179743601728000e+15 2.252912889190326506e+00
3.582280377562264500e+15 2.742498697813357644e+00
3.715377394234083500e+15 2.830648847094598075e+00
3.795711304522159000e+15 2.883618847301295585e+00
3.905064991381138000e+15 2.955447273722487278e+00
3.926320498980515000e+15 2.969372525515549643e+00
3.971278358460360500e+15 2.998787678181255245e+00
4.025951480679604000e+15 3.034489864350145005e+00
4.305218800133731000e+15 3.215701181307286216e+00
4.308635723766613500e+15 3.217906731334871484e+00
4.357547963008430500e+15 3.249448503430570234e+00
4.419725588601994500e+15 3.289464356804534084e+00
4.452799009889220000e+15 3.310713301876145209e+00
4.501246650093157500e+15 3.341794920274935965e+00
4.578111301414800000e+15 3.390999212162129517e+00
4.730378648241937000e+15 3.488087578644921027e+00
5.011264179866172000e+15 3.665892270061553049e+00
5.022754954311830000e+15 3.673131478960714791e+00
5.060381103754592000e+15 3.696817397163229657e+00
5.097073537559024000e+15 3.719888208584457789e+00
5.119861913573321000e+15 3.734203178832574022e+00
5.271883628631683000e+15 3.829437621348400711e+00
5.330649467336245000e+15 3.866131793329648847e+00
5.513424804291834000e+15 3.979842397685702249e+00
5.531808213703660000e+15 3.991244973268317509e+00
5.601351231211915000e+15 4.034324158450608877e+00
5.801967962282206000e+15 4.158111508688617342e+00
5.915681982655901000e+15 4.227962939153997901e+00
6.052816158285955000e+15 4.311906242579238935e+00
6.056636289608958000e+15 4.314240097382909589e+00
6.271102743976096000e+15 4.444877850135643627e+00
6.279333712600406000e+15 4.449876585916435090e+00
6.461234575409570000e+15 4.560069754152986654e+00
6.522199675669073000e+15 4.596884682343800321e+00
6.728801077896187000e+15 4.721218221232694745e+00
6.730436168179463000e+15 4.722199632760001542e+00
7.047270399684112000e+15 4.911620830487707146e+00
7.334337941950752000e+15 5.081996339479829317e+00
7.351530426669232000e+15 5.092163517309419518e+00
7.358161100194937000e+15 5.096083631080378318e+00
7.477657651082070000e+15 5.166627730643674532e+00
7.503624006739998000e+15 5.181931098324401574e+00
7.591887941062284000e+15 5.233881829007971831e+00
7.671228802245990000e+15 5.280491729162569925e+00
8.094505475845645000e+15 5.527765733733344788e+00
8.220286804430951000e+15 5.600807849908074232e+00
8.254364405822348000e+15 5.620563227329429701e+00
8.280276926053862000e+15 5.635575613013000584e+00
8.437445034279504000e+15 5.726455471924696283e+00
8.473171638356981000e+15 5.747072173652488125e+00
8.634551358040373000e+15 5.840009920410401456e+00
8.728933682532594000e+15 5.894222082295547338e+00
8.766507030948894000e+15 5.915774933558050286e+00
8.898536200514813000e+15 5.991380542510459151e+00
9.090925063250572000e+15 6.101195849294485107e+00
9.468508645581522000e+15 6.315527569317839429e+00
9.781421894812230000e+15 6.491989806736219393e+00
1.024184092771302800e+16 6.749798463854843611e+00
1.027331194689109200e+16 6.767342721376310877e+00
1.029635908393004000e+16 6.780184684914235760e+00
1.046879626596882600e+16 6.876102213185013134e+00
1.050256498044271200e+16 6.894852055095958221e+00
1.119500734992638400e+16 7.276947168112920750e+00
1.123157435093485200e+16 7.297001948982567043e+00
1.127058388404646800e+16 7.318383001410984079e+00
1.138739295944905200e+16 7.382324139128957796e+00
1.144332955122671400e+16 7.412900653425712250e+00
1.146280388644912200e+16 7.423539358474316785e+00
1.152096145413317200e+16 7.455290517162784347e+00
1.184535608766871600e+16 7.631851925779447932e+00
1.194453277359253400e+16 7.685650798735787603e+00
1.200746498528752000e+16 7.719745328785627692e+00
1.224177117748555200e+16 7.846391729767645984e+00
1.224716746549980600e+16 7.849303121859384724e+00
1.227784819119128400e+16 7.865851332281122765e+00
1.239645126421298000e+16 7.929749120177333133e+00
1.267298694457612600e+16 8.078288523960999612e+00
1.279266515355594400e+16 8.142382401898322186e+00
1.284202453486932200e+16 8.168783774050963231e+00
1.292475997537259800e+16 8.212994235256962483e+00
1.301420768433844000e+16 8.260731047809109384e+00
1.307131092260244800e+16 8.291173500481640701e+00
1.309891843925383200e+16 8.305882334994064919e+00
1.323205897094422000e+16 8.376734811727517993e+00
1.337966585914307800e+16 8.455127002243594703e+00
1.342014689277411200e+16 8.476597044959781613e+00
1.354957455297025800e+16 8.545159059857416750e+00
1.367002913985337200e+16 8.608855080906323565e+00
1.367149291886274400e+16 8.609628458920800753e+00
1.370813307491749400e+16 8.628981870755671579e+00
1.379910743352976000e+16 8.676991841654038140e+00
1.382638144921798000e+16 8.691373310437899846e+00
1.386395430481799000e+16 8.711176379083100940e+00
1.392120390460267200e+16 8.741330385199821862e+00
1.400207737665132200e+16 8.783886685456499421e+00
1.407339352562347600e+16 8.821374528457043951e+00
1.437143855561798600e+16 8.977649493909575895e+00
1.441363028490984400e+16 8.999721074361541895e+00
1.443038081241809400e+16 9.008480231441454933e+00
1.450911822959154400e+16 9.049627085336805266e+00
1.461943951508756600e+16 9.107206300155192835e+00
1.485862133183138200e+16 9.231751689527117222e+00
1.520492405713543600e+16 9.411386163380736747e+00
1.544722756685981200e+16 9.536597328125759887e+00
1.545570099717324200e+16 9.540968991441124203e+00
1.551196911292546600e+16 9.569987238290675435e+00
1.563880517166172600e+16 9.635322549158017225e+00
1.584366241885633000e+16 9.740627885324114388e+00
1.599954671159488000e+16 9.820578879224338920e+00
1.621591499684232200e+16 9.931296367911794931e+00
1.623372389995111600e+16 9.940396240538538208e+00
1.624840512708600800e+16 9.947896464496160718e+00
1.645065163833308400e+16 1.005108210026677718e+01
1.645556205256599400e+16 1.005358423260233280e+01
1.658887632069070200e+16 1.012145871821689802e+01
1.661838523592194800e+16 1.013646791768129596e+01
1.669534695234041600e+16 1.017558818551927935e+01
1.690400100397169800e+16 1.028146821479706574e+01
1.694707638522463200e+16 1.030329388049437611e+01
1.695748585476684800e+16 1.030856653958844937e+01
1.723394701073992200e+16 1.044836517587895841e+01
1.732419541582083200e+16 1.049390353086958427e+01
1.764910986479195200e+16 1.065745874439876317e+01
1.768170909567796400e+16 1.067383485230598161e+01
1.784187635348501800e+16 1.075420597703641334e+01
1.805136136334204400e+16 1.085910462732708126e+01
1.829371572043087200e+16 1.098015503000354265e+01
1.830687628465052400e+16 1.098671906788758079e+01
1.833906584869852800e+16 1.100277007604353052e+01
1.835912043741142400e+16 1.101276720106048579e+01
1.853827741987655600e+16 1.110197788595925417e+01
1.873786669557724000e+16 1.120115607749422182e+01
1.887335379279692400e+16 1.126835817005935958e+01
1.901844985753560400e+16 1.134021698514349019e+01
1.906269112755320800e+16 1.136210509797689205e+01
1.909808471880252800e+16 1.137960837437328543e+01
1.918386673896307600e+16 1.142200278557009696e+01
1.936226250324398000e+16 1.151004355185021488e+01
1.937786520714947600e+16 1.151773575186814469e+01
1.940708490768988400e+16 1.153213776340026619e+01
1.948162097084296400e+16 1.156885543221578239e+01
1.951149314093970800e+16 1.158356282177570584e+01
1.963514967264723200e+16 1.164439513868118681e+01
1.967361578501432800e+16 1.166330225487235950e+01
1.982142868565833600e+16 1.173588538707377893e+01
1.996167374501951200e+16 1.180464899084978292e+01
1.997794746796994000e+16 1.181262168196212947e+01
2.016303327775034800e+16 1.190320310223640021e+01
2.033437715698224000e+16 1.198690556860518441e+01
2.034971829027794400e+16 1.199439264011676798e+01
2.035723745806318000e+16 1.199806185896022726e+01
2.047893236329584400e+16 1.205740769283368508e+01
2.061247844124565600e+16 1.212244849607721697e+01
2.070588011032098400e+16 1.216788563188470285e+01
2.090112584567943200e+16 1.226272909159992430e+01
2.093439281961214400e+16 1.227887051854681211e+01
2.094935926403999200e+16 1.228613061937095274e+01
2.100846474742902800e+16 1.231479162075817335e+01
2.102105620636894000e+16 1.232089519896235252e+01
2.110567273033884000e+16 1.236189235674726028e+01
2.113945465469520800e+16 1.237825026247254634e+01
2.115949951280572800e+16 1.238795380831824211e+01
2.120425367990134800e+16 1.240961197426114637e+01
2.124770565165645600e+16 1.243063079512148938e+01
2.131330921315414400e+16 1.246234783414164760e+01
2.133391936735152400e+16 1.247230789614824431e+01
2.136042800454622800e+16 1.248511549026375533e+01
2.138237456477492400e+16 1.249571640159731523e+01
2.144035259884474400e+16 1.252371071877264619e+01
2.151593616495683200e+16 1.256018188452019402e+01
2.158637658135309200e+16 1.259414709518355480e+01
2.185056548953981200e+16 1.272132759686362746e+01
2.185762793578026400e+16 1.272472299435394305e+01
2.197265267405644800e+16 1.277999067277991863e+01
2.209098355406974400e+16 1.283678318327555168e+01
2.218490687607039200e+16 1.288181559188609704e+01
2.233904564416266000e+16 1.295563154079026091e+01
2.236187301300316400e+16 1.296655421629980864e+01
2.258914042606355200e+16 1.307517098636530761e+01
2.265817262561797200e+16 1.310811717607774973e+01
2.281302319842044800e+16 1.318194341002342007e+01
2.302879493385088000e+16 1.328463669777086054e+01
2.323329380840675600e+16 1.338177556601543472e+01
2.351835574946397200e+16 1.351687841002415702e+01
2.386650555298500000e+16 1.368140635420844120e+01
2.394581825098490800e+16 1.371881548932303829e+01
2.403520740912435200e+16 1.376094542383432540e+01
2.419029401066317200e+16 1.383395925395881676e+01
2.419392873693398400e+16 1.383566924920020291e+01
2.450069537958618400e+16 1.397979210817687878e+01
2.456447259805940400e+16 1.400970638253441614e+01
2.464681530160989600e+16 1.404830384234298357e+01
2.475778301003667200e+16 1.410027492103854030e+01
2.480977527975874400e+16 1.412460783055801272e+01
2.482302419803827200e+16 1.413080669114881793e+01
2.494067814416775600e+16 1.418582281875626627e+01
2.500502325485200800e+16 1.421588739145504476e+01
2.532138206872175600e+16 1.436345928646790071e+01
2.550845444718019600e+16 1.445053402147397925e+01
2.551807378843626400e+16 1.445500767158008237e+01
2.551816416698257200e+16 1.445504970202755857e+01
2.562073427816481600e+16 1.450272892824544080e+01
2.562474240858550800e+16 1.450459124200425798e+01
2.574490091266370800e+16 1.456039149251464870e+01
2.606508854668589200e+16 1.470880602733160458e+01
2.622579542394697600e+16 1.478314680911347523e+01
2.645028523926781200e+16 1.488682564046339429e+01
2.652880882719736000e+16 1.492304543571191289e+01
2.653136831218266800e+16 1.492422562687550958e+01
2.666930617208292800e+16 1.498779247946752058e+01
2.670910591777375200e+16 1.500612020384496681e+01
2.678740913808953200e+16 1.504216117342265591e+01
2.695777796251813600e+16 1.512049748226220025e+01
2.724340678392651200e+16 1.525158618652432807e+01
2.728878271415904400e+16 1.527238332987861824e+01
2.732802378907985600e+16 1.529036251558182435e+01
2.753674005747635200e+16 1.538589476524526845e+01
2.755122154807042800e+16 1.539251717281455889e+01
2.758465004233089600e+16 1.540780112695214399e+01
2.769599707729571200e+16 1.545868087418115699e+01
2.769838780808721600e+16 1.545977281411350646e+01
2.779976743912916000e+16 1.550605760696345747e+01
2.789598877524650400e+16 1.554995270189042778e+01
2.794268370570811200e+16 1.557124226825540525e+01
2.795288702488004400e+16 1.557589320196679061e+01
2.808349849115122800e+16 1.563539593205248579e+01
2.864446147076384000e+16 1.589025719374443746e+01
2.871882570213139600e+16 1.592395884373030945e+01
2.897049770284806800e+16 1.603787127210267371e+01
2.899154443311387200e+16 1.604738742425134390e+01
2.944354535617128000e+16 1.625138478640041839e+01
2.951524331710732800e+16 1.628367861442239573e+01
2.954465767592321600e+16 1.629692216719209696e+01
2.984405092333527200e+16 1.643155286610046772e+01
2.987961656838822400e+16 1.644752567047477143e+01
2.988480186002038400e+16 1.644985406606459222e+01
2.995044514979089200e+16 1.647932254714273270e+01
2.999511527998731600e+16 1.649936744624181628e+01
3.014367190921697600e+16 1.656598103088430207e+01
3.033741847533310400e+16 1.665274651891204982e+01
3.054878684124480400e+16 1.674726048069113560e+01
3.076221438498812400e+16 1.684254472515926793e+01
3.090582806375218400e+16 1.690657614328398850e+01
3.096523260032896400e+16 1.693304237205767038e+01
3.102245414663130000e+16 1.695852509495893656e+01
3.112989149392654400e+16 1.700634174179289104e+01
3.120120812779586800e+16 1.703806153558256042e+01
3.122336135794526800e+16 1.704791135237736910e+01
3.126347986510610400e+16 1.706574487290581743e+01
3.134662413380827600e+16 1.710268763512848622e+01
3.142654055017089200e+16 1.713817511406564265e+01
3.166536637569622000e+16 1.724410487923896440e+01
3.170314139597312000e+16 1.726084299629248164e+01
3.178400725972750400e+16 1.729665933467981631e+01
3.183553618372142400e+16 1.731947114804239973e+01
3.192766190063029600e+16 1.736023405905811856e+01
3.197106020844188800e+16 1.737942718399794728e+01
3.204429307707303600e+16 1.741180125475175089e+01
3.211169277865570400e+16 1.744158165638424762e+01
3.217207852634158000e+16 1.746825077320771413e+01
3.221059988107210400e+16 1.748525756457382485e+01
3.234001022339158800e+16 1.754235675269304551e+01
3.241008484911074400e+16 1.757325355789968313e+01
3.269538051911394800e+16 1.769888582376263386e+01
3.274633340207476800e+16 1.772129670515534627e+01
3.274849456601726800e+16 1.772224708371858171e+01
3.279932753516456800e+16 1.774459687098829974e+01
3.281426180041712000e+16 1.775116151679664966e+01
3.286422471780238400e+16 1.777311867710137250e+01
3.287598628595030000e+16 1.777828640278929484e+01
3.291873471380484000e+16 1.779706535199908046e+01
3.310557742933977600e+16 1.787907747428319993e+01
3.328667513591665200e+16 1.795846583614367376e+01
3.338299769214058000e+16 1.800065031252150050e+01
3.367293238882612800e+16 1.812745747561576337e+01
3.426081270417017200e+16 1.838380066631070520e+01
3.428176077335792800e+16 1.839291601918113983e+01
3.443751403156328800e+16 1.846064991231563823e+01
3.452282419076994400e+16 1.849771924734161743e+01
3.468715450609737200e+16 1.856906454993655942e+01
3.471673776774403600e+16 1.858189995959608964e+01
3.503195834514138000e+16 1.871850767454409237e+01
3.524231851886924400e+16 1.880951165489019417e+01
3.551539509711332000e+16 1.892745756773659593e+01
3.566123321785420400e+16 1.899035993252610055e+01
3.574617981407666000e+16 1.902697089657424101e+01
3.586127818782609200e+16 1.907654426329033370e+01
3.591380193004437600e+16 1.909915401001769908e+01
3.606508947316696800e+16 1.916423483626956781e+01
3.623692728977748800e+16 1.923807792070557809e+01
3.630215208577957600e+16 1.926608501832545528e+01
3.639225922745000000e+16 1.930475688557837444e+01
3.649343169294352800e+16 1.934815076850029314e+01
3.654917160635313600e+16 1.937204601749583688e+01
3.668017029342778400e+16 1.942817017799970003e+01
3.678473803219263200e+16 1.947293638791673587e+01
3.685962154584384800e+16 1.950497603640890532e+01
3.686734302570868800e+16 1.950827886960878388e+01
3.712697830825346400e+16 1.961924160435864195e+01
3.725660310737219200e+16 1.967457156139010266e+01
3.737509688014511200e+16 1.972511025505462712e+01
3.739248795133045600e+16 1.973252449930832597e+01
3.742499469595864800e+16 1.974638073017496609e+01
3.745580118613728000e+16 1.975950957283259513e+01
3.747981630948805600e+16 1.976974234730898772e+01
3.749976806111783200e+16 1.977824254404525917e+01
3.753616991279422400e+16 1.979374832880726487e+01
3.781469862977904800e+16 1.991227257905266868e+01
3.805685158328463200e+16 2.001514847518929230e+01
3.809479703145985600e+16 2.003125497568809266e+01
3.809528005440491200e+16 2.003145997712730875e+01
3.825455089824800000e+16 2.009902284687167295e+01
3.832534133576744800e+16 2.012903062560213741e+01
3.841785088509157600e+16 2.016822506429513595e+01
3.859562638982373600e+16 2.024348160372901617e+01
3.900024888815191200e+16 2.041445880237607824e+01
3.905300934130462400e+16 2.043672177872138818e+01
3.911091713469528800e+16 2.046114842340989171e+01
3.911211771270815200e+16 2.046165475875008610e+01
3.919644969762640800e+16 2.049721183605183583e+01
3.920244566371524800e+16 2.049973922710094953e+01
3.922116453273664800e+16 2.050762891723040582e+01
3.925299229249420000e+16 2.052104170584417275e+01
3.925380808699573600e+16 2.052138546186409584e+01
3.949409071599971200e+16 2.062256005306602447e+01
3.963597466770425600e+16 2.068223273583355848e+01
3.965428482900100000e+16 2.068992975492693631e+01
3.966204262553230400e+16 2.069319063132009973e+01
3.967989584966414400e+16 2.070069438865116851e+01
3.975562607521447200e+16 2.073251495071324513e+01
3.981146934941972800e+16 2.075596997870233906e+01
3.983287238192308800e+16 2.076495747286098492e+01
3.996550011636365600e+16 2.082062411327138207e+01
3.996815055200531200e+16 2.082173610127189178e+01
4.012671735311912000e+16 2.088823027699826440e+01
4.013671926463837600e+16 2.089242239419115421e+01
4.023828557705384800e+16 2.093497774064328354e+01
4.027812334928992800e+16 2.095166229678411085e+01
4.030699779649430400e+16 2.096375277766916057e+01
4.035648972412284000e+16 2.098447145469639707e+01
4.036309458578120000e+16 2.098723596506854960e+01
4.039450273442384000e+16 2.100038056261349340e+01
4.052455283868328800e+16 2.105478138458613202e+01
4.076256672555140800e+16 2.115423465578629347e+01
4.088846192738625600e+16 2.120678248319680037e+01
4.090175888615265600e+16 2.121233024879226647e+01
4.093329570234403200e+16 2.122548630672608994e+01
4.103772071777094400e+16 2.126903119777984230e+01
4.116902506982324800e+16 2.132374644823029897e+01
4.124818595858075200e+16 2.135671269994736221e+01
4.131119997031540000e+16 2.138294363128819597e+01
4.141815744956848800e+16 2.142744466542122694e+01
4.148824131440157600e+16 2.145658876357218503e+01
4.150020792115847200e+16 2.146156382910811189e+01
4.164959437783066400e+16 2.152364119051345170e+01
4.172581614543660800e+16 2.155529410601942075e+01
4.182997279007646400e+16 2.159852482253989692e+01
4.197003824253665600e+16 2.165661820857246767e+01
4.204245021850828800e+16 2.168663311793339687e+01
4.205060143774712000e+16 2.169001102224915911e+01
4.207833403635580000e+16 2.170150234421054236e+01
4.211382531985438400e+16 2.171620586287880172e+01
4.218120591952317600e+16 2.174411231423622937e+01
4.223962252625980800e+16 2.176829739021598797e+01
4.233570331759510400e+16 2.180805801162610180e+01
4.235808800402495200e+16 2.181731817370962645e+01
4.237813792405105600e+16 2.182561146433664589e+01
4.239322534297129600e+16 2.183185147084772382e+01
4.240436899441876000e+16 2.183646002468878677e+01
4.252365835780292800e+16 2.188577458732863334e+01
4.259935719825080000e+16 2.191705109695276121e+01
4.264605199511846400e+16 2.193633719402484772e+01
4.268901755962637600e+16 2.195407844607706593e+01
4.275179138948600000e+16 2.197999100306440567e+01
4.281436741184157600e+16 2.200581260327406241e+01
4.289042738027544000e+16 2.203718578162049013e+01
4.293136667625473600e+16 2.205406673801983786e+01
4.308540700477271200e+16 2.211754846137632313e+01
4.310631429175032000e+16 2.212616027653304940e+01
4.312089227970792000e+16 2.213216441350762409e+01
4.314218091458993600e+16 2.214093152127291830e+01
4.316704584141604800e+16 2.215117007253228465e+01
4.326933600235844800e+16 2.219327449516890383e+01
4.328245205646356000e+16 2.219867151781075520e+01
4.338377637019632000e+16 2.224035109289032164e+01
4.341570925733160800e+16 2.225348165269041445e+01
4.342346221358532000e+16 2.225666924979313066e+01
4.344736620976433600e+16 2.226649639913867773e+01
4.355708728827331200e+16 2.231158662857574981e+01
4.362749593562734400e+16 2.234050651944597377e+01
4.370461024003193600e+16 2.237216749376483094e+01
4.370518457683708000e+16 2.237240324857870988e+01
4.374918789950719200e+16 2.239046353727992056e+01
4.376694733972689600e+16 2.239775127478644023e+01
4.377401940352760000e+16 2.240065315291241532e+01
4.379514922262903200e+16 2.240932265597077588e+01
4.385036698861816800e+16 2.243197346432798156e+01
4.390971968237295200e+16 2.245631259306874838e+01
4.392541704400575200e+16 2.246274834701974754e+01
4.392600682200440000e+16 2.246299013873553108e+01
4.395621578903304000e+16 2.247537385718808522e+01
4.403501123972764800e+16 2.250766498039788033e+01
4.410323274351128800e+16 2.253561124972409146e+01
4.412886588109695200e+16 2.254610884604107568e+01
4.413483359456690400e+16 2.254855260039550657e+01
4.415854877374932000e+16 2.255826306102085610e+01
4.426609290836855200e+16 2.260228207998116545e+01
4.427560435172112800e+16 2.260617394399812952e+01
4.445636085542084800e+16 2.268009601433044153e+01
4.448112167161914400e+16 2.269021637175376327e+01
4.459007759471200800e+16 2.273473275212100120e+01
4.470076405543339200e+16 2.277992853660536454e+01
4.472024663909008800e+16 2.278788083730666614e+01
4.474436124652541600e+16 2.279772262161615259e+01
4.477217037549280000e+16 2.280907059777591428e+01
4.486557412133164000e+16 2.284717272888075001e+01
4.486894421262635200e+16 2.284854711925592952e+01
4.490009337867764800e+16 2.286124915490234599e+01
4.490237479381572000e+16 2.286217938632041324e+01
4.492842996820972000e+16 2.287280237186839216e+01
4.503511111328044800e+16 2.291628149403202030e+01
4.510038478121993600e+16 2.294287188336350880e+01
4.514340020027139200e+16 2.296038974126430077e+01
4.516745031033444800e+16 2.297018224075500470e+01
4.521370339875900000e+16 2.298901149198451677e+01
4.521418367304347200e+16 2.298920698250895711e+01
4.525536132314162400e+16 2.300596598258205461e+01
4.529930913791592800e+16 2.302384822766643069e+01
4.532568830231354400e+16 2.303457976031512189e+01
4.542909369754114400e+16 2.307663198523527726e+01
4.548404555717405600e+16 2.309896972917338687e+01
4.562800754542778400e+16 2.315745788444826658e+01
4.567960016356372800e+16 2.317840745520551238e+01
4.569111273612204000e+16 2.318308141522502552e+01
4.576694920698889600e+16 2.321386272305680620e+01
4.579599279449853600e+16 2.322564786514807622e+01
4.586262602045766400e+16 2.325267886049783073e+01
4.586784601212449600e+16 2.325479603138819584e+01
4.603217471811688000e+16 2.332141517201050007e+01
4.604429737223810400e+16 2.332632735802670965e+01
4.614893312348549600e+16 2.336871306655565306e+01
4.617458176237137600e+16 2.337909910878481767e+01
4.626336360336472800e+16 2.341503886908308019e+01
4.626745367042142400e+16 2.341669415177113223e+01
4.626893853521603200e+16 2.341729507929823129e+01
4.636070328834276800e+16 2.345442307294305095e+01
4.651926203111246400e+16 2.351853250572348131e+01
4.655408443690732800e+16 2.353260476547821867e+01
4.677779081520873600e+16 2.362294498155947409e+01
4.685371092864276000e+16 2.365357941191626168e+01
4.691320291571370400e+16 2.367757623012883528e+01
4.694756732706604800e+16 2.369143404764610494e+01
4.697871280028673600e+16 2.370399159009377499e+01
4.699841246560237600e+16 2.371193321638896379e+01
4.706767207081444000e+16 2.373984754835108646e+01
4.739868790935112800e+16 2.387311741185597214e+01
4.740357486195924000e+16 2.387508318146580777e+01
4.748442136182063200e+16 2.390759615876389077e+01
4.748691260530543200e+16 2.390859780768344578e+01
4.751488611554519200e+16 2.391984414707265927e+01
4.761194021013372000e+16 2.395885037872994161e+01
4.768085549935036800e+16 2.398653538554689035e+01
4.773267414524477600e+16 2.400734558625712012e+01
4.781809427070779200e+16 2.404163758223463887e+01
4.792617143719680000e+16 2.408500309806966655e+01
4.806257674070375200e+16 2.413969988541797562e+01
4.810263413974924000e+16 2.415575492921566081e+01
4.820233833251752000e+16 2.419570178192578069e+01
4.823901417435551200e+16 2.421039082931003250e+01
4.838917683148296000e+16 2.427050303153900757e+01
4.844329801658993600e+16 2.429215690225286650e+01
4.850999760856529600e+16 2.431883495555257468e+01
4.856684530467853600e+16 2.434156517208824155e+01
4.856713089982192800e+16 2.434167934858218985e+01
4.895133963419772800e+16 2.449512619389827961e+01
4.904040962254577600e+16 2.453065557343652614e+01
4.919780168216220000e+16 2.459339804694151255e+01
4.925446661107583200e+16 2.461597433726049289e+01
4.942173277693126400e+16 2.468257754705100737e+01
4.944013477857385600e+16 2.468990147555830461e+01
4.947097745287165600e+16 2.470217518811016433e+01
4.972145094140546400e+16 2.480177794469717156e+01
4.974863558860800000e+16 2.481258042480343207e+01
4.981595675094965600e+16 2.483932564148765110e+01
4.995394256825255200e+16 2.489411554879658084e+01
5.018898074850054400e+16 2.498735301481864823e+01
5.023779671462520000e+16 2.500670383901658766e+01
5.054817482443134400e+16 2.512962650504794482e+01
5.073323850847467200e+16 2.520282738479079754e+01
5.075984569417676800e+16 2.521334606978917847e+01
5.078223723035684000e+16 2.522219707553361445e+01
5.085917792253911200e+16 2.525260283638694148e+01
5.102437233412342400e+16 2.531784523385554664e+01
5.107467646977059200e+16 2.533770172551354705e+01
5.114154502698987200e+16 2.536408889380001241e+01
5.118854651152086400e+16 2.538263095974818029e+01
5.148966872179312000e+16 2.550131987679047896e+01
5.150320517067160800e+16 2.550665113756154057e+01
5.171806530726121600e+16 2.559122444619226044e+01
5.178923214723687200e+16 2.561921718225774569e+01
5.182629178032854400e+16 2.563379027553425260e+01
5.185914121377705600e+16 2.564670552990707364e+01
5.196272598587676800e+16 2.568741764645803727e+01
5.221915835261987200e+16 2.578811373916312988e+01
5.227808283556405600e+16 2.581123419152508092e+01
5.253742058986498400e+16 2.591291170593928328e+01
5.263276369231258400e+16 2.595025982241313400e+01
5.277362763311856000e+16 2.600540746681395277e+01
5.291152909156287200e+16 2.605935837483217199e+01
5.301761609078828000e+16 2.610083776629674546e+01
5.344722621666047200e+16 2.626859313184296951e+01
5.350012691455784800e+16 2.628922567132165611e+01
5.359569223960948000e+16 2.632648499378158391e+01
5.385262057392504800e+16 2.642657145843894639e+01
5.388204419375662400e+16 2.643802548877309988e+01
5.397694172349410400e+16 2.647495611286772998e+01
5.400375186807334400e+16 2.648538656731966867e+01
5.416691945697343200e+16 2.654883764026262227e+01
5.419514366572820000e+16 2.655980814338342100e+01
5.420857568600079200e+16 2.656502852864547748e+01
5.421834833270112800e+16 2.656882647791238838e+01
5.445954092618818400e+16 2.666250476368577083e+01
5.448835047558172800e+16 2.667368703109798389e+01
5.451224172074366400e+16 2.668295911417108002e+01
5.465897820545577600e+16 2.673988360160988620e+01
5.482370041425508800e+16 2.680373782506969960e+01
5.493973858506234400e+16 2.684868964085596943e+01
5.499425014300053600e+16 2.686979819032828232e+01
5.515462705131237600e+16 2.693186929933952101e+01
5.517408095196584000e+16 2.693939537618187430e+01
5.523275030061892800e+16 2.696208841384902044e+01
5.531968775392398400e+16 2.699570380676455272e+01
5.545072483918088000e+16 2.704634466934744808e+01
5.562774841336513600e+16 2.711470771120262668e+01
5.571253087325348800e+16 2.714742879492784766e+01
5.594352288907087200e+16 2.723651190913902198e+01
5.618974290638295200e+16 2.733136128110108132e+01
5.629919674564973600e+16 2.737349015064015489e+01
5.632983350614576000e+16 2.738527839670074115e+01
5.640672449785850400e+16 2.741485665379438075e+01
5.656838243586976800e+16 2.747700822406309129e+01
5.659974115987279200e+16 2.748905907792839898e+01
5.662321409261673600e+16 2.749807834550527730e+01
5.675692182003301600e+16 2.754943555369199615e+01
5.683872996859864000e+16 2.758084235026089104e+01
5.693076528590656000e+16 2.761616116533672027e+01
5.714561305186813600e+16 2.769855092508387884e+01
5.755929371762777600e+16 2.785695862328703853e+01
5.770468994168966400e+16 2.791256241000727201e+01
5.776202594276129600e+16 2.793447916160651801e+01
5.777440119638752000e+16 2.793920885886526051e+01
5.787373279579224000e+16 2.797716266178096589e+01
5.813425954087345600e+16 2.807662576401726540e+01
5.820196563089812000e+16 2.810245498227324390e+01
5.840679940338116800e+16 2.818054848703471293e+01
5.841717610368290400e+16 2.818450269499013316e+01
5.871851753620488800e+16 2.829925227789201969e+01
5.880705185795245600e+16 2.833293594137996152e+01
5.881820245831498400e+16 2.833717732677564172e+01
5.884137183342944000e+16 2.834598964205635951e+01
5.907648579530812000e+16 2.843536138131386792e+01
5.907865552686890400e+16 2.843618569922729122e+01
5.914830349149600000e+16 2.846264185380154998e+01
5.944817198266699200e+16 2.857645364731770954e+01
5.947898786793499200e+16 2.858814077326644210e+01
5.957163360390021600e+16 2.862326752655267370e+01
5.957445440410444800e+16 2.862433680734831398e+01
5.957481851306583200e+16 2.862447482915329644e+01
5.964848307753269600e+16 2.865239401795399132e+01
5.966980000316092800e+16 2.866047150336045135e+01
5.978900526626268000e+16 2.870562695947754150e+01
5.991293076066693600e+16 2.875254490684941544e+01
5.995547628545707200e+16 2.876864656154431188e+01
5.996009145035012000e+16 2.877039301921587011e+01
6.015914927443752000e+16 2.884568567053725019e+01
6.019046176096772800e+16 2.885752338022179586e+01
6.035770200369801600e+16 2.892072073029202173e+01
6.040247415427500800e+16 2.893763141329665700e+01
6.049934334189616000e+16 2.897420791364622517e+01
6.086466015851628000e+16 2.911200531793511459e+01
6.105939921415824000e+16 2.918536989008395466e+01
6.123065267186437600e+16 2.924983461258994666e+01
6.139454079392399200e+16 2.931148132424402064e+01
6.169483713194834400e+16 2.942432310753165581e+01
6.211669662192448000e+16 2.958259422130855754e+01
6.224620760364014400e+16 2.963112511462470167e+01
6.248841657054447200e+16 2.972181336717256173e+01
6.252647915418060800e+16 2.973605615218641063e+01
6.259713585515381600e+16 2.976248922723726054e+01
6.283031412390979200e+16 2.984966520830527514e+01
6.287998255873056000e+16 2.986822289072192405e+01
6.290544248446892000e+16 2.987773397350958504e+01
6.294192269669159200e+16 2.989136009137133243e+01
6.333838188856240800e+16 3.003930783058332921e+01
6.351564525326474400e+16 3.010537616415741624e+01
6.404632080716908800e+16 3.030286639505339963e+01
6.408948533970246400e+16 3.031891036051411348e+01
6.409664991371850400e+16 3.032157309898630260e+01
6.426488390429172800e+16 3.038407451384071223e+01
6.428303588399019200e+16 3.039081557112897869e+01
6.445647948832548000e+16 3.045520071623232994e+01
6.460465470915934400e+16 3.051016832331191964e+01
6.474785688730404800e+16 3.056325836255151174e+01
6.493048974790184800e+16 3.063092013682462422e+01
6.498136633151795200e+16 3.064975959630397639e+01
6.564408815089716000e+16 3.089479579561106704e+01
6.566957236883412800e+16 3.090420479404540544e+01
6.568059056720705600e+16 3.090827249966751822e+01
6.577445670752054400e+16 3.094291846489915088e+01
6.583528177188212000e+16 3.096536172376498186e+01
6.600544197182146400e+16 3.102811725328122705e+01
6.606578216003524800e+16 3.105036018290872235e+01
6.614680803074905600e+16 3.108021959136842938e+01
6.615158333667939200e+16 3.108197905844073006e+01
6.625350693589322400e+16 3.111952459626204970e+01
6.647136953854902400e+16 3.119972522879443844e+01
6.671010519438060000e+16 3.128752660588543932e+01
6.689489632705297600e+16 3.135542894763830191e+01
6.700496248711812800e+16 3.139584864939550357e+01
6.701367963680435200e+16 3.139904907267692735e+01
6.744704296765042400e+16 3.155800987487526399e+01
6.748479140435840000e+16 3.157184287840272674e+01
6.758179935378779200e+16 3.160738185052080951e+01
6.758308463758901600e+16 3.160785262086380243e+01
6.759996737219539200e+16 3.161403615402118206e+01
6.767600451829762400e+16 3.164188050377670791e+01
6.772997506458461600e+16 3.166163893844074195e+01
6.792668567590771200e+16 3.173361713729599742e+01
6.835036207957863200e+16 3.188844818958239458e+01
6.850356957295301600e+16 3.194437167510004016e+01
6.881654205676332800e+16 3.205850433793903420e+01
6.894042397636529600e+16 3.210364083554833314e+01
6.908743029857839200e+16 3.215717344534460409e+01
6.962259887913260000e+16 3.235178857452180523e+01
6.968019800252931200e+16 3.237270968804033089e+01
6.979710413284476800e+16 3.241515740995362904e+01
7.004653299958100000e+16 3.250565678415862436e+01
7.010137061775545600e+16 3.252554122941514692e+01
7.012333912122796800e+16 3.253350591826334437e+01
7.064437637699574400e+16 3.272220406252242952e+01
7.064569840960083200e+16 3.272268235116072788e+01
7.066646199561269600e+16 3.273019393002869037e+01
7.074687054366431200e+16 3.275927724834819088e+01
7.090472831350228000e+16 3.281634656550487250e+01
7.096930370525328800e+16 3.283968182038728401e+01
7.122643313892918400e+16 3.293254022417129789e+01
7.137464108927079200e+16 3.298602049377041823e+01
7.172634329111757600e+16 3.311280609442219003e+01
7.206547170789302400e+16 3.323489332194336043e+01
7.206891126189516800e+16 3.323613074115657184e+01
7.222963905144196800e+16 3.329393586543330485e+01
7.224894644117787200e+16 3.330087725124429454e+01
7.229448469439636800e+16 3.331724707544406527e+01
7.259421127486649600e+16 3.342491853089344289e+01
7.265632262556649600e+16 3.344721521631706196e+01
7.285731529704409600e+16 3.351933053022560927e+01
7.335769756507358400e+16 3.369862163535839272e+01
7.342552721365196800e+16 3.372289886620981036e+01
7.358064145999372800e+16 3.377839266890075720e+01
7.387942096490451200e+16 3.388519088044080974e+01
7.395862947942344000e+16 3.391348325618336190e+01
7.437095628700188800e+16 3.406062293223163806e+01
7.455510150297864000e+16 3.412626057008341007e+01
7.469125684895657600e+16 3.417476279294171349e+01
7.471056967993372800e+16 3.418164050713046720e+01
7.494853298470121600e+16 3.426634284313080769e+01
7.498384262213456000e+16 3.427890467035076227e+01
7.544324165821860800e+16 3.444218799333512493e+01
7.546944202200635200e+16 3.445149177105046334e+01
7.547497852464172800e+16 3.445345767109878921e+01
7.565257718146662400e+16 3.451649752589600695e+01
7.575059450970976000e+16 3.455127133193121125e+01
7.595470140475598400e+16 3.462364148968207900e+01
7.600201051285753600e+16 3.464040792866764207e+01
7.603799416063731200e+16 3.465315860298834139e+01
7.620831511505424000e+16 3.471348779372832638e+01
7.681771251600726400e+16 3.492902620271240721e+01
7.712777352252398400e+16 3.503850357853843178e+01
7.712781759484339200e+16 3.503851913074296931e+01
7.754219866440336000e+16 3.518463288948220935e+01
7.803213570426004800e+16 3.535709859754330608e+01
7.815314113841040000e+16 3.539964633926945226e+01
7.817724274490369600e+16 3.540811863847851981e+01
7.825741297523070400e+16 3.543629499805216909e+01
7.854627215493472000e+16 3.553774746636550930e+01
7.861684698023713600e+16 3.556251820594120261e+01
7.894509148362568000e+16 3.567764292118202007e+01
7.904955314079960000e+16 3.571425154552051140e+01
7.926538625259505600e+16 3.578984601244526687e+01
7.981095575330760000e+16 3.598066363488023001e+01
7.992459171928345600e+16 3.602036111245097061e+01
7.994302495482363200e+16 3.602679901588471978e+01
8.002234088231667200e+16 3.605449559993723341e+01
8.003225208437768000e+16 3.605795596396082203e+01
8.030195588081051200e+16 3.615207171959381327e+01
8.050025443059827200e+16 3.622121130371263575e+01
8.088922636377040000e+16 3.635668807679515879e+01
8.130144188236265600e+16 3.650005345316080962e+01
8.131368450708028800e+16 3.650430809728484149e+01
8.133753357680384000e+16 3.651259575909946165e+01
8.156731765749953600e+16 3.659241048585620604e+01
8.166965796476352000e+16 3.662793690632429389e+01
8.202523155753315200e+16 3.675126975780771232e+01
8.206172209036388800e+16 3.676391786430789210e+01
8.206441696992734400e+16 3.676485188033134932e+01
8.220786660642691200e+16 3.681455702210936920e+01
8.250416663135744000e+16 3.691714433724057898e+01
8.275320602310904000e+16 3.700328522168874201e+01
8.296684609700491200e+16 3.707712116763062937e+01
8.305979803134529600e+16 3.710922877308115631e+01
8.327087845232491200e+16 3.718210134976178693e+01
8.338791820756632000e+16 3.722248430217003090e+01
8.358930921249163200e+16 3.729193250698391893e+01
8.360345362054360000e+16 3.729680825121757692e+01
8.365243211909486400e+16 3.731368984231742303e+01
8.377597885725025600e+16 3.735626021414861242e+01
8.382045540071633600e+16 3.737158092615985083e+01
8.400189523955092800e+16 3.743405622293520452e+01
8.449486870154040000e+16 3.760360165222484596e+01
8.451862585984443200e+16 3.761176492965315532e+01
8.489945903112264000e+16 3.774253199236001421e+01
8.500057668681281600e+16 3.777722372353473190e+01
8.513739611788612800e+16 3.782414470344888002e+01
8.518196671021988800e+16 3.783942496603965822e+01
8.522044118233256000e+16 3.785261337644437418e+01
8.522666767684179200e+16 3.785474754978132239e+01
8.531490258560201600e+16 3.788498570755420758e+01
8.535040948709193600e+16 3.789715133275173287e+01
8.554533134139956800e+16 3.796391016671999807e+01
8.576206558578697600e+16 3.803808665166626213e+01
8.584143470866462400e+16 3.806523653476920543e+01
8.591135723099083200e+16 3.808914884242241072e+01
8.592037951301320000e+16 3.809223388819481215e+01
8.599313059647179200e+16 3.811710661480195483e+01
8.609034993878376000e+16 3.815033500413193934e+01
8.616127575154491200e+16 3.817456955981316469e+01
8.646196334717156800e+16 3.827724544204507851e+01
8.648583408787195200e+16 3.828539204253220873e+01
8.656667375483038400e+16 3.831297602233980371e+01
8.686178299364596800e+16 3.841360778447753432e+01
8.698797698723129600e+16 3.845660867130898453e+01
8.705705876869380800e+16 3.848014057836071800e+01
8.710203179225176000e+16 3.849545712897367622e+01
8.723084306984648000e+16 3.853931361036472936e+01
8.730004817510788800e+16 3.856286796171147557e+01
8.731239233533092800e+16 3.856706878206003353e+01
8.733202302552779200e+16 3.857374890461952788e+01
8.733622454311096000e+16 3.857517857982497134e+01
8.738946330762750400e+16 3.859329267356697812e+01
8.771343407025148800e+16 3.870345048233806295e+01
8.777878890678112000e+16 3.872565796649267611e+01
8.801261893878588800e+16 3.880507270557954058e+01
8.807714096645793600e+16 3.882697496072952248e+01
8.821493391640664000e+16 3.887373327284870328e+01
8.832527101945944000e+16 3.891115904855814733e+01
8.843955739524092800e+16 3.894990965983573261e+01
8.856124621712427200e+16 3.899115372465460183e+01
8.870063797158390400e+16 3.903837701961897722e+01
8.889410293562332800e+16 3.910388249225154311e+01
9.012281865105040000e+16 3.951892150228191269e+01
9.018490984559566400e+16 3.953984954877077485e+01
9.026222614408987200e+16 3.956590320805859307e+01
9.035427695000099200e+16 3.959691327024435736e+01
9.039046501620512000e+16 3.960910169587857865e+01
9.039272693110612800e+16 3.960986347783316575e+01
9.042650125221038400e+16 3.962123752387695674e+01
9.061656012363416000e+16 3.968521906558180490e+01
9.110175213226067200e+16 3.984837128679159690e+01
9.123482790206760000e+16 3.989307391869535024e+01
9.136254731177969600e+16 3.993595873686468423e+01
9.137853647884219200e+16 3.994132620278674040e+01
9.144923365040531200e+16 3.996505541231862679e+01
9.167461692502288000e+16 4.004066738437639117e+01
9.182188895975468800e+16 4.009004409783183576e+01
9.182797488318120000e+16 4.009208404352934707e+01
9.196654805007742400e+16 4.013852143399059713e+01
9.207725008075201600e+16 4.017560368420625849e+01
9.215790409322387200e+16 4.020261214352889567e+01
9.233941381102057600e+16 4.026336779317306735e+01
9.239135778445619200e+16 4.028074802299008184e+01
9.243568209267904000e+16 4.029557640374802929e+01
9.275214788494409600e+16 4.040138520279687384e+01
9.284289395633014400e+16 4.043170549257047952e+01
9.285956306000868800e+16 4.043727403435647005e+01
9.309774043086862400e+16 4.051680732027923426e+01
9.320152700137900800e+16 4.055144487063125780e+01
9.348739098052316800e+16 4.064678805945523266e+01
9.373754549599843200e+16 4.073014846233432706e+01
9.389883872814371200e+16 4.078386120753784638e+01
9.395828077411537600e+16 4.080364909436357834e+01
9.403258007233033600e+16 4.082837750558022805e+01
9.460081632742950400e+16 4.101730226480760422e+01
9.491960357066684800e+16 4.112313958358516430e+01
9.499759811961843200e+16 4.114901721674112878e+01
9.524971071696219200e+16 4.123262068436811489e+01
9.531654234699529600e+16 4.125477147496755492e+01
9.550541685164396800e+16 4.131734668458366144e+01
9.584937666665024000e+16 4.143120529740050983e+01
9.613707652664630400e+16 4.152634441374097918e+01
9.622179286364099200e+16 4.155434250383672889e+01
9.623026605945606400e+16 4.155714241289916799e+01
9.627522613712844800e+16 4.157199789447669502e+01
9.662878530391566400e+16 4.168874499690861768e+01
9.681418768980910400e+16 4.174991337671887237e+01
9.697858318474132800e+16 4.180412099453524633e+01
9.720074156047328000e+16 4.187733039868960105e+01
9.757812411589204800e+16 4.200157394563218816e+01
9.776230350049102400e+16 4.206215651205411632e+01
9.776684255225553600e+16 4.206364910866518869e+01
9.783757978608646400e+16 4.208690718729430102e+01
9.816915486458003200e+16 4.219585848095660197e+01
9.822580845746515200e+16 4.221446274955760458e+01
9.824660197977262400e+16 4.222129022777040319e+01
9.825946027759710400e+16 4.222551198025330166e+01
9.831384202678808000e+16 4.224336520062752953e+01
9.846174191246424000e+16 4.229190447046638468e+01
9.870795299413614400e+16 4.237265854133673315e+01
9.904295859366180800e+16 4.248243608001428129e+01
9.919003734157715200e+16 4.253059579566988901e+01
9.957531632841561600e+16 4.265664743601747233e+01
9.979959784313910400e+16 4.272995591388568926e+01
1.000249952807348000e+17 4.280357764432918799e+01
1.001581958653669600e+17 4.284706082757062973e+01
1.002321455175631360e+17 4.287119385279049055e+01
1.005863486873707360e+17 4.298670928360427723e+01
1.010154549789067360e+17 4.312648328986058743e+01
1.015524803420417760e+17 4.330114973424996805e+01
1.021070180406843520e+17 4.348120980824009507e+01
1.021735143722695200e+17 4.350278082840284100e+01
1.028073027129817920e+17 4.370815819413279968e+01
1.030845081063262240e+17 4.379786114052273405e+01
1.031058199847010720e+17 4.380475447711744152e+01
1.031086583025686080e+17 4.380567249858940215e+01
1.032268984937605600e+17 4.384390889914186573e+01
1.032299656215377120e+17 4.384490056117430612e+01
1.032586379376559680e+17 4.385417043136497739e+01
1.033002270229014720e+17 4.386761490787356621e+01
1.033014635504665120e+17 4.386801461333736540e+01
1.035483715217487360e+17 4.394779715098732709e+01
1.036469838556921440e+17 4.397964472807733216e+01
1.037082526211127360e+17 4.399942713275980566e+01
1.037821997278316160e+17 4.402329822050631947e+01
1.041031683833093920e+17 4.412684919519692528e+01
1.041616736370162400e+17 4.414571334957621218e+01
1.041648908628807360e+17 4.414675059982313599e+01
1.046384902479396000e+17 4.429933172797065311e+01
1.046614832177437280e+17 4.430673391041067077e+01
1.048499348215741600e+17 4.436738329663877067e+01
1.054166149966900960e+17 4.454955130074966974e+01
1.057215955583333760e+17 4.464746398678801143e+01
1.059312663746003040e+17 4.471472612244485845e+01
1.061678157415775040e+17 4.479056034259458841e+01
1.064594127593607840e+17 4.488396848223369773e+01
1.067511964822501280e+17 4.497735535400215667e+01
1.068338956088623040e+17 4.500380891222528135e+01
1.070101579325034880e+17 4.506016953811226244e+01
1.070305495809894080e+17 4.506668795315186316e+01
1.070324976309693280e+17 4.506731064816604260e+01
1.072093881342517120e+17 4.512383879492244887e+01
1.073480316116949120e+17 4.516812380898382884e+01
1.074674455383770880e+17 4.520625203052875207e+01
1.076328890814178880e+17 4.525905502676933878e+01
1.083267503543097760e+17 4.548022750580756224e+01
1.083760745596659200e+17 4.549593270192995220e+01
1.087679468753005120e+17 4.562062697323954552e+01
1.090290229046398720e+17 4.570362219669148374e+01
1.091473932571277920e+17 4.574123085017393464e+01
1.091582547117538560e+17 4.574468110153919298e+01
1.092844733286305280e+17 4.578476769267533797e+01
1.094922246427189440e+17 4.585071659875151084e+01
1.095764074320850880e+17 4.587742833126014119e+01
1.097527184290406080e+17 4.593335168074475661e+01
1.099218338733095840e+17 4.598696571342144068e+01
1.102693281238842560e+17 4.609704774138197791e+01
1.103671801341895040e+17 4.612802603540461632e+01
1.104654884480391360e+17 4.615913992766049745e+01
1.105892061802201120e+17 4.619828311497537499e+01
1.107618155369845280e+17 4.625287172757818155e+01
1.108300178621537920e+17 4.627443354876594128e+01
1.108394507750148640e+17 4.627741538149255263e+01
1.108398812285807520e+17 4.627755144998239700e+01
1.109342553456395840e+17 4.630737948077462107e+01
1.118590382260035680e+17 4.659923807162381593e+01
1.120413883179197920e+17 4.665669547241945736e+01
1.124705309297998560e+17 4.679179701518855694e+01
1.130860570509484160e+17 4.698528558115845044e+01
1.132751096178127680e+17 4.704464533074437327e+01
1.134292067194919520e+17 4.709300590111910623e+01
1.134672040826011040e+17 4.710492741785498083e+01
1.134958056975078560e+17 4.711390020589463035e+01
1.140521870276321600e+17 4.728830081940763108e+01
1.141160220576650080e+17 4.730829261332807079e+01
1.144021605341050400e+17 4.739786072125258443e+01
1.145358858409828800e+17 4.743969500707803633e+01
1.154554313907227520e+17 4.772693550270746954e+01
1.155718585800312640e+17 4.776325102795955502e+01
1.157342098134331680e+17 4.781387115121368225e+01
1.161609632555448640e+17 4.794682020633248953e+01
1.164713008435748960e+17 4.804340164788579415e+01
1.170836942972192960e+17 4.823374134653243317e+01
1.175525847726616320e+17 4.837925882665543753e+01
1.178978308920026240e+17 4.848628270195990808e+01
1.179799847313017920e+17 4.851173470321529635e+01
1.182955398553697600e+17 4.860944262776826719e+01
1.185557273963127200e+17 4.868994241202282325e+01
1.186659338570845600e+17 4.872402187583005428e+01
1.188595786276068960e+17 4.878387807415710853e+01
1.197786225844409600e+17 4.906752204001990947e+01
1.200579959214763680e+17 4.915360287190938493e+01
1.202509827322606880e+17 4.921302767843339154e+01
1.203457443496059680e+17 4.924219532573862068e+01
1.207546709249324320e+17 4.936797631014559329e+01
1.209567219270916320e+17 4.943007294470656632e+01
1.212494911570552960e+17 4.951998943197244074e+01
1.216466216964435680e+17 4.964184324771846946e+01
1.218111969228975520e+17 4.969230224009412211e+01
1.221290275188174720e+17 4.978968574399087288e+01
1.226999589421870720e+17 4.996440897867618958e+01
1.227218898244931520e+17 4.997111514734910287e+01
1.234364791078868160e+17 5.018940988105997292e+01
1.240592182336206240e+17 5.037930377811874649e+01
1.244005689427087840e+17 5.048325836567408942e+01
1.248222117497595360e+17 5.061153392198256995e+01
1.253149182134895200e+17 5.076124606032513498e+01
1.258289927391991360e+17 5.091724161721087683e+01
1.260223938272155360e+17 5.097587385777026014e+01
1.260361627005694080e+17 5.098004693572844559e+01
1.267593719232584320e+17 5.119902356946777644e+01
1.267644029675765120e+17 5.120054542396744779e+01
1.271180054465009120e+17 5.130745693553589604e+01
1.273895357581631200e+17 5.138948624989281200e+01
1.276854343279033280e+17 5.147881038828644051e+01
1.277114898524737600e+17 5.148667254477777533e+01
1.279071748188444000e+17 5.154570252667958385e+01
1.281090853377371680e+17 5.160657867340883342e+01
1.288822598069676480e+17 5.183939329605676960e+01
1.289401263478624160e+17 5.185679883894113118e+01
1.290006040638501920e+17 5.187498697656278068e+01
1.297232526923283840e+17 5.209209508490999951e+01
1.301176476528794080e+17 5.221041233006177862e+01
1.307271803787312160e+17 5.239303189262091109e+01
1.313096643433369600e+17 5.256727815325784547e+01
1.319400494922076960e+17 5.275555852782881772e+01
1.320526755196856480e+17 5.278916492034070274e+01
1.321050983753392960e+17 5.280480401248969002e+01
1.328995570259008800e+17 5.304155378714072100e+01
1.330448111417848960e+17 5.308478755030729701e+01
1.330487330261861920e+17 5.308595464578523604e+01
1.333407849834680000e+17 5.317283212051526675e+01
1.341292729188151840e+17 5.340706213861978569e+01
1.346558872415601120e+17 5.356323740247428589e+01
1.353573108101213280e+17 5.377093071154905601e+01
1.357361885193838880e+17 5.388296391737545576e+01
1.358752111966586720e+17 5.392404566829794987e+01
1.359069696056615520e+17 5.393342837917744959e+01
1.359225085924812800e+17 5.393801894641698880e+01
1.373259911531729280e+17 5.435189891024029407e+01
1.377177366109782720e+17 5.446716236230968633e+01
1.378488052819915040e+17 5.450570151365851501e+01
1.383664035934034080e+17 5.465777162626984875e+01
1.384723909113767840e+17 5.468888640031988047e+01
1.386898385089888480e+17 5.475269690296715197e+01
1.387458566718645760e+17 5.476912996003957090e+01
1.391401485371171040e+17 5.488473155037598161e+01
1.394751139872829280e+17 5.498285032255411409e+01
1.395580517078167520e+17 5.500713200289181515e+01
1.397465317278009440e+17 5.506229472485692611e+01
1.402000859548547040e+17 5.519493150848484220e+01
1.402505485344929280e+17 5.520967950935153112e+01
1.402942797680306240e+17 5.522245874342159766e+01
1.405645054338391840e+17 5.530139401544663258e+01
1.409576284948249600e+17 5.541613464394649213e+01
1.422471892338490080e+17 5.579173915014366258e+01
1.422972864546127360e+17 5.580630674704174510e+01
1.424468220610239840e+17 5.584977905180944191e+01
1.431278399362251040e+17 5.604756034867892822e+01
1.431357886566066880e+17 5.604986687386499256e+01
1.431593412787671520e+17 5.605670100873025774e+01
1.431860194880282400e+17 5.606444160337694882e+01
1.442982363786337280e+17 5.638670023056453573e+01
1.443325405528829440e+17 5.639662581808670438e+01
1.446042586760051840e+17 5.647521568389539226e+01
1.447606772942286400e+17 5.652043363129158138e+01
1.451067612950974720e+17 5.662041970777211475e+01
1.461021214898569280e+17 5.690752030817498053e+01
1.467413561061665280e+17 5.709153750193136290e+01
1.469518306778143040e+17 5.715206519656827311e+01
1.469718455714873600e+17 5.715781943178583901e+01
1.469752433244825920e+17 5.715879625039542589e+01
1.470329067469665280e+17 5.717537266939405782e+01
1.473313663993672640e+17 5.726113379045303731e+01
1.479339720944852480e+17 5.743410324418167079e+01
1.487681578769064320e+17 5.767313388550820008e+01
1.488302745215947200e+17 5.769091400646792778e+01
1.490801109250119680e+17 5.776240004374435699e+01
1.492747891338538240e+17 5.781807415281865303e+01
1.495774761119587200e+17 5.790458550338956911e+01
1.496475596790390400e+17 5.792460731601707380e+01
1.512732808845876160e+17 5.838812029421232808e+01
1.515768127373877760e+17 5.847446407138549063e+01
1.521095872022621760e+17 5.862587006066251405e+01
1.521161991195046720e+17 5.862774787164890000e+01
1.521700326246364800e+17 5.864303571821285743e+01
1.524355099514063360e+17 5.871839876014029613e+01
1.528013807817633600e+17 5.882218443924718798e+01
1.530533239026589760e+17 5.889360085934828248e+01
1.535618081878337920e+17 5.903760904234182760e+01
1.537510661672508800e+17 5.909116529007425100e+01
1.546452463829485760e+17 5.934388151006164946e+01
1.546496067533826560e+17 5.934511256549542679e+01
1.546912573086887680e+17 5.935687106253909207e+01
1.549734705108428480e+17 5.943651360016487928e+01
1.551686902879640000e+17 5.949157548385450411e+01
1.565419999181661440e+17 5.987821635061933989e+01
1.566258387124020160e+17 5.990178060007083616e+01
1.575014107944311360e+17 6.014760280225343791e+01
1.584646709134245760e+17 6.041747381197029654e+01
1.585288863368727040e+17 6.043544352276880716e+01
1.590036291413907840e+17 6.056821131552680271e+01
1.590472315317150400e+17 6.058039805805356082e+01
1.591201945758997120e+17 6.060078830745772649e+01
1.593005895196086720e+17 6.065118690999806716e+01
1.602332439842269120e+17 6.091142129576639519e+01
1.610152479564639040e+17 6.112919589471217563e+01
1.613728538282835840e+17 6.122865450213200944e+01
1.617304403209753920e+17 6.132802736066203408e+01
1.620735385337745280e+17 6.142329856915085884e+01
1.622219733058057920e+17 6.146449296990718381e+01
1.627033395664797440e+17 6.159798957674515663e+01
1.629283285690856320e+17 6.166033589659856062e+01
1.630501390187319680e+17 6.169407743332149607e+01
1.634451893869474560e+17 6.180344305862141141e+01
1.636188903353067200e+17 6.185149971433096283e+01
1.636905883658579200e+17 6.187133046525167401e+01
1.638640369514744320e+17 6.191929093919750215e+01
1.653501242668296320e+17 6.232944958463821905e+01
1.657688061789324160e+17 6.244476029520502891e+01
1.658819687334488320e+17 6.247590838558200232e+01
1.665225120457771200e+17 6.265207106396388070e+01
1.667984920289402240e+17 6.272789419829087620e+01
1.672936571852058880e+17 6.286382055108386879e+01
1.674731089221463040e+17 6.291304461119842273e+01
1.695389972159669120e+17 6.347832373008935036e+01
1.700645272938591360e+17 6.362171345488757623e+01
1.702342631368540160e+17 6.366799029522695008e+01
1.709396414044918400e+17 6.386012120250571655e+01
1.709477921978419200e+17 6.386233958779389752e+01
1.710961731469366400e+17 6.390271724945952059e+01
1.714630176800330560e+17 6.400248758104949331e+01
1.715058666132160320e+17 6.401413596674341022e+01
1.725881879065530560e+17 6.430800324569246129e+01
1.737651419845051840e+17 6.462678372361733636e+01
1.737707001469557120e+17 6.462828724129616376e+01
1.749140506998596480e+17 6.493718823563794729e+01
1.751604411879692480e+17 6.500365654467391607e+01
1.754811662034575680e+17 6.509012529616057918e+01
1.782506896500231680e+17 6.583433831726300411e+01
1.791186765112320960e+17 6.606667820299165328e+01
1.795852904667641920e+17 6.619140347843080008e+01
1.805679517565063040e+17 6.645366577757610571e+01
1.815597031527634240e+17 6.671780426856803103e+01
1.829768553730698240e+17 6.709428938376500184e+01
1.837511706132509440e+17 6.729952561298614455e+01
1.843547622478109440e+17 6.745928109645954862e+01
1.866625328277679040e+17 6.806824745071918414e+01
1.869276771400277440e+17 6.813802680014043744e+01
1.878183583041626880e+17 6.837215285378543683e+01
1.880571171114300160e+17 6.843484053667248190e+01
1.883914997687858880e+17 6.852258321955423526e+01
1.884572575182655680e+17 6.853983110005910362e+01
1.901799077777419520e+17 6.899084588136588536e+01
1.913993567405125440e+17 6.930915785130231654e+01
1.915768373525794880e+17 6.935541969853620969e+01
1.941909616269692160e+17 7.003489027974192993e+01
1.951434988130611840e+17 7.028158678359686462e+01
1.953359631726902080e+17 7.033137556930253709e+01
1.954133130121888000e+17 7.035137985321097176e+01
1.965644813683310080e+17 7.064872973450685834e+01
1.969653985041148800e+17 7.075212698462235039e+01
1.970405093136277440e+17 7.077148898772873054e+01
1.971582083927727040e+17 7.080182352066898943e+01
1.984701362140137600e+17 7.113946471474025657e+01
2.009627210757872320e+17 7.177854488050576265e+01
2.018094813061535680e+17 7.199493246902541443e+01
2.023247279071465600e+17 7.212642610600869375e+01
2.024854137199664640e+17 7.216740673261149652e+01
2.039876230469322880e+17 7.254989963851195967e+01
2.049539131872960000e+17 7.279534322424686366e+01
2.052506145444392000e+17 7.287061436664252767e+01
2.053023235984200640e+17 7.288372815395267423e+01
2.056813362445756160e+17 7.297980818362050570e+01
2.057334472193938560e+17 7.299301281876310554e+01
2.077088508273443200e+17 7.349258518348723612e+01
2.081228532629232320e+17 7.359704279075390332e+01
2.082282279842907200e+17 7.362361671223760595e+01
2.091947371566624640e+17 7.386710387511473641e+01
2.117335501966040640e+17 7.450454088544151432e+01
2.131207560586792640e+17 7.485152942029471035e+01
2.144109988065157120e+17 7.517344205362347509e+01
2.161648562002463040e+17 7.560976378166880352e+01
2.178699602396225280e+17 7.603257313303345200e+01
2.184999394918578560e+17 7.618844419774748644e+01
2.197621529381104640e+17 7.650019052989497936e+01
2.199404537032693120e+17 7.654416857862817380e+01
2.211511148656157760e+17 7.684239220347453170e+01
2.211556912699104960e+17 7.684351823720241725e+01
2.227402953023958720e+17 7.723283732825525760e+01
2.235436668873292800e+17 7.742977930116984453e+01
2.242339758940302720e+17 7.759877070270117372e+01
2.252532465709015360e+17 7.784789986445424859e+01
2.264565105814088320e+17 7.814139865754442837e+01
2.269064279151475200e+17 7.825097525392557429e+01
2.282353711665457280e+17 7.857410950925758186e+01
2.342310924000671360e+17 8.002228559926950879e+01
2.344767058291441920e+17 8.008127521665026904e+01
2.376893357250533440e+17 8.085046839685914222e+01
2.377327607600133120e+17 8.086083526253166553e+01
2.388529704074559040e+17 8.112798548525866238e+01
2.390550466066723840e+17 8.117612029354776837e+01
2.410259353519982720e+17 8.164468233459757585e+01
2.427117605026166080e+17 8.204417552252533596e+01
2.512226219350988480e+17 8.404304718468029023e+01
2.591009395059050240e+17 8.586727114300943242e+01
2.610115681625520960e+17 8.630598832675008225e+01
2.612062293033860480e+17 8.635060648879765210e+01
2.613543031092622080e+17 8.638453654369328660e+01
2.629549140935798720e+17 8.675076308388779012e+01
2.654469330058315840e+17 8.731898303523513505e+01
2.672607513225698560e+17 8.773106929146094046e+01
2.676708794926434560e+17 8.782407405883928675e+01
2.705593885930935680e+17 8.847730186034188193e+01
2.718119677162405760e+17 8.875959483978198250e+01
2.737902310007534080e+17 8.920424354218829421e+01
2.854909536140566400e+17 9.180488336909745328e+01
2.857631540040565760e+17 9.186479676841520359e+01
2.862952330967819840e+17 9.198183555757628937e+01
2.902664556512488960e+17 9.285221081084797845e+01
2.930043997894011520e+17 9.344907415296829356e+01
3.020648563467227520e+17 9.540585688486156357e+01
3.076836476110915840e+17 9.660544504884590822e+01
3.127087426781668480e+17 9.766946089921120233e+01
3.132798086898107520e+17 9.778985798801517149e+01
3.153843963771108480e+17 9.823265546170983953e+01
3.188432907003101440e+17 9.895730453872785404e+01
3.245229844405687680e+17 1.001389823626264217e+02
3.276110190652311680e+17 1.007772156436847979e+02
3.347957584758188800e+17 1.022507769682395349e+02
3.399413199799373440e+17 1.032964817467325531e+02
3.480145313541213440e+17 1.049212833861529646e+02
