8.843379605504000000e+13 4.596370697021484375e+00
1.770039069900800000e+14 1.471584606170654297e+01
3.537256212070400000e+14 2.369360923767089844e+00
4.413534230282240000e+14 3.839372634887695312e+00
4.420469931376640000e+14 1.882779693603515625e+01
4.425253451202560000e+14 3.238563776016235352e+00
1.592389458198528000e+15 2.220589160919189453e+00
1.592482739519488000e+15 4.158350467681884766e+00
1.768793026068480000e+15 1.437166976928710938e+01
1.946060016582656000e+15 1.878995513916015625e+01
2.211141505777664000e+15 3.293302297592163086e+00
2.477341968171008000e+15 1.418288421630859375e+01
2.477712945971200000e+15 2.112711715698242188e+01
2.919819431116800000e+15 2.407749176025390625e+00
3.007976050786304000e+15 4.445021629333496094e+00
3.183721817571328000e+15 6.236133098602294922e+00
3.360266448273408000e+15 2.200756645202636719e+01
3.362311389577216000e+15 1.928091239929199219e+01
3.713458788892672000e+15 1.906737709045410156e+01
3.804028643311616000e+15 4.667456626892089844e+00
3.804367945728000000e+15 1.924461364746093750e+01
3.886365850730496000e+15 2.863003253936767578e+00
4.067150956331008000e+15 3.451463317871093750e+01
4.239988493385728000e+15 1.369366455078125000e+01
4.242652715286528000e+15 1.837349128723144531e+01
4.329974500687872000e+15 7.502357959747314453e+00
4.418692687331328000e+15 1.056997203826904297e+01
4.598787376939008000e+15 2.492962598800659180e+00
5.478673704550400000e+15 1.564173412322998047e+01
5.479133266051072000e+15 4.525017738342285156e+00
5.655630115241984000e+15 3.571895837783813477e+00
5.832861403840512000e+15 2.021439361572265625e+01
6.098542712061952000e+15 1.368634033203125000e+01
6.806658801991680000e+15 1.948987197875976562e+01
7.248586777559040000e+15 6.268970489501953125e+00
7.601996550897664000e+15 4.651128768920898438e+00
7.956376986845184000e+15 3.259578466415405273e+00
8.396037756551168000e+15 1.776030921936035156e+01
8.572201745776640000e+15 2.382174682617187500e+01
8.576133788336128000e+15 1.146094608306884766e+01
8.750112712949760000e+15 3.757591247558593750e+00
8.838543942090752000e+15 6.914540290832519531e+00
8.839711099453440000e+15 2.152944946289062500e+01
8.841325470285824000e+15 1.891171073913574219e+01
8.924906607607808000e+15 2.231830024719238281e+01
8.928256682098688000e+15 3.793759584426879883e+00
9.107043285729280000e+15 3.834527492523193359e+00
9.459608561123328000e+15 7.226636409759521484e+00
9.549300363165696000e+15 4.325543880462646484e+00
9.721583312568320000e+15 9.080616950988769531e+00
1.025085750116352000e+16 4.196352005004882812e+00
1.025535433192243200e+16 9.308724403381347656e+00
1.033891399440793600e+16 2.089565277099609375e+01
1.034188181680947200e+16 1.957524871826171875e+01
1.052235097387827200e+16 1.987756919860839844e+01
1.069711641437798400e+16 1.106090354919433594e+01
1.069910176301056000e+16 2.584173917770385742e+00
1.078410882947481600e+16 2.630387306213378906e+00
1.113477036061491200e+16 1.283416843414306641e+01
1.131480465224499200e+16 6.582316875457763672e+00
1.149451896881152000e+16 1.834116363525390625e+01
1.149458554080460800e+16 3.024778175354003906e+01
1.157975688976793600e+16 1.063049697875976562e+01
1.158120322000486400e+16 2.287235260009765625e+01
1.166692002981478400e+16 4.576722621917724609e+00
1.193089516227788800e+16 2.073583412170410156e+01
1.193626387139788800e+16 3.545725345611572266e+00
1.211291372879872000e+16 1.790023803710937500e+01
1.237332618588979200e+16 2.231006240844726562e+01
1.237442677125939200e+16 2.008800315856933594e+01
1.264060414820352000e+16 4.823532581329345703e+00
1.272717673024716800e+16 1.867438125610351562e+01
1.281571103860326400e+16 1.524141883850097656e+01
1.317241880995430400e+16 1.183517646789550781e+01
1.317281072572006400e+16 9.084292411804199219e+00
1.335242411055513600e+16 1.629252433776855469e+01
1.352379115818188800e+16 9.329915046691894531e+00
1.370226100797440000e+16 2.885436058044433594e+01
1.405491540393984000e+16 3.547904968261718750e+00
1.423168337294131200e+16 1.761617851257324219e+01
1.485103268941004800e+16 7.689720153808593750e+00
1.493976778748723200e+16 6.645508766174316406e+00
1.511652287158681600e+16 1.804384231567382812e+01
1.520252851794739200e+16 7.452441215515136719e+00
1.520285171423641600e+16 1.092055702209472656e+01
1.529303099506688000e+16 1.496428585052490234e+01
1.546673020993536000e+16 6.685830116271972656e+00
1.564352609622425600e+16 7.019687652587890625e+00
1.573361196151603200e+16 2.157878875732421875e+01
1.599948010081484800e+16 1.804094123840332031e+01
1.600090388247347200e+16 2.298522949218750000e+01
1.600153631640780800e+16 7.495246410369873047e+00
1.635364632526848000e+16 3.955526351928710938e+00
1.635540081940889600e+16 5.712347030639648438e+00
1.644355287567564800e+16 8.751147270202636719e+00
1.652998479754035200e+16 9.123470306396484375e+00
1.661520231740211200e+16 1.927693939208984375e+01
1.670720373810790400e+16 5.549085140228271484e+00
1.679164279514726400e+16 5.402219295501708984e+00
1.688555977126707200e+16 2.093773651123046875e+01
1.697163628458803200e+16 5.753584384918212891e+00
1.732381823415091200e+16 1.895494651794433594e+01
1.732469118625382400e+16 6.180117130279541016e+00
1.768183274930176000e+16 4.759527683258056641e+00
1.821223544055398400e+16 7.179983139038085938e+00
1.829472458244096000e+16 2.932285547256469727e+00
1.838897334478438400e+16 1.074337577819824219e+01
1.847210458428211200e+16 2.287183952331542969e+01
1.882574145401651200e+16 7.011892318725585938e+00
1.891402450678579200e+16 4.645788192749023438e+00
1.909189842986598400e+16 1.902997970581054688e+01
1.927073227813683200e+16 2.735899734497070312e+01
1.953349837730611200e+16 8.029205322265625000e+00
1.953393861145395200e+16 8.347516059875488281e+00
1.953810687721472000e+16 7.548059463500976562e+00
1.962210999507353600e+16 7.618737220764160156e+00
1.962279074738995200e+16 2.158049964904785156e+01
1.962440565509324800e+16 7.182803153991699219e+00
1.971054981414912000e+16 2.091182518005371094e+01
1.971460426327654400e+16 1.412310218811035156e+01
1.980124019608780800e+16 2.601754379272460938e+01
2.015358213318246400e+16 5.875080108642578125e+00
2.024167405990707200e+16 5.207541465759277344e+00
2.024170412467814400e+16 1.106147003173828125e+01
2.024265545993420800e+16 2.455423355102539062e+01
2.041994526746214400e+16 3.033415603637695312e+01
2.050679165367091200e+16 3.443406677246093750e+01
2.059528730732134400e+16 2.483291435241699219e+01
2.059632239443968000e+16 7.507214546203613281e+00
2.086096109935001600e+16 7.671840667724609375e+00
2.086187163241676800e+16 5.445744037628173828e+00
2.094943957313126400e+16 2.111765480041503906e+01
2.103783859001753600e+16 1.157757186889648438e+01
2.103784503246848000e+16 7.225960731506347656e+00
2.121482130738380800e+16 1.768031883239746094e+01
2.121482130738380800e+16 1.386421680450439453e+01
2.139185771184128000e+16 1.693394088745117188e+01
2.147952014183628800e+16 6.858544349670410156e+00
2.147960604118220800e+16 1.027173233032226562e+01
2.148016223944704000e+16 2.367116165161132812e+01
2.165656943119564800e+16 5.331583499908447266e+00
2.200971882214195200e+16 3.285134124755859375e+01
2.201059070050304000e+16 1.390797519683837891e+01
2.201071095958732800e+16 8.178402900695800781e+00
2.218759918767308800e+16 5.983672618865966797e+00
2.227556226537881600e+16 2.452536010742187500e+01
2.245365737927475200e+16 2.016469955444335938e+01
2.245383562041753600e+16 8.917153358459472656e+00
2.280508234085171200e+16 9.505667686462402344e+00
2.289395165665689600e+16 2.241869544982910156e+01
2.307262659113779200e+16 7.635880470275878906e+00
2.324514254251622400e+16 1.438242721557617188e+01
2.333932688035020800e+16 8.372027397155761719e+00
2.351055863650713600e+16 1.056391811370849609e+01
2.351561381301452800e+16 8.943984985351562500e+00
2.360397847016243200e+16 1.540647411346435547e+01
2.386852698075955200e+16 8.363253593444824219e+00
2.386906814663884800e+16 4.766715526580810547e+00
2.404495779482828800e+16 8.578600883483886719e+00
2.404578242854912000e+16 1.041485500335693359e+01
2.430527361515520000e+16 7.957740783691406250e+00
2.439592963735552000e+16 7.710105419158935547e+00
2.439807497351987200e+16 5.718724060058593750e+01
2.448660069194137600e+16 8.129412651062011719e+00
2.457557308696166400e+16 1.073851013183593750e+01
2.519121155168665600e+16 6.700716018676757812e+00
2.527862487357849600e+16 9.251340866088867188e+00
2.528133499794227200e+16 9.951177597045898438e+00
2.563179573936128000e+16 1.129954433441162109e+01
2.563448224140492800e+16 2.996265220642089844e+01
2.572518121327820800e+16 1.481941890716552734e+01
2.572616905575628800e+16 1.436825084686279297e+01
2.572636447676825600e+16 7.902002811431884766e+00
2.580862169042124800e+16 8.999192237854003906e+00
2.581075628916736000e+16 9.209435462951660156e+00
2.607934206902272000e+16 6.322946548461914062e+00
2.616261289495756800e+16 9.499980926513671875e+00
2.616564943683584000e+16 1.158147335052490234e+01
2.633959775980748800e+16 5.105543613433837891e+00
2.642876128087244800e+16 9.488025665283203125e+00
2.643300256107724800e+16 1.159055995941162109e+01
2.651714956034048000e+16 2.241949462890625000e+01
2.651950105493504000e+16 7.607709884643554688e+00
2.660528873170534400e+16 1.051621723175048828e+01
2.660939901540761600e+16 1.012968063354492188e+01
2.669451882476339200e+16 7.878136157989501953e+00
2.669598770357862400e+16 6.353409767150878906e+00
2.695890197911961600e+16 1.277907562255859375e+01
2.704891590370918400e+16 1.880544662475585938e+01
2.704894167351296000e+16 8.695773124694824219e+00
2.705076059216281600e+16 1.899518013000488281e+01
2.731295331319808000e+16 1.322566509246826172e+01
2.740241318700646400e+16 9.828766822814941406e+00
2.775543587641753600e+16 1.176772975921630859e+01
2.793252811544985600e+16 1.005319690704345703e+01
2.802095504962355200e+16 1.099777221679687500e+01
2.802097222949273600e+16 1.798072242736816406e+01
2.802128361462169600e+16 1.368991374969482422e+01
2.819817828515840000e+16 1.195490455627441406e+01
2.828677487054028800e+16 1.932886505126953125e+01
2.837489041958502400e+16 1.006260299682617188e+01
2.837494410667622400e+16 1.256632518768310547e+01
2.846345049774489600e+16 7.061493396759033203e+00
2.855155530937139200e+16 7.111817836761474609e+00
2.855157893169152000e+16 1.172486686706542969e+01
2.872860459873075200e+16 1.052808570861816406e+01
2.899436858507264000e+16 1.230779743194580078e+01
2.934619512609177600e+16 1.328425788879394531e+01
2.934635403988172800e+16 7.261441230773925781e+00
2.943642594652979200e+16 6.531557083129882812e+00
2.943675021656064000e+16 8.663890838623046875e+00
2.952548853586329600e+16 1.863711166381835938e+01
2.978676213389721600e+16 9.617329597473144531e+00
2.987562285976780800e+16 7.554902553558349609e+00
3.005627562668851200e+16 1.532115459442138672e+01
3.022804854872473600e+16 1.016337203979492188e+01
3.031706174593433600e+16 2.688701438903808594e+01
3.032074682787430400e+16 1.671891212463378906e+01
3.058572913016832000e+16 2.136070060729980469e+01
3.058720445143449600e+16 9.343659400939941406e+00
3.067040655789260800e+16 7.804193973541259766e+00
3.093569165538099200e+16 1.641298294067382812e+01
3.102347219697664000e+16 1.565633869171142578e+01
3.102877862907084800e+16 1.166682338714599609e+01
3.102963547504640000e+16 8.977169990539550781e+00
3.129443953619763200e+16 1.236129760742187500e+01
3.138004897182515200e+16 9.970687866210937500e+00
3.173464576675020800e+16 1.255607318878173828e+01
3.173644535804723200e+16 7.781331539154052734e+00
3.191385327717580800e+16 1.507927799224853516e+01
3.199732811405721600e+16 1.176381778717041016e+01
3.200017352989081600e+16 2.136381149291992188e+01
3.208629621411020800e+16 8.676704406738281250e+00
3.270473714499584000e+16 9.892216682434082031e+00
3.270635420018278400e+16 1.674497413635253906e+01
3.279231152816128000e+16 1.983148002624511719e+01
3.279763299264102400e+16 1.225365543365478516e+01
3.306086509576192000e+16 1.141334056854248047e+01
3.314962274241740800e+16 1.256304073333740234e+01
3.323099948777472000e+16 6.866204261779785156e+00
3.323680413607526400e+16 1.001934432983398438e+01
3.332268200715878400e+16 1.383272933959960938e+01
3.367654221519257600e+16 7.873902320861816406e+00
3.367697171192217600e+16 1.496840381622314453e+01
3.367717357538508800e+16 1.374157619476318359e+01
3.385605681577984000e+16 1.348167133331298828e+01
3.385796378125926400e+16 9.756476402282714844e+00
3.394309647551692800e+16 1.754035949707031250e+01
3.420779530996940800e+16 1.106906223297119141e+01
3.420853189686067200e+16 1.346163082122802734e+01
3.456229761561395200e+16 1.513195896148681641e+01
3.456263262306304000e+16 1.294203281402587891e+01
3.500428840507801600e+16 1.283416080474853516e+01
3.509254998301081600e+16 1.660230445861816406e+01
3.518115730581094400e+16 5.100956439971923828e+00
3.544654977748172800e+16 9.709700584411621094e+00
3.553506905345228800e+16 1.435664463043212891e+01
3.562351746246246400e+16 1.319462585449218750e+01
3.579926752421478400e+16 1.131493759155273438e+01
3.580001484852428800e+16 1.622972488403320312e+01
3.597760530376294400e+16 1.490221881866455078e+01
3.606609880992972800e+16 1.415600585937500000e+01
3.615259086133657600e+16 3.547148895263671875e+01
3.624039717273600000e+16 9.409570693969726562e+00
3.632941466491289600e+16 1.233370113372802734e+01
3.650796504534220800e+16 2.954722213745117188e+01
3.650834729743155200e+16 1.175630187988281250e+01
3.677165026751283200e+16 1.375353527069091797e+01
3.677247490123366400e+16 1.502113533020019531e+01
3.694958217265152000e+16 1.648158073425292969e+01
3.747676793339904000e+16 1.598024082183837891e+01
3.765308922580172800e+16 1.784601402282714844e+01
3.774727785860300800e+16 1.529108524322509766e+01
3.792124121396019200e+16 7.033871173858642578e+00
3.809488244677017600e+16 1.055540752410888672e+01
3.853706221479526400e+16 1.165282821655273438e+01
3.862643618925772800e+16 1.160180282592773438e+01
3.862714915382886400e+16 1.503888320922851562e+01
3.871614946613657600e+16 1.042903709411621094e+01
3.880225926545408000e+16 1.089200019836425781e+01
3.889050795848499200e+16 1.251409816741943359e+01
3.889450657303756800e+16 1.486311244964599609e+01
3.898042309882675200e+16 1.918837928771972656e+01
3.898409100089753600e+16 2.446811485290527344e+01
3.898546539043225600e+16 1.014744186401367188e+01
3.898552551997440000e+16 2.429319190979003906e+01
3.906740907147264000e+16 1.788217926025390625e+01
3.906741336643993600e+16 2.015892601013183594e+01
3.906741336643993600e+16 1.631404685974121094e+01
3.906741766140723200e+16 1.947207069396972656e+01
3.906741766140723200e+16 8.454513549804687500e+00
3.906742195637452800e+16 6.326707363128662109e+00
3.906743913624371200e+16 2.256343460083007812e+01
3.906831960453939200e+16 1.973399162292480469e+01
3.906832389950668800e+16 1.947204208374023438e+01
3.906891231002624000e+16 1.979052162170410156e+01
3.906891660499353600e+16 1.925694847106933594e+01
3.906989156256972800e+16 1.976120185852050781e+01
3.907023515995340800e+16 2.127606582641601562e+01
3.907085363524403200e+16 4.032130050659179688e+01
3.907088799498240000e+16 2.168051338195800781e+01
3.907120152759500800e+16 2.352945518493652344e+01
3.907362388914995200e+16 2.274008750915527344e+01
3.907400184627200000e+16 2.109961509704589844e+01
3.907403191104307200e+16 1.265947818756103516e+01
3.915700638423449600e+16 1.804307365417480469e+01
3.915742299606220800e+16 4.155269622802734375e+01
3.915785678775910400e+16 1.996328926086425781e+01
3.915997420663603200e+16 1.223031902313232422e+01
3.916001286134169600e+16 1.756449317932128906e+01
3.916056261715558400e+16 1.535550594329833984e+01
3.916220329466265600e+16 1.743432998657226562e+01
3.924442614857728000e+16 1.826916122436523438e+01
3.924443044354457600e+16 1.243089962005615234e+01
3.924532379674214400e+16 1.036707687377929688e+01
3.924570175386419200e+16 2.433917427062988281e+01
3.924592938713088000e+16 1.856035423278808594e+01
3.924592938713088000e+16 1.540499591827392578e+01
3.924593797706547200e+16 1.709773635864257812e+01
3.924723076222156800e+16 1.328093147277832031e+01
3.924725653202534400e+16 1.605941200256347656e+01
3.924879413031731200e+16 2.961820983886718750e+01
3.924905612332236800e+16 2.048325347900390625e+01
3.925086859952128000e+16 1.849174118041992188e+01
3.933265766173900800e+16 1.941254615783691406e+01
3.933266195670630400e+16 2.089039993286132812e+01
3.933267913657548800e+16 1.732085609436035156e+01
3.933545368544870400e+16 1.376364421844482422e+01
3.933545798041600000e+16 2.285889053344726562e+01
3.933922037176729600e+16 1.689140129089355469e+01
3.933926332144025600e+16 1.513946819305419922e+01
3.933927620634214400e+16 2.954258346557617188e+01
3.942229792417382400e+16 2.561123847961425781e+01
3.942603454572134400e+16 2.528592872619628906e+01
3.942687206434406400e+16 1.720237731933593750e+01
3.942718989192396800e+16 1.778098487854003906e+01
3.950957595459584000e+16 1.263689804077148438e+01
3.950958024956313600e+16 1.989939117431640625e+01
3.950969191871283200e+16 1.268385601043701172e+01
3.950970050864742400e+16 1.671148490905761719e+01
3.959868793605324800e+16 1.528715801239013672e+01
3.959869223102054400e+16 1.716220855712890625e+01
3.959881249010483200e+16 1.806360435485839844e+01
3.959881678507212800e+16 2.051655197143554688e+01
3.959913031768473600e+16 1.834247016906738281e+01
3.960275956504985600e+16 2.650033950805664062e+01
3.968764529868800000e+16 1.164793777465820312e+01
3.968764959365529600e+16 1.580561828613281250e+01
3.968975842259763200e+16 1.358072376251220703e+01
3.969280784937779200e+16 1.901496124267578125e+01
3.977503070329241600e+16 1.848039245605468750e+01
3.977515955231129600e+16 2.140188980102539062e+01
3.977583815714406400e+16 1.472661590576171875e+01
3.977796416595558400e+16 1.546222400665283203e+01
3.977796416595558400e+16 9.079273223876953125e+00
3.977916246183116800e+16 1.570687580108642578e+01
3.977969933274316800e+16 1.179320144653320312e+01
3.977971651261235200e+16 1.986325645446777344e+01
3.978015889424384000e+16 1.249350929260253906e+01
3.978017607411302400e+16 2.840723037719726562e+01
3.978084608901120000e+16 1.474484062194824219e+01
3.986394941122150400e+16 5.552431869506835938e+01
3.986428012370329600e+16 3.884934616088867188e+01
3.986734243538534400e+16 2.820106506347656250e+01
3.995301844300595200e+16 1.917338943481445312e+01
3.995788893591961600e+16 1.244668579101562500e+01
3.995794047552716800e+16 1.965447425842285156e+01
4.004118982662553600e+16 1.850628471374511719e+01
4.004246972687974400e+16 2.317725181579589844e+01
4.004269736014643200e+16 2.699794578552246094e+01
4.004398585033523200e+16 1.262674331665039062e+01
4.004456567092019200e+16 2.053616523742675781e+01
4.012912928201113600e+16 8.612492561340332031e+00
4.012915505181491200e+16 2.274024391174316406e+01
4.012942992972185600e+16 2.703348922729492188e+01
4.012943422468915200e+16 2.218075752258300781e+01
4.012944710959104000e+16 2.257474327087402344e+01
4.013397400512102400e+16 1.263227081298828125e+01
4.021727489582694400e+16 3.983037948608398438e+01
4.021808234967859200e+16 1.987875938415527344e+01
4.022238590690918400e+16 1.441338443756103516e+01
4.030755081342156800e+16 1.966764640808105469e+01
4.031107268660428800e+16 2.228169250488281250e+01
4.039435210247372800e+16 2.178030395507812500e+01
4.039480736900710400e+16 1.726279067993164062e+01
4.039485890861465600e+16 1.157995319366455078e+01
4.039536571475558400e+16 1.358400821685791016e+01
4.039883175336345600e+16 1.376018142700195312e+01
4.039905079669555200e+16 1.976757812500000000e+01
4.039934285447168000e+16 2.180861282348632812e+01
4.039946740852326400e+16 1.920445442199707031e+01
4.048794802978816000e+16 1.303360080718994141e+01
4.057119308591923200e+16 2.170943641662597656e+01
4.057189746055577600e+16 2.007636833190917969e+01
4.057360256257228800e+16 2.933997154235839844e+01
4.057382160590438400e+16 1.813213729858398438e+01
4.057405353413836800e+16 3.048198127746582031e+01
4.057451309563904000e+16 1.778048515319824219e+01
4.065975960653004800e+16 3.090217208862304688e+01
4.065976819646464000e+16 1.369945144653320312e+01
4.074831324223897600e+16 1.850509262084960938e+01
4.074837337178112000e+16 2.660880470275878906e+01
4.074923666020761600e+16 2.685894012451171875e+01
4.075292603711488000e+16 3.126314544677734375e+01
4.092597026947072000e+16 2.649159240722656250e+01
4.101557187719987200e+16 1.489663505554199219e+01
4.110383775009996800e+16 2.328020668029785156e+01
4.110416416761446400e+16 1.773587226867675781e+01
4.119243004051456000e+16 1.059781932830810547e+01
4.119243863044915200e+16 3.165436935424804688e+01
4.119275216306176000e+16 1.636474037170410156e+01
4.128181260491161600e+16 1.801228713989257812e+01
4.136759169174732800e+16 1.454670238494873047e+01
4.136762605148569600e+16 1.956924057006835938e+01
4.136764752632217600e+16 2.284267234802246094e+01
4.136810708782284800e+16 2.050936126708984375e+01
4.136871697317888000e+16 1.108918476104736328e+01
4.145611955765248000e+16 2.449009132385253906e+01
4.145717182464000000e+16 1.642793273925781250e+01
4.145907879011942400e+16 1.159127807617187500e+01
4.145911744482508800e+16 1.613406181335449219e+01
4.145926347371315200e+16 1.502756595611572266e+01
4.145928494854963200e+16 1.968421554565429688e+01
4.154502108571238400e+16 1.815334892272949219e+01
4.154603040302694400e+16 1.758961677551269531e+01
4.163422755645030400e+16 1.288981533050537109e+01
4.163564489565798400e+16 1.453077220916748047e+01
4.172183200438681600e+16 1.254776477813720703e+01
4.172306895496806400e+16 1.660490417480468750e+01
4.198843350935142400e+16 1.499794673919677734e+01
4.207566429513318400e+16 1.169058132171630859e+01
4.207665643257856000e+16 1.993366241455078125e+01
4.216434677986099200e+16 8.709700584411621094e+00
4.216471185208115200e+16 1.261195182800292969e+01
4.225269425713971200e+16 1.820188522338867188e+01
4.225308080419635200e+16 1.911253929138183594e+01
4.234117487840460800e+16 3.059650039672851562e+01
4.234132520225996800e+16 1.590701484680175781e+01
4.234143257644236800e+16 1.398392677307128906e+01
4.242960825502924800e+16 2.120830917358398438e+01
4.242962543489843200e+16 1.386906242370605469e+01
4.242965120470220800e+16 1.765810012817382812e+01
4.242965549966950400e+16 1.608074760437011719e+01
4.242967267953868800e+16 2.337752914428710938e+01
4.251810605616332800e+16 2.073180580139160156e+01
4.260613141089484800e+16 2.015339088439941406e+01
4.269451324791193600e+16 1.719753456115722656e+01
4.278286502015795200e+16 2.025534629821777344e+01
4.278292514970009600e+16 9.007353782653808594e+00
4.287134993639014400e+16 2.381319618225097656e+01
4.287141006593228800e+16 1.167691135406494141e+01
4.313704520325529600e+16 3.049645233154296875e+01
4.331361560376115200e+16 1.805049514770507812e+01
4.349129410582937600e+16 2.441926956176757812e+01
4.349141436491366400e+16 3.908862304687500000e+01
4.349150455922688000e+16 2.475109863281250000e+01
4.366836701750886400e+16 1.516089916229248047e+01
4.384408271952281600e+16 1.735537528991699219e+01
4.384421586350899200e+16 1.918670463562011719e+01
4.384565467755315200e+16 2.338816642761230469e+01
4.393224121824051200e+16 2.051814079284667969e+01
4.393343951411609600e+16 2.410228729248046875e+01
4.419565156250419200e+16 2.130153656005859375e+01
4.419927221993472000e+16 1.645987701416015625e+01
4.428344928396902400e+16 2.054433059692382812e+01
4.428348364370739200e+16 2.064129066467285156e+01
4.437157771791564800e+16 1.925118064880371094e+01
4.437544748344934400e+16 1.827433395385742188e+01
4.437633654167961600e+16 1.873716735839843750e+01
4.446346424824627200e+16 2.601946258544921875e+01
4.446510063078604800e+16 1.506550598144531250e+01
4.455176448088473600e+16 2.611439323425292969e+01
4.455213384807219200e+16 1.151094913482666016e+01
4.481827579153612800e+16 1.854641914367675781e+01
4.490687667188531200e+16 2.020949745178222656e+01
4.490707424038092800e+16 1.723992919921875000e+01
4.499540024282316800e+16 2.127730178833007812e+01
4.508408702251827200e+16 1.532645225524902344e+01
4.516678661780275200e+16 1.590978717803955078e+01
4.516860768393625600e+16 1.928871345520019531e+01
4.517109876496793600e+16 3.379527282714843750e+01
4.543616267164057600e+16 1.788572120666503906e+01
4.543751558633881600e+16 1.422305965423583984e+01
4.570335258712473600e+16 1.627498245239257812e+01
4.587503101988044800e+16 1.924279403686523438e+01
4.587549487634841600e+16 1.650967407226562500e+01
4.587994016749977600e+16 4.400731658935546875e+01
4.605713333826355200e+16 4.906979751586914062e+01
4.613915432871526400e+16 1.857171440124511719e+01
4.622952903055769600e+16 1.714206123352050781e+01
4.623007019643699200e+16 1.727275276184082031e+01
4.631917788292710400e+16 1.050629997253417969e+01
4.632246782787584000e+16 1.972953987121582031e+01
4.658148012562841600e+16 1.893634223937988281e+01
4.738127605058764800e+16 1.717722892761230469e+01
4.791060929498316800e+16 1.844791603088378906e+01
4.791188060530278400e+16 2.515960311889648438e+01
4.808600287444992000e+16 1.465010833740234375e+01
4.808958058220748800e+16 5.480783843994140625e+01
4.861637550093107200e+16 1.837062072753906250e+01
4.879339257803571200e+16 1.840645408630371094e+01
5.029696613908480000e+16 2.072764778137207031e+01
5.055799277649920000e+16 3.305452346801757812e+01
5.197300840687206400e+16 2.080760192871093750e+01
5.259338636800819200e+16 1.898058509826660156e+01
5.259693830596198400e+16 1.892024040222167969e+01
5.471472225511014400e+16 1.852849769592285156e+01
5.551224184740249600e+16 3.217298889160156250e+01
5.577686337244364800e+16 2.128553581237792969e+01
5.622009111248896000e+16 4.120842361450195312e+01
5.639871880232960000e+16 2.149440765380859375e+01
5.648451936400179200e+16 1.331050968170166016e+01
5.763420909469696000e+16 2.852209472656250000e+01
6.002232687538995200e+16 1.966083717346191406e+01
6.284962224196812800e+16 1.848991584777832031e+01
6.417473991186841600e+16 3.916877365112304688e+01
6.488695715869491200e+16 1.610670661926269531e+01
7.036244346064076800e+16 2.821131134033203125e+01
7.054035818591027200e+16 3.003432464599609375e+01
7.177748915578470400e+16 3.429095840454101562e+01
7.319433444222566400e+16 1.735536193847656250e+01
7.478600637245030400e+16 2.024360084533691406e+01
7.540276367615590400e+16 3.928738403320312500e+01
7.602388466663424000e+16 3.143713760375976562e+01
7.733947609907200000e+16 2.175092124938964844e+01
7.770253827453747200e+16 2.895549201965332031e+01
8.282444139384012800e+16 3.095375442504882812e+01
8.388138989571276800e+16 2.141539573669433594e+01
8.503266446934016000e+16 3.148353004455566406e+01
8.600921118343168000e+16 2.716381072998046875e+01
