1.000000000000000000e+01 -2.451101144087280276e-02
2.000000000000000000e+01 -2.985207102052195999e-02
3.000000000000000000e+01 -3.291830762885029904e-02
4.000000000000000000e+01 -3.444627084270403955e-02
5.000000000000000000e+01 -3.526820016776380934e-02
8.000000000000000000e+01 -3.728704129092234171e-02
1.000000000000000000e+02 -3.802065152618033100e-02
