4.000000000000000000e+01 2.954054132436269645e-02
2.000000000000000000e+01 2.094916550774780090e-02
1.000000000000000000e+01 1.343127511379558700e-02
5.000000000000000000e+00 7.624712432313253407e-03
2.000000000000000000e+00 3.283110032349295659e-03
