0	0
0.025	0.02057
0.05	0.10809
0.07499	0.25866
0.1	0.4637
0.125	0.78722
0.15	1.24168
0.17499	1.79921
0.2	2.58385
0.225	3.49122
0.25	4.57546
0.27499	5.7887
0.3	7.17472
0.325	8.76872
0.35	10.48565
0.37499	12.4365
0.4	14.62429
0.425	16.97591
0.45	19.44123
0.475	21.99642
0.5	24.70829
0.525	27.63834
0.55	30.65619
0.575	33.83504
0.6	37.07124
0.625	40.33852
0.65	43.77305
0.675	47.13404
0.7	50.5423
0.725	54.00278
0.75	57.56451
0.775	60.9074
0.8	64.20528
0.825	67.34023
0.85	70.35423
0.875	73.26635
0.9	76.05639
0.925	78.65179
0.95	81.03909
0.975	83.17071
1	85.07213
1.025	86.74542
1.05	88.21926
1.075	89.33953
1.1	90.11106
1.125	90.57612
1.15	90.70668
1.175	90.55257
1.2	90.22128
1.225	89.66698
1.25	88.70995
1.275	87.41746
1.3	85.85022
1.325	84.04108
1.35	81.97754
1.375	79.76518
1.4	77.27696
1.425	74.58287
1.45	71.68165
1.475	68.67486
1.5	65.6341
1.525	62.46118
1.55	59.16667
1.575	55.85613
1.6	52.55441
1.625	49.24051
1.65	45.93126
1.675	42.67344
1.7	39.50388
1.725	36.36732
1.75	33.33329
1.775	30.39619
1.8	27.57314
1.825	24.9284
1.85	22.41534
1.875	20.02196
1.9	17.79197
1.925	15.715
1.95	13.78207
1.975	12.00786
2	10.38745
2.025	8.90549
2.05	7.55985
2.075	6.3584
2.1	5.3026
2.125	4.37671
2.15	3.55915
2.175	2.84164
2.2	2.22731
2.225	1.70744
2.25	1.2767
2.27499	0.92415
2.3	0.64863
2.325	0.43801
2.35	0.28284
2.37499	0.17313
2.4	0.10155
2.425	0.05846
2.45	0.0324
2.47499	0.0172
2.5	0.00921
2.525	0.00449
2.55	0.00209
2.57499	7.55761E-4
2.6	6.4803E-6
2.625	0