0	0
0.02381	0
0.05556	0.02962
0.0873	0.04547
0.11905	0.0745
0.15079	0.09937
0.18254	0.10648
0.21429	0.14006
0.24603	0.20448
0.27778	0.19638
0.30952	0.18929
0.34127	0.2412
0.37302	0.291
0.40476	0.36901
0.43651	0.38547
0.46825	0.44959
0.5	0.426
0.53175	0.39499
0.56349	0.40267
0.59524	0.41778
0.62698	0.40282
0.65873	0.37721
0.69048	0.38477
0.72222	0.37331
0.75397	0.35053
0.78571	0.35468
0.81746	0.32967
0.84921	0.32908
0.88095	0.28192
0.9127	0.27175
0.94444	0.26386
0.97619	0.25396
1.00794	0.25631
1.03968	0.25575
1.07143	0.25422
1.10317	0.25474
1.13492	0.25387
1.16667	0.25371
1.19841	0.25381
1.23016	0.25446
1.2619	0.25356
1.29365	0.25492
1.3254	0.25447
1.35714	0.25417
1.38889	0.25381