0	0
0.04	0.00427
0.08	0.07173
0.12	0.14262
0.16	0.26521
0.2	0.39584
0.24	0.52676
0.28	0.62926
0.32	0.75827
0.36	0.90623
0.4	1.02201
0.44	1.17849
0.48	1.33408
0.52	1.47524
0.56	1.62353
0.6	1.73284
0.64	1.87791
0.68	2.03746
0.72	2.11352
0.76	2.18192
0.8	2.23807
0.84	2.25307
0.88	2.30489
0.92	2.3428
0.96	2.33727
1	2.3117
1.04	2.29283
1.08	2.26949
1.12	2.19956
1.16	2.13463
1.2	2.02999
1.24	1.89767
1.28	1.79762
1.32	1.66288
1.36	1.51691
1.4	1.37945
1.44	1.25012
1.48	1.10766
1.52	0.97914
1.56	0.86524
1.6	0.76418
1.64	0.65273
1.68	0.55415
1.72	0.4637
1.76	0.37594
1.8	0.30381
1.84	0.24222
1.88	0.19119
1.92	0.14866
1.96	0.1143
2	0.08527
2.04	0.06309
2.08	0.04649
2.12	0.03072
2.16	0.01767
2.2	0.00942
2.24	0.00515
2.28	8.43415E-4
2.32	-0.00225
2.36	-0.00399
2.4	-0.00432
2.44	-0.00445
2.48	-0.00271
2.52	-0.0012
2.56	-4.3617E-4
2.6	-2.69807E-4
2.64	-7.74067E-5
2.68	-1.44755E-4
2.72	-3.43028E-5
2.76	0