0	0
0.02501	3.5487E-5
0.05	0.01109
0.075	0.03728
0.1	0.07509
0.12501	0.10513
0.15	0.15851
0.175	0.19911
0.2	0.20747
0.22501	0.23969
0.25	0.27587
0.275	0.2789
0.3	0.33009
0.325	0.35854
0.35	0.35172
0.375	0.40055
0.4	0.40003
0.425	0.45706
0.45	0.45329
0.475	0.48579
0.5	0.47119
0.525	0.49378
0.55	0.52004
0.575	0.51821
0.6	0.52074
0.625	0.54819
0.65	0.5366
0.675	0.55353
0.7	0.54813
0.725	0.56397
0.75	0.51675
0.775	0.501
0.8	0.52763
0.825	0.53129
0.85	0.5108
0.875	0.51976
0.9	0.51709
0.925	0.46037
0.95	0.48024
0.975	0.48377
1	0.44456
1.025	0.45781
1.05	0.43351
1.075	0.42076
1.1	0.43727
1.125	0.4041
1.15	0.34117
1.175	0.31752
1.2	0.31399
1.225	0.30627
1.25	0.2874
1.275	0.26072
1.3	0.23048
1.325	0.21776
1.35	0.21233
1.375	0.19094
1.4	0.16951
1.425	0.15868
1.45	0.14256
1.475	0.12371
1.5	0.11061
1.525	0.09642
1.55	0.08622
1.575	0.07322
1.6	0.06649
1.625	0.05831
1.65	0.0497
1.675	0.03818
1.7	0.03114
1.725	0.02426
1.75	0.01633
1.775	0.009
1.8	0.00667
1.825	0.00265
1.85	0.00186
1.875	0.00163
1.9	0.00187
1.925	5.04415E-4
1.95	1.98502E-4
1.975	-0.00208
2	-0.00309
2.025	-0.00294
2.05	-0.00394
2.075	-0.00517
2.1	-0.0063
2.125	-0.00744
2.15	-0.00782
2.175	-0.00746
2.2	-0.00659
2.22501	-0.00535
2.25	-0.00414
2.275	-0.00245
2.3	-7.62475E-4
2.32501	-6.45688E-5
2.35	0