0	0
0.025	0.01388
0.05	0.05215
0.075	0.10654
0.1	0.14113
0.125	0.18483
0.15	0.24231
0.175	0.2885
0.2	0.34054
0.225	0.37543
0.25	0.41268
0.275	0.46115
0.3	0.49562
0.325	0.55484
0.35	0.58225
0.375	0.60712
0.4	0.61673
0.425	0.67734
0.45	0.7353
0.475	0.73884
0.5	0.74813
0.525	0.78787
0.55	0.79532
0.575	0.8385
0.6	0.87245
0.625	0.9013
0.65	0.91651
0.675	0.91902
0.7	0.92858
0.725	0.94648
0.75	0.95447
0.775	0.96107
0.8	0.94308
0.825	0.94876
0.85	0.92686
0.875	0.96343
0.9	0.93026
0.925	0.93782
0.95	0.904
0.975	0.89671
1	0.88309
1.025	0.84574
1.05	0.82628
1.075	0.83564
1.1	0.82359
1.125	0.80249
1.15	0.77267
1.175	0.73454
1.2	0.67601
1.225	0.63508
1.25	0.61408
1.275	0.59543
1.3	0.56552
1.325	0.53516
1.35	0.50568
1.375	0.47973
1.4	0.44121
1.425	0.41144
1.45	0.36865
1.475	0.34311
1.5	0.31119
1.525	0.29643
1.55	0.27639
1.575	0.2639
1.6	0.23852
1.625	0.20801
1.65	0.18482
1.675	0.16255
1.7	0.14321
1.725	0.13748
1.75	0.11597
1.775	0.107
1.8	0.09219
1.825	0.08172
1.85	0.06752
1.875	0.05796
1.9	0.0488
1.925	0.04222
1.95	0.03633
1.975	0.03006
2	0.02152
2.025	0.0148
2.05	0.01094
2.075	0.00892
2.1	0.00657
2.125	0.00286
2.15	-4.88298E-4
2.175	-0.00299
2.2	-0.00507
2.225	-0.00633
2.25	-0.00622
2.275	-0.00526
2.3	-0.00532
2.325	-0.00467
2.35	-0.00452
2.375	-0.00449
2.4	-0.0039
2.425	-0.00411
2.45	-0.00358
2.475	-0.0033
2.5	-0.00312
2.525	-0.00143
2.55	-6.55141E-4
2.575	-6.05445E-4
2.6	-3.43219E-4
2.625	-2.54912E-4
2.65	-1.63731E-4
2.675	-6.43982E-5
2.7	-7.67134E-5
2.725	-7.30518E-5