0	0
0.025	0.00137
0.05	0.01301
0.075	0.02844
0.1	0.04824
0.125	0.06851
0.15	0.08895
0.175	0.10356
0.2	0.12447
0.225	0.13985
0.25	0.13571
0.275	0.14997
0.3	0.16628
0.325	0.17766
0.35	0.19179
0.375	0.19875
0.4	0.20531
0.425	0.2079
0.45	0.20736
0.475	0.21681
0.5	0.22124
0.525	0.22976
0.55	0.22957
0.575	0.23253
0.6	0.22744
0.625	0.20483
0.65	0.18718
0.675	0.17876
0.7	0.17187
0.725	0.1627
0.75	0.16135
0.775	0.15641
0.8	0.14995
0.825	0.14443
0.85	0.13567
0.875	0.13012
0.9	0.11961
0.925	0.10643
0.95	0.08922
0.975	0.07769
1	0.07054
1.025	0.05609
1.05	0.04532
1.075	0.03002
1.1	0.01843
1.125	0.00705
1.15	8.67094E-4
1.175	0