0	0
0.0375	7.82276E-4
0.075	0.00538
0.1125	0.01217
0.15	0.01713
0.1875	0.02692
0.225	0.0322
0.2625	0.03573
0.3	0.04304
0.3375	0.04756
0.375	0.05699
0.4125	0.05893
0.45	0.06519
0.4875	0.07354
0.525	0.07756
0.5625	0.08084
0.6	0.08574
0.6375	0.08491
0.675	0.09271
0.7125	0.09995
0.75	0.10378
0.7875	0.10618
0.825	0.10799
0.8625	0.10509
0.9	0.10829
0.9375	0.10897
0.975	0.10928
1.0125	0.10952
1.05	0.10824
1.0875	0.10295
1.125	0.10413
1.1625	0.10636
1.2	0.10226
1.2375	0.09881
1.275	0.09422
1.3125	0.09137
1.35	0.0881
1.3875	0.0823
1.425	0.07814
1.4625	0.07461
1.5	0.06998
1.5375	0.06596
1.575	0.06072
1.6125	0.05614
1.65	0.05249
1.6875	0.04763
1.725	0.04381
1.7625	0.04013
1.8	0.03556
1.8375	0.03262
1.875	0.02964
1.9125	0.0274
1.95	0.02379
1.9875	0.02325
2.025	0.02131
2.0625	0.01814
2.1	0.01594
2.1375	0.01344
2.175	0.01148
2.2125	0.01041
2.25	0.00902
2.2875	0.00747
2.325	0.0065
2.3625	0.00486
2.4	0.00393
2.4375	0.00233
2.475	0.00176
2.5125	0.00133
2.55	4.98451E-4
2.5875	7.29232E-4
2.625	6.11456E-4
2.6625	3.49185E-4
2.7	4.95516E-5
2.73751	0