2.85	6.5605E-6
2.7	1.10046E-5
2.55	1.8111E-5
2.4	2.92506E-5
2.25	4.63707E-5
2.1	7.21717E-5
1.95	1.1031E-4
1.8	1.65615E-4
1.65	2.44312E-4
1.5	3.54227E-4
1.35	5.04954E-4
1.2	7.0795E-4
1.05	9.76546E-4
0.9	0.00133
0.75	0.00177
0.6	0.00233
0.45	0.00303
0.3	0.00388
0.15	0.00489
-5.08852E-16	0.0061