0	0
0.03	0.00551
0.06	0.06144
0.09	0.16192
0.12	0.23922
0.15	0.38242
0.18	0.53954
0.21	0.72804
0.24	0.93594
0.27	1.16186
0.3	1.40538
0.33	1.71617
0.36	2.00221
0.39	2.32812
0.42	2.65719
0.45	2.99914
0.48	3.3798
0.51	3.73753
0.54	4.07177
0.57	4.43299
0.6	4.78601
0.63	5.11512
0.66	5.45604
0.69	5.8156
0.72	6.10865
0.75	6.4199
0.78	6.74016
0.81	7.00327
0.84	7.25676
0.87	7.47181
0.9	7.73162
0.93	7.9329
0.96	8.07315
0.99	8.1904
1.02	8.29173
1.05	8.30211
1.08	8.27741
1.11	8.26408
1.14	8.21299
1.17	8.14183
1.2	8.07411
1.23	7.95319
1.26	7.73617
1.29	7.48522
1.32	7.24521
1.35	7.02229
1.38	6.75929
1.41	6.47934
1.44	6.18414
1.47	5.88131
1.5	5.55588
1.53	5.23345
1.56	4.88905
1.59	4.52901
1.62	4.18678
1.65	3.87215
1.68	3.54614
1.71	3.23117
1.74	2.9295
1.77	2.654
1.8	2.37166
1.83	2.10213
1.86	1.85247
1.89	1.61786
1.92	1.40478
1.95	1.20574
1.98	1.0314
2.01	0.87103
2.04	0.73877
2.07	0.61662
2.1	0.51026
2.13	0.41471
2.16	0.33845
2.19	0.27587
2.22	0.22236
2.25	0.17156
2.28	0.13332
2.31	0.10055
2.34	0.07738
2.37	0.05647
2.4	0.04108
2.43	0.03046
2.46	0.02004
2.49	0.01234
2.52	0.00825
2.55	0.00487
2.58	0.00379
2.61	0.00221
2.64	0.00163
2.67	0.00135
2.7	1.41897E-4
2.73	2.71444E-4
2.76	0