0	0
0.025	0.01064
0.05	0.04093
0.07499	0.08387
0.1	0.13203
0.125	0.17894
0.15	0.21143
0.175	0.24973
0.2	0.29392
0.225	0.32249
0.25	0.36619
0.275	0.39535
0.3	0.44349
0.325	0.46183
0.35	0.47223
0.375	0.51939
0.4	0.54471
0.425	0.56334
0.45	0.57856
0.475	0.62944
0.5	0.63562
0.525	0.65091
0.55	0.69075
0.575	0.70355
0.6	0.73894
0.625	0.73239
0.65	0.74662
0.675	0.73675
0.7	0.69827
0.725	0.71356
0.75	0.70661
0.775	0.71066
0.8	0.72933
0.825	0.75249
0.85	0.74808
0.875	0.71943
0.9	0.68965
0.925	0.67617
0.95	0.72264
0.975	0.69355
1	0.67239
1.025	0.63779
1.05	0.59937
1.075	0.56666
1.1	0.54636
1.125	0.54125
1.15	0.56638
1.175	0.55049
1.2	0.52135
1.225	0.48995
1.25	0.43842
1.275	0.437
1.3	0.41481
1.325	0.41726
1.35	0.35745
1.375	0.34081
1.4	0.32949
1.425	0.31207
1.45	0.28803
1.475	0.27759
1.5	0.25207
1.525	0.23364
1.55	0.22225
1.575	0.21147
1.6	0.20119
1.625	0.1702
1.65	0.16195
1.675	0.15421
1.7	0.1251
1.725	0.11732
1.75	0.10788
1.775	0.09717
1.8	0.08594
1.825	0.07456
1.85	0.0588
1.875	0.05142
1.9	0.03945
1.925	0.02403
1.95	0.01281
1.97499	0.00447
2	0.00266
2.025	4.90447E-4
2.05	8.26483E-4
2.07499	1.01465E-5
2.1	0