0.005              5.79926             50.765               
0.01              10.6687             48.8293               
0.015              15.9981             47.5258               
0.02              21.5205             47.3668               
0.025              26.7662             44.1267               
0.03              31.3157             39.2654               
0.035              36.0376             37.604               
0.04              41.2843             36.862               
0.045              46.6034             36.9473               
0.05              51.9355             35.2411               
0.055              56.9812             34.4347               
0.06              62.0495             34.0324               
0.065              67.2549             33.979               
0.07              72.5458             34.031               
0.075              77.8193             34.1376               
0.08              82.7951             34.2692               
0.085              87.5515             34.2901               
0.09              93.1406             33.2683               
0.095              99.3372             33.3404               
0.1              105.474             33.1171               
0.105              111.59             33.2401               
0.11              117.767             33.2882               
0.115              123.834             33.4132               
0.12              129.893             32.2277               
0.125              135.826             32.1675               
0.13              141.897             32.2448               
0.135              148.046             32.1892               
0.14              154.02             32.2073               
0.145              159.894             32.2019               
0.15              165.355             30.5562               
0.155              170.855             30.8043               
0.16              176.17             31.3336               
0.165              181.433             31.5296               
0.17              186.095             31.087               
0.175              191.373             31.2312               
0.18              197.185             30.6882               
0.185              203.24             30.3891               
0.19              209.321             30.2498               
0.195              214.964             30.444               
0.2              220.325             30.8823               
0.205              226.093             29.9305               
0.21              232.154             27.4021               
0.215              238.233             27.1376               
0.22              244.339             27.3091               
0.225              250.366             27.5096               
0.23              256.224             27.9023               
0.235              261.658             26.7441               
0.24              266.339             25.5465               
0.245              271.517             25.7229               
0.25              276.173             26.6722               
0.255              280.456             24.5378               
0.26              284.342             22.5541               
0.265              287.473             23.753               
0.27              291.579             22.8736               
0.275              296.878             22.3738               
0.28              303.064             22.3605               
0.285              309.399             22.363               
0.29              315.699             22.395               
0.295              321.915             22.5176               
0.3              328.165             22.659               
0.305              334.391             22.7783               
0.31              340.579             22.9611               
0.315              346.703             23.2167               
0.32              352.701             23.5519               
0.325              358.549             23.8798               
0.33              363.978             24.1027               
0.335              369.762             24.0281               
0.34              373.128             24.6626               
0.345              374.456             24.4798               
0.35              377.932             21.4834               
0.355              382.968             20.9876               
0.36              388.772             19.6614               
0.365              395.016             18.9557               
0.37              401.354             19.0615               
0.375              407.657             19.1905               
0.38              413.935             19.3887               
0.385              420.011             19.7884               
0.39              425.57             20.6349               
0.395              430.06             22.1945               
0.4              431.773             22.1922               
0.405              434.762             19.4843               
0.41              439.809             18.9147               
0.415              446.066             18.2926               
0.42              452.077             18.6956               
0.425              457.264             19.9531               
0.43              460.287             19.794               
0.435              464.9             17.5439               
0.44              470.923             16.6193               
0.445              477.165             15.875               
0.45              483.447             15.8797               
0.455              489.676             16.0084               
0.46              495.866             16.1953               
0.465              501.753             16.2963               
0.47              507.843             16.3192               
0.475              514.245             15.4019               
0.48              519.603             16.0548               
0.485              525.523             16.0356               
0.49              531.715             16.1882               
0.495              537.914             16.2434               
0.5              544.006             16.5032               
0.505              550.17             16.6778               
0.51              556.362             16.8702               
0.515              562.543             17.1536               
0.52              568.716             17.2318               
0.525              574.178             18.3051               
0.53              572.721             22.0444               
0.535              560.028             20.5142               
0.54              563.947             18.6783               
0.545              569.271             18.4986               
0.55              573.479             17.8525               
0.555              577.595             17.0941               
0.56              570.85             19.5488               
0.565              560.249             15.2312               
0.57              562.986             15.0606               
0.575              565.537             13.3363               
0.58              566.05             16.8072               
0.585              552.707             19.0865               
0.59              538.141             13.4977               
0.595              541.62             10.8603               
0.6              547.574             11.1268               
0.605              553.738             10.8389               
0.61              559.686             11.1859               
0.615              565.895             10.4316               
0.62              572.259             10.5166               
0.625              578.622             10.5968               
0.63              584.97             10.6996               
0.635              591.283             10.8359               
0.64              597.678             10.836               
0.645              604.087             10.8081               
0.65              610.457             10.8827               
0.655              616.821             10.947               
0.66              623.178             11.0221               
0.665              629.491             11.1422               
0.67              635.82             11.2331               
0.675              642.129             11.35               
0.68              648.374             11.4215               
0.685              654.548             10.5503               
0.69              659.312             13.2606               
0.695              657.891             14.6018               
0.7              643.013             15.3248               
0.705              623.949             12.4966               
0.71              626.946             6.95242               
0.715              633.3             6.51636               
0.72              639.731             6.51767               
0.725              646.163             6.51888               
0.73              652.595             6.52049               
0.735              659.026             6.52235               
0.74              665.458             6.52436               
0.745              671.889             6.5284               
0.75              678.32             6.52983               
0.755              684.751             6.53152               
0.76              691.182             6.5324               
0.765              697.61             6.5337               
0.77              704.032             6.54532               
0.775              710.433             6.60455               
0.78              716.794             6.58754               
0.785              723.122             6.70048               
0.79              729.443             6.55334               
0.795              735.733             6.66962               
0.8              742.021             6.71243               
0.805              748.312             6.56829               
0.81              754.58             6.69757               
0.815              760.985             6.75956               
0.82              767.399             6.75995               
0.825              773.813             6.76115               
0.83              780.227             6.7623               
0.835              786.64             6.76249               
0.84              793.053             6.76345               
0.845              799.466             6.76454               
0.85              805.878             6.76545               
0.855              812.29             6.76635               
0.86              818.703             6.7673               
0.865              825.114             6.76866               
0.87              831.526             6.77086               
0.875              837.938             6.7608               
0.88              844.35             6.76235               
0.885              850.762             6.76569               
0.89              857.173             6.7709               
0.895              863.582             6.77352               
0.9              869.992             6.77717               
0.905              876.404             6.76727               
0.91              882.814             6.77268               
0.915              889.222             6.77748               
0.92              895.631             6.77012               
0.925              902.042             6.77609               
0.93              908.449             6.78064               
0.935              914.858             6.77379               
0.94              921.266             6.78155               
0.945              927.673             6.77542               
0.95              934.082             6.78309               
0.955              940.487             6.79005               
0.96              946.895             6.78541               
0.965              953.301             6.78035               
0.97              959.707             6.78869               
0.975              966.114             6.78569               
0.98              972.518             6.78323               
0.985              978.922             6.79242               
0.99              985.329             6.79102               
0.995              991.732             6.78848               
1              998.135             6.78792               
1.005              1004.54             6.8012               
1.01              1010.94             6.79881               
1.015              1017.34             6.79894               
1.02              1023.74             6.80008               
1.025              1030.15             6.80128               
1.03              1036.55             6.80247               
1.035              1042.95             6.80774               
1.04              1049.35             6.79719               
1.045              1055.75             6.80012               
1.05              1062.15             6.80347               
1.055              1068.54             6.80922               
1.06              1074.94             6.80245               
1.065              1081.34             6.80767               
1.07              1087.74             6.81418               
1.075              1094.13             6.80917               
1.08              1100.53             6.81922               
1.085              1106.92             6.81226               
1.09              1113.32             6.82407               
1.095              1119.71             6.81913               
1.1              1126.11             6.81618               
1.105              1132.5             6.81584               
1.11              1138.89             6.83057               
1.115              1145.28             6.82996               
1.12              1151.67             6.83129               
1.125              1158.06             6.83271               
1.13              1164.45             6.8341               
1.135              1170.84             6.83572               
1.14              1177.27             6.82644               
1.145              1183.7             6.81831               
1.15              1190.13             6.83719               
1.155              1196.55             6.84397               
1.16              1202.98             6.83277               
1.165              1209.41             6.82313               
1.17              1215.83             6.84524               
1.175              1222.26             6.84552               
1.18              1228.69             6.83052               
1.185              1235.12             6.83841               
1.19              1241.54             6.85648               
1.195              1247.97             6.84551               
1.2              1254.4             6.83119               
1.205              1260.82             6.85434               
1.21              1267.25             6.85754               
1.215              1273.68             6.83849               
1.22              1280.11             6.85292               
1.225              1286.53             6.86778               
1.23              1292.96             6.8499               
1.235              1299.39             6.84689               
1.24              1305.81             6.87357               
1.245              1312.24             6.86014               
1.25              1318.67             6.84654               
1.255              1325.09             6.87821               
1.26              1331.52             6.86417               
1.265              1337.95             6.85108               
1.27              1344.36             6.88406               
1.275              1350.8             6.86835               
1.28              1357.23             6.85572               
1.285              1363.64             6.88947               
1.29              1370.08             6.87005               
1.295              1376.5             6.87156               
1.3              1382.92             6.89369               
1.305              1389.36             6.86495               
1.31              1395.78             6.88819               
1.315              1402.2             6.89174               
1.32              1408.63             6.86224               
1.325              1415.05             6.90383               
1.33              1421.48             6.88548               
1.335              1427.91             6.88437               
1.34              1434.33             6.90759               
1.345              1440.76             6.87188               
1.35              1447.18             6.91208               
1.355              1453.61             6.89642               
1.36              1460.04             6.88972               
1.365              1466.45             6.91598               
1.37              1472.89             6.87872               
1.375              1479.3             6.92493               
1.38              1485.73             6.89431               
1.385              1491.85             7.33632               
1.39              1496.51             8.8612               
1.395              1495.28             10.2651               
1.4              1489.2             10.2115               
1.405              1489.37             11.4088               
1.41              1483.96             6.88083               
1.415              1487.18             5.81102               
1.42              1486.95             8.09917               
1.425              1464.08             16.8471               
1.43              1422.8             15.9722               
1.435              1390.97             18.0402               
1.44              1352.33             18.7969               
1.445              1305.17             21.5051               
1.45              1260.52             16.3258               
1.455              1237.95             8.3125               
1.46              1226.03             3.22518               
1.465              1231.17             1.00449               
1.47              1237.6             1.00503               
1.475              1244.04             1.00527               
1.48              1250.47             1.00556               
1.485              1256.9             1.00585               
1.49              1263.33             1.00613               
1.495              1269.76             1.00642               
1.5              1276.2             1.00671               
1.505              1282.63             1.00699               
1.51              1289.06             1.00728               
1.515              1295.49             1.00757               
1.52              1301.92             1.00786               
1.525              1308.36             1.00815               
1.53              1314.79             1.00844               
1.535              1321.22             1.00873               
1.54              1327.65             1.00902               
1.545              1334.08             1.00931               
1.55              1340.52             1.0096               
1.555              1346.95             1.0099               
1.56              1353.38             1.01019               
1.565              1359.81             1.01048               
1.57              1366.24             1.01078               
1.575              1372.68             1.01107               
1.58              1379.11             1.01137               
1.585              1385.54             1.01167               
1.59              1391.97             1.01196               
1.595              1398.4             1.01226               
1.6              1404.84             1.01256               
1.605              1411.27             1.01285               
1.61              1417.7             1.01315               
1.615              1424.13             1.01345               
1.62              1430.56             1.01375               
1.625              1437             1.01405               
1.63              1443.43             1.01435               
1.635              1449.86             1.01465               
1.64              1456.29             1.01495               
1.645              1462.72             1.01525               
1.65              1469.15             1.01555               
1.655              1475.59             1.01585               
1.66              1482.02             1.01615               
1.66495              1480.65             3.82613               
1.66995              1470.31             4.48294               
1.67495              1473.13             1.01577               
1.67995              1479.56             1.01611               
1.68495              1486             1.016               
1.68995              1492.43             1.01748               
1.69495              1498.86             1.01547               
1.69995              1505.29             1.01962               
1.70495              1511.72             1.01658               
1.70995              1518.15             1.02478               
1.71495              1524.57             1.0177               
1.71995              1530.77             1.25882               
1.7249              1536.02             1.91925               
1.7299              1538.46             1.88582               
1.7349              1543.29             1.12645               
1.7399              1549.47             1.32789               
1.74485              1555.59             1.13663               
1.74985              1561.77             1.03372               
1.7548              1567.71             2.54134               
1.7598              1565.35             4.35963               
1.7648              1551.95             5.49464               
1.76975              1543.05             3.05843               
1.77475              1544.1             3.26145               
1.77975              1548.84             1.15612               
1.7847              1553.84             2.86072               
1.7897              1551.59             2.43215               
1.7947              1555.44             1.30982               
1.79965              1561.56             1.06901               
1.80465              1567.74             1.07804               
1.8096              1573.85             1.90288               
1.8146              1580.03             1.23048               
1.81955              1583.3             1.90483               
1.8245              1589.16             1.6349               
1.82945              1593.18             3.70027               
1.8344              1589.38             4.4809               
1.83935              1576.55             3.6546               
1.84435              1574.38             1.18962               
1.8493              1580.48             1.32772               
1.85425              1586.27             1.1441               
1.8592              1591.93             2.63623               
1.86415              1594.24             2.49102               
1.8691              1599.34             2.20431               
1.87405              1604.64             1.73072               
1.87895              1606.68             4.26217               
1.8839              1596.38             6.10263               
1.88885              1576.96             8.69391               
1.89385              1563.12             3.95891               
1.8988              1565.39             1.1309               
1.9038              1571.56             1.32749               
1.90875              1577.68             1.1609               
1.9137              1583.8             2.49682               
1.9187              1589.97             1.20494               
1.92365              1586.26             5.16064               
1.9286              1570             5.84412               
1.93355              1562.9             4.66963               
1.93855              1552.87             5.63292               
1.94355              1545.7             1.25591               
1.9485              1551.59             2.57084               
1.9535              1543.92             5.4086               
1.9585              1531.42             2.69393               
1.9635              1536.89             1.11827               
1.96845              1543.01             2.6042               
1.97345              1540.54             3.91558               
1.97845              1530.21             4.47909               
1.98345              1535.14             1.01306               
1.98845              1541.32             1.18024               
1.9934              1546.67             1.74614               
1.9984              1552.57             1.11938               
