0.01              12.8639             48.4076               
0.02              25.7278             48.4379               
0.03              38.59             48.4365               
0.04              51.4496             48.4342               
0.05              64.3056             48.4308               
0.06              77.1573             48.4255               
0.07              90.004             48.2949               
0.08              102.848             48.2724               
0.09              115.687             48.3191               
0.1              128.519             48.3164               
0.11              141.346             48.3027               
0.12              154.166             48.2805               
0.13              166.976             48.2091               
0.14              179.78             47.7066               
0.15              192.585             50.7143               
0.16              205.378             50.694               
0.17              218.159             50.6739               
0.18              230.928             50.5921               
0.19              243.684             50.5736               
0.2              256.426             50.555               
0.21              269.155             50.5363               
0.22              281.871             50.5187               
0.23              294.574             50.5027               
0.24              307.262             50.4888               
0.25              319.937             50.4772               
0.26              332.599             50.4015               
0.27              345.247             50.0973               
0.28              357.881             50.0965               
0.29              370.503             50.004               
0.3              383.113             49.7583               
0.31              395.709             49.7672               
0.32              408.289             49.7809               
0.33              420.858             49.8557               
0.34              433.413             49.8757               
0.35              445.952             49.9017               
0.36              458.476             49.935               
0.37              470.986             49.9754               
0.38              483.482             50.0244               
0.39              495.963             50.0766               
0.4              508.429             50.1426               
0.41              520.883             50.1744               
0.42              533.323             50.26               
0.43              545.749             50.1182               
0.44              558.162             50.1842               
0.45              570.567             50.2048               
0.46              582.959             50.1702               
0.47              595.339             50.2507               
0.48              607.708             50.2921               
0.49              620.067             50.328               
0.5              632.425             50.1046               
0.51              644.772             50.2251               
0.52              657.118             50.0292               
0.53              669.46             50.2021               
0.54              681.792             49.9865               
0.55              694.121             49.9134               
0.56              706.457             50.6665               
0.57              718.787             50.691               
0.58              731.112             50.7703               
0.59              743.432             50.6799               
0.6              755.745             50.6866               
0.61              768.059             50.8961               
0.62              780.364             51.1608               
0.63              792.659             51.4422               
0.64              804.945             51.7409               
0.65              817.222             51.9511               
0.66              829.489             52.2735               
0.67              841.746             52.5651               
0.68              853.993             52.865               
0.69              866.232             53.1988               
0.7              878.463             53.3819               
0.71              890.683             53.7723               
0.72              902.894             53.9041               
0.73              915.093             54.3184               
0.74              927.282             54.7301               
0.75              939.467             54.6331               
0.76              951.64             55.0456               
0.77              963.815             55.0274               
0.78              975.977             55.4768               
0.79              988.122             55.969               
0.8              1000.25             56.4823               
0.81              1012.36             57.0172               
0.82              1024.45             57.582               
0.83              1036.52             58.1597               
0.84              1048.58             58.8043               
0.85              1060.63             59.4078               
0.86              1072.65             60.008               
0.87              1084.65             60.5725               
0.88              1096.65             60.9167               
0.89              1108.64             61.4622               
0.9              1120.62             62.0503               
0.91              1132.58             62.6692               
0.92              1144.54             63.241               
0.93              1156.48             63.9808               
0.94              1168.39             64.7974               
0.95              1180.27             65.6532               
0.96              1192.13             66.5149               
0.97              1203.97             67.1701               
0.98              1215.78             68.046               
0.99              1227.57             68.949               
1              1239.33             69.822               
1.01              1251.1             70.7738               
1.02              1262.85             71.7222               
1.03              1274.57             72.7015               
1.04              1286.27             73.7808               
1.05              1297.95             74.7321               
1.06              1309.6             75.7049               
1.07              1321.22             76.772               
1.08              1332.81             77.8811               
1.09              1344.37             79.0628               
1.1              1355.9             80.2376               
1.11              1367.39             81.4449               
1.12              1378.89             82.1979               
1.13              1390.37             83.3048               
1.14              1401.83             84.3424               
1.15              1413.26             85.4769               
1.16              1424.66             86.6264               
1.17              1436.02             87.7632               
1.18              1447.36             88.9581               
1.19              1458.66             89.8024               
1.2              1469.92             91.0617               
1.21              1481.16             91.8178               
1.22              1492.36             92.9549               
1.23              1503.56             93.7501               
1.24              1514.73             95.0446               
1.25              1525.87             96.211               
1.26              1536.97             97.4223               
1.27              1548.04             98.8759               
1.28              1559.06             100.521               
1.29              1570.03             102.327               
1.3              1580.94             103.983               
1.31              1591.8             105.816               
1.32              1602.62             107.659               
1.33              1613.38             109.603               
1.34              1624.1             111.6               
1.35              1634.78             113.725               
1.36              1645.41             115.494               
1.37              1655.98             117.704               
1.38              1666.52             119.792               
1.39              1677.03             120.89               
1.4              1687.51             123.026               
1.41              1697.95             125.016               
1.42              1708.39             126.604               
1.43              1718.78             128.836               
1.43              1716.25             132.476               
1.44              1726.51             134.74               
1.45              1736.7             137.228               
1.45              1733.97             140.861               
1.46              1744.05             143.209               
1.47              1754.05             145.278               
1.47              1751.13             148.603               
1.48              1761.06             149.637               
1.48              1758.11             153.448               
1.48              1755.12             156.502               
1.49              1764.95             158.388               
1.49              1761.87             161.477               
1.49              1758.72             163.753               
1.5              1768.37             165.891               
1.5              1765.11             169.443               
1.5              1761.83             173.335               
1.5              1758.52             177.441               
1.51              1768.02             179.684               
1.51              1764.58             184.696               
1.51              1761.06             188.337               
1.51              1757.52             191.84               
1.52              1766.8             193.252               
1.52              1763.2             196.575               
1.52              1759.55             199.797               
1.53              1768.73             201.362               
1.53              1764.98             204.408               
1.53              1761.18             208.749               
1.53              1757.33             212.812               
1.54              1766.26             215.691               
1.54              1762.27             220.174               
1.54              1758.24             223.728               
1.55              1767.04             225.291               
1.55              1762.96             228.843               
1.55              1758.79             232.703               
1.56              1767.45             235.444               
1.56              1763.19             239.163               
1.56              1758.84             242.644               
1.56              1754.41             245.689               
1.57              1762.76             254.831               
1.57              1758.17             268.791               
1.57              1753.53             271.283               
1.58              1761.65             271.373               
1.58              1756.84             274.024               
1.59              1764.81             274.444               
1.59              1759.91             277.813               
1.59              1754.94             287.596               
1.6              1762.75             289.632               
1.6              1757.59             292.459               
1.6              1752.34             295.492               
1.61              1759.87             296.761               
1.61              1754.47             298.43               
1.61              1748.97             300.394               
1.62              1756.21             301.817               
1.62              1750.56             302.285               
1.63              1757.71             304.081               
1.63              1751.9             308.715               
1.64              1758.88             310.632               
1.64              1752.92             314.098               
1.64              1746.87             319.053               
1.65              1753.67             321.333               
1.65              1747.57             325.082               
1.66              1754.24             326.827               
1.66              1748.04             328.928               
1.67              1754.67             331.067               
1.67              1748.4             334.197               
1.68              1754.93             335.92               
1.68              1748.57             338.969               
1.69              1755.04             339.443               
1.69              1748.6             343.616               
1.69              1742.15             346.499               
1.7              1748.51             349.986               
1.7              1741.89             355.977               
1.71              1748.09             358.639               
1.72              1754.77             362.397               
1.72              1748.3             367.115               
1.72              1741.75             369.983               
1.73              1747.95             372.621               
1.74              1754.11             375.479               
1.74              1747.35             378.545               
1.74              1740.49             382.417               
1.75              1746.45             386.336               
1.76              1752.3             390.984               
1.76              1745.18             396.832               
1.77              1750.83             398.613               
1.77              1743.59             403.853               
1.78              1749.17             404.79               
1.78              1741.85             412.815               
1.79              1747.33             415.418               
1.79              1739.91             419.462               
1.8              1745.31             422.296               
1.8              1737.86             427.448               
1.81              1743.23             430.796               
1.81              1735.65             435.126               
1.82              1740.89             438.091               
1.83              1746.09             441.329               
1.83              1738.43             444.641               
1.84              1743.6             448.628               
1.84              1735.83             455.09               
1.85              1740.89             458.554               
1.85              1733.08             462.657               
1.86              1738.06             463.816               
1.87              1743.07             466.013               
1.87              1735.17             471.194               
1.88              1740.08             476.135               
1.88              1732.08             480.137               
1.89              1737             482.044               
1.9              1741.92             484.827               
1.9              1733.92             488.714               
1.91              1738.75             490.819               
1.91              1730.77             496.21               
1.92              1735.59             500.134               
1.93              1740.41             502.418               
1.93              1732.31             506.483               
1.94              1737.11             507.497               
1.95              1741.84             513.238               
1.95              1733.77             521.941               
1.96              1738.44             526.741               
1.96              1730.22             529.547               
1.97              1734.83             530.924               
1.98              1739.38             533.554               
1.98              1731.04             539.085               
1.99              1735.46             543.949               
