1E-4	1408.58355
1.25893E-4	1415.93565
1.58489E-4	1423.33095
1.99526E-4	1430.77215
2.51189E-4	1438.2579
3.16228E-4	1445.79225
3.98107E-4	1453.3725
5.01187E-4	1461
6.30957E-4	1468.67745
7.94328E-4	1476.4035
1E-3	1484.1795
0.00126	1492.00545
0.00158	1499.88405
0.002	1507.8153
0.00251	1515.7992
0.00316	1523.8371
0.00398	1531.929
0.00501	1540.0776
0.00631	1548.2829
0.00794	1556.5449
0.01	1564.8663
0.01259	1573.2471
0.01585	1581.68865
0.01995	1590.19095
0.02512	1598.75535
0.03162	1607.38455
0.03981	1616.07855
0.05012	1624.83735
0.0631	1633.66365
0.07943	1642.5588
0.1	1651.5228
0.12589	1660.557
0.15849	1669.6641
0.19953	1678.8441
0.25119	1688.0997
0.31623	1697.4309
0.39811	1706.8404
0.50119	1716.3282
0.63096	1725.897
