0.01              12.8641             51.8482               
0.02              25.7281             51.845               
0.03              38.5912             51.8431               
0.04              51.4523             51.8413               
0.05              64.3105             51.8414               
0.06              77.1649             51.8429               
0.07              90.0145             51.8441               
0.08              102.859             51.8439               
0.09              115.697             51.8425               
0.1              128.528             51.8485               
0.11              141.351             51.8483               
0.12              154.166             51.8483               
0.13              166.972             51.8477               
0.14              179.769             51.8465               
0.15              192.554             51.8456               
0.16              205.329             51.846               
0.17              218.093             51.8474               
0.18              230.845             51.651               
0.19              243.586             51.6532               
0.2              256.313             51.6562               
0.21              269.028             51.6608               
0.22              281.73             51.6674               
0.23              294.418             51.6755               
0.24              307.092             51.685               
0.25              319.753             51.6959               
0.26              332.398             51.709               
0.27              345.029             51.7244               
0.28              357.645             51.7425               
0.29              370.245             51.7634               
0.3              382.83             51.7875               
0.31              395.398             51.8153               
0.32              407.951             51.8471               
0.33              420.487             51.8829               
0.34              433.006             51.9224               
0.35              445.508             51.9524               
0.36              457.994             51.9868               
0.37              470.463             52.0258               
0.38              482.914             52.0694               
0.39              495.349             52.1173               
0.4              507.765             52.1702               
0.41              520.164             52.2289               
0.42              532.545             52.2848               
0.43              544.909             52.3388               
0.44              557.256             52.399               
0.45              569.591             52.3931               
0.46              581.909             52.1462               
0.47              594.21             52.2216               
0.48              606.492             52.305               
0.49              618.758             52.3949               
0.5              631.009             52.4931               
0.51              643.245             52.6               
0.52              655.482             52.3964               
0.53              667.706             52.5451               
0.54              679.917             52.704               
0.55              692.117             52.8638               
0.56              704.306             53.0429               
0.57              716.486             53.2323               
0.58              728.658             53.4321               
0.59              740.835             53.3232               
0.6              753.003             53.3641               
0.61              765.161             53.6087               
0.62              777.309             53.8621               
0.63              789.449             54.0819               
0.64              801.581             54.2135               
0.65              813.707             54.4914               
0.66              825.822             54.783               
0.67              837.934             55.0656               
0.68              850.035             55.3525               
0.69              862.128             55.6532               
0.7              874.218             55.9676               
0.71              886.311             56.101               
0.72              898.393             56.447               
0.73              910.465             56.7826               
0.74              922.525             57.1339               
0.75              934.573             57.5016               
0.76              946.609             57.8856               
0.77              958.639             58.3135               
0.78              970.655             58.7382               
0.79              982.658             59.1831               
0.8              994.648             59.6422               
0.81              1006.63             60.01               
0.82              1018.59             60.504               
0.83              1030.54             60.8436               
0.84              1042.49             61.296               
0.85              1054.43             61.8342               
0.86              1066.34             62.4199               
0.87              1078.27             62.9971               
0.88              1090.19             63.6041               
0.89              1102.09             64.2024               
0.9              1113.98             64.6844               
0.91              1125.86             65.1169               
0.92              1137.72             65.678               
0.93              1149.57             66.3133               
0.94              1161.39             66.9759               
0.95              1173.2             67.6695               
0.96              1184.99             68.3543               
0.97              1196.78             68.9415               
0.98              1208.56             69.5322               
0.99              1220.33             70.2427               
1              1232.08             71.0525               
1.01              1243.81             71.792               
1.02              1255.53             72.5226               
1.03              1267.23             72.9157               
1.04              1278.94             73.2302               
1.05              1290.64             73.5732               
1.06              1302.32             74.3326               
1.07              1314             74.8548               
1.08              1325.65             75.668               
1.09              1337.29             76.6224               
1.1              1348.9             77.6617               
1.11              1360.48             78.708               
1.12              1372.03             79.8562               
1.13              1383.58             80.1597               
1.14              1395.1             81.124               
1.15              1406.61             81.728               
1.16              1418.12             82.7264               
1.16              1418.12             82.7264               
1.17              1429.71             83.9215               
1.18              1441.23             84.9658               
1.19              1452.71             86.1352               
1.2              1464.16             87.2286               
1.21              1475.6             88.1569               
1.22              1486.99             89.3609               
1.23              1498.35             90.6922               
1.24              1509.67             92.0455               
1.25              1520.96             93.1905               
1.26              1532.22             93.9255               
1.27              1543.44             94.9192               
1.28              1554.66             96.4821               
1.29              1565.84             97.5576               
1.3              1576.98             99.076               
1.31              1588.07             100.704               
1.32              1599.13             101.444               
1.33              1610.14             103.097               
1.34              1621.11             104.53               
1.35              1632.05             105.519               
1.36              1642.94             107.304               
1.37              1653.79             108.622               
1.38              1664.6             109.781               
1.39              1675.38             111.583               
1.4              1686.14             112.807               
1.41              1696.87             114.275               
1.42              1707.55             116.051               
1.43              1718.19             117.616               
1.43              1715.93             120.921               
1.44              1726.48             122.791               
1.45              1737             124.236               
1.46              1747.46             125.851               
1.46              1745             128.393               
1.47              1755.38             128.773               
1.47              1752.86             130.858               
1.47              1750.27             134.112               
1.48              1760.5             134.921               
1.48              1757.8             137.925               
1.49              1767.94             138.612               
1.49              1765.15             141.93               
1.49              1762.32             143.134               
1.49              1759.42             146.591               
1.5              1769.36             148.532               
1.5              1766.42             151.959               
1.5              1763.43             155.4               
1.5              1760.4             158.512               
1.51              1770.21             160.202               
1.51              1767.11             163.543               
1.51              1763.94             167.072               
1.51              1760.7             171.827               
1.52              1770.25             173.715               
1.52              1766.88             177.375               
1.52              1763.46             180.111               
1.52              1759.95             184.6               
1.53              1769.22             186.553               
1.53              1765.58             189.976               
1.53              1761.86             192.473               
1.53              1758.07             195.122               
1.54              1767.14             195.888               
1.54              1763.26             199.747               
1.54              1759.32             203.7               
1.55              1768.19             206.015               
1.55              1764.21             208.896               
1.55              1760.14             212.148               
1.55              1756             214.851               
1.56              1764.65             215.744               
1.56              1760.37             219.019               
1.56              1756.04             222.861               
1.57              1764.5             225.535               
1.57              1760.02             229.548               
1.57              1755.47             233.635               
1.58              1763.74             235.848               
1.58              1759.07             240.46               
1.58              1754.35             243.509               
1.59              1762.47             244.979               
