1	280.81983
1.23285	280.81988
1.51991	280.81993
1.87382	280.82
2.31013	280.82009
2.84804	280.82019
3.51119	280.82032
4.32876	280.82048
5.3367	280.82068
6.57933	280.82092
8.11131	280.82122
10	280.82159
12.32847	280.82204
15.19911	280.8226
18.73817	280.8233
23.1013	280.82415
28.48036	280.8252
35.11192	280.82649
43.28761	280.82809
53.36699	280.83006
65.79332	280.83249
81.11308	280.83548
100	280.83917
123.28467	280.84372
151.99111	280.84933
187.38174	280.85624
231.01297	280.86476
284.80359	280.87527
351.11917	280.88823
432.87613	280.9042
533.66992	280.92389
657.93322	280.94817
811.13083	280.9781
1000	281.01499
1232.84674	281.06048
1519.91108	281.11656
1873.81742	281.1857
2310.1297	281.27094
2848.03587	281.37602
3511.19173	281.50558
4328.76128	281.6653
5336.69923	281.86221
6579.33225	282.10496
8111.30831	282.40425
10000	282.77322
12328.46739	283.22811
15199.11083	283.78891
18738.17423	284.4803
23101.297	285.33267
28480.35868	286.38352
35111.91734	287.67905
43287.61281	289.27625
53366.99231	291.24534
65793.32247	293.67293
81113.08308	296.66578
100000	300.35551
123284.67394	304.90437
151991.1083	310.51242
187381.74229	317.42629
231012.97001	325.95003
284803.58684	336.4585
351119.17342	349.41382
432876.12811	365.38576
533669.92312	385.0767
657933.22466	409.35262
811130.83079	439.28111
1000000	476.17835
1.23285E6	521.66699
1.51991E6	577.74751
1.87382E6	646.8862
2.31013E6	732.1236
2.84804E6	837.20826
3.51119E6	966.76154
4.32876E6	1126.48087
5.3367E6	1323.39033
6.57933E6	1566.14952
8.11131E6	1668.0279
1E7	1676.35875
1.23285E7	1684.75035
1.51991E7	1693.2054
1.87382E7	1701.7239
2.31013E7	1710.3072
2.84804E7	1718.95665
3.51119E7	1727.67225
4.32876E7	1736.4567
5.3367E7	1745.31135
6.57933E7	1754.2362
8.11131E7	1763.23395
1E8	1772.3046
1.23285E8	1781.45085
1.51991E8	1790.6727
1.87382E8	1799.9742
2.31013E8	1809.354
2.84804E8	1818.8148
3.51119E8	1828.3593
4.32876E8	1837.9875
5.3367E8	1847.7021
6.57933E8	1857.5058
8.11131E8	1867.39725
1E9	1877.3832
