0.005              6.42756             63.8838               
0.01              12.8149             63.8362               
0.015              19.1409             63.8035               
0.02              25.4031             63.6329               
0.025              31.6017             63.6275               
0.03              37.7424             63.6541               
0.035              43.8298             63.6543               
0.04              49.8801             63.742               
0.045              55.913             63.6156               
0.05              61.9102             63.5844               
0.055              67.8664             63.5661               
0.06              73.782             63.5511               
0.065              79.6678             63.4693               
0.07              85.5265             63.1891               
0.075              91.3464             62.9674               
0.08              97.1239             62.7319               
0.085              102.867             62.4725               
0.09              108.565             61.7496               
0.095              114.254             61.5788               
0.1              119.946             61.5801               
0.105              125.631             61.5692               
0.11              131.32             61.5866               
0.115              137.006             61.6583               
0.12              142.669             61.6127               
0.125              148.34             61.5985               
0.13              154.051             61.6866               
0.135              159.774             61.8195               
0.14              165.493             61.9346               
0.145              171.202             62.117               
0.15              176.894             62.3282               
0.155              182.567             62.567               
0.16              188.232             62.8278               
0.165              193.9             63.0372               
0.17              199.57             63.3186               
0.175              205.227             63.2467               
0.18              210.873             63.5567               
0.185              216.527             63.721               
0.19              222.169             64.079               
0.195              227.781             64.4482               
0.2              233.37             64.874               
0.205              238.94             65.3177               
0.21              244.509             64.9434               
0.215              250.125             64.5597               
0.22              255.734             63.8963               
0.225              261.394             63.813               
0.23              267.101             64.0622               
0.235              272.82             64.0226               
0.24              278.531             64.2266               
0.245              284.239             64.0436               
0.25              289.955             64.1581               
0.255              295.675             64.131               
0.26              301.407             64.4959               
0.265              307.205             64.471               
0.27              313.056             64.6016               
0.275              318.895             64.7302               
0.28              324.721             64.8357               
0.285              330.509             64.8424               
0.29              336.246             65.2487               
0.295              341.934             65.5494               
0.3              347.602             65.189               
0.305              353.21             65.262               
0.31              358.752             65.6352               
0.315              364.184             66.0734               
0.32              369.509             66.6444               
0.325              374.73             67.324               
0.33              379.856             67.6945               
0.335              384.876             67.6174               
0.34              389.851             67.7754               
0.345              394.704             67.9745               
0.35              399.387             68.3459               
0.355              403.934             68.5079               
0.36              408.363             68.9746               
0.365              412.665             69.3125               
0.37              416.831             69.9917               
0.375              421.019             68.8826               
0.38              425.188             69.0496               
0.385              429.279             69.7931               
0.39              433.266             70.3485               
0.395              437.206             70.4363               
0.4              441.074             71.1839               
0.405              444.922             70.8909               
0.41              448.832             70.6046               
0.415              452.762             69.9844               
0.42              456.654             69.6755               
0.425              460.577             67.4108               
0.43              464.562             66.5404               
0.435              468.457             66.7808               
0.44              472.392             65.9224               
0.445              476.431             65.1672               
0.45              480.508             63.6008               
0.455              484.913             62.7312               
0.46              489.335             61.5515               
0.465              493.618             61.0339               
0.47              497.758             60.9929               
0.475              501.929             60.6764               
0.48              506.142             60.1951               
0.485              510.348             60.4973               
0.49              514.422             61.2297               
0.495              518.384             61.3592               
0.5              522.181             61.7651               
0.505              525.825             61.3413               
0.51              529.476             61.0128               
0.515              533.067             61.6912               
0.52              536.434             62.0942               
0.525              539.717             60.2204               
0.53              543.13             57.9633               
0.535              546.465             58.0303               
0.54              549.489             57.2382               
0.545              552.328             56.9128               
0.55              555.093             56.6943               
0.555              557.959             55.5289               
0.56              560.963             55.3306               
0.565              564.258             54.2352               
0.57              567.422             54.8154               
0.575              570.488             54.5399               
0.58              573.383             55.0264               
0.585              576.38             54.2009               
0.59              579.529             54.5755               
0.595              582.667             54.9447               
0.6              585.699             54.5517               
0.605              588.647             54.1277               
0.61              591.429             52.765               
0.615              594.489             49.8988               
0.62              597.792             47.577               
0.625              601.08             46.1347               
0.63              604.51             44.8381               
0.635              607.876             44.6775               
0.64              611.073             44.4566               
0.645              614.137             44.8492               
0.65              617.046             45.2849               
0.655              619.904             45.4899               
0.66              622.832             45.4432               
0.665              625.829             43.6272               
0.67              629.196             41.1637               
0.675              632.602             40.7735               
0.68              635.917             40.4504               
0.685              639.1             40.9851               
0.69              642.124             41.9165               
0.695              644.844             42.3633               
0.7              647.22             43.2327               
0.705              649.557             42.7939               
0.71              651.892             43.0435               
0.715              654.349             40.796               
0.72              656.958             40.108               
0.725              659.59             39.7509               
0.73              662.59             38.9775               
0.735              665.99             38.3442               
0.74              669.298             38.2392               
0.745              672.463             38.8168               
0.75              675.421             39.8875               
0.755              678.078             40.9657               
0.76              680.628             42.2093               
0.765              683             42.962               
0.77              685.193             43.5021               
0.775              687.439             43.137               
0.78              689.842             42.3921               
0.785              692.213             43.7127               
0.79              694.165             45.3529               
0.795              695.627             47.2229               
0.8              696.614             47.9639               
0.805              697.303             49.5879               
0.81              697.932             48.5817               
0.815              698.685             48.5785               
0.82              699.683             49.3327               
0.825              700.752             48.2369               
0.83              701.831             49.1314               
0.835              702.796             50.8976               
0.84              703.54             51.8744               
0.845              701.089             53.5374               
0.85              698.587             51.414               
0.855              696.715             52.0591               
0.86              690.125             51.7143               
0.865              683.604             50.9529               
0.87              678.341             50.7737               
0.875              671.595             50.6202               
0.88              664.711             50.6506               
0.885              658.024             49.7115               
0.89              651.349             49.611               
0.895              644.474             48.9838               
0.9              641.166             46.3034               
0.905              641.427             44.7551               
0.91              641.857             42.8784               
0.915              642.816             40.4686               
0.92              644.072             39.0243               
0.925              645.36             38.852               
0.93              647.035             36.9049               
0.935              649.338             35.6693               
0.94              651.764             34.3619               
0.945              654.53             31.2652               
0.95              657.754             30.6614               
0.955              661.204             29.515               
0.96              664.787             29.3824               
0.965              668.424             39.6928               
0.97              671.979             34.7176               
0.975              675.507             32.961               
0.98              678.903             31.6025               
0.985              682.146             30.8267               
0.99              685.088             32.2912               
0.995              687.613             34.0299               
1              689.634             36.2315               
1.005              691.116             37.006               
1.01              692.504             36.1986               
1.015              693.734             37.322               
1.02              694.719             37.1241               
1.025              695.62             38.5176               
1.03              696.507             38.9891               
1.035              697.328             38.9387               
1.04              698.514             37.3118               
1.045              699.788             35.1341               
1.05              701.013             34.6659               
1.055              701.933             34.8714               
1.06              702.861             34.9679               
1.065              703.984             33.9908               
1.07              705.201             33.4768               
1.075              707.037             31.1116               
1.08              709.097             31.1917               
1.085              711.016             32.0431               
1.09              713.028             31.7042               
1.095              715.181             31.424               
1.1              718.028             28.4704               
1.105              721.293             28.2277               
1.11              724.492             28.1939               
1.115              727.651             28.6414               
1.12              730.926             28.6714               
1.125              734.357             27.9199               
1.13              738.151             27.1206               
1.135              741.943             27.2563               
1.14              745.812             26.1888               
1.145              749.707             25.5678               
1.15              753.63             24.06               
1.155              757.585             22.5945               
1.16              761.552             21.3877               
1.165              765.27             20.3896               
1.17              768.794             20.9423               
1.175              772.045             21.8077               
1.18              775.127             22.4858               
1.185              777.855             23.7165               
1.19              780.106             24.7183               
1.195              782.081             23.6909               
1.2              783.94             24.2246               
1.205              785.722             23.8246               
1.21              787.379             24.0544               
1.215              788.74             25.2379               
1.22              789.867             26.5103               
1.225              790.654             27.3583               
1.23              791.393             27.4346               
1.235              792.017             28.0917               
1.24              792.845             26.3665               
1.245              794.226             25.0808               
1.25              796.057             22.6329               
1.255              798.426             21.1509               
1.26              800.997             20.7231               
1.265              803.492             21.1053               
1.27              805.938             20.9719               
1.275              808.77             19.4324               
1.28              811.885             19.338               
1.285              815.016             19.6549               
1.29              818.154             19.5744               
1.295              821.606             18.2289               
1.3              825.298             17.8363               
1.305              828.84             18.4975               
1.31              832.182             18.6186               
1.315              835.373             19.0686               
1.32              838.254             20.4845               
1.325              840.953             20.0328               
1.33              843.703             19.2897               
1.335              846.555             19.6651               
1.34              849.186             20.5425               
1.345              851.546             21.9068               
1.35              853.435             23.5134               
1.355              855.089             23.7635               
1.36              856.54             24.3144               
1.365              857.701             24.7168               
1.37              858.512             25.0409               
1.375              859.119             24.9302               
1.38              859.477             25.5817               
1.385              859.628             26.9771               
1.39              853.125             27.8151               
1.395              846.427             28.2912               
1.4              839.413             29.2228               
1.405              832.569             26.5615               
1.41              827.997             24.8798               
1.415              828.286             25.5429               
1.42              828.403             25.9367               
1.425              828.597             25.1221               
1.43              829.002             23.3803               
1.435              829.907             21.8437               
1.44              831.076             20.982               
1.445              832.552             19.5832               
1.45              834.645             16.4917               
1.455              837.064             16.2798               
1.46              839.886             13.9474               
1.465              843.17             13.4586               
1.47              846.445             13.8109               
1.475              849.579             14.4116               
1.48              852.527             14.8948               
1.485              855.278             15.9442               
1.49              857.829             14.9745               
1.495              860.597             15.0251               
1.5              863.254             15.6525               
1.505              865.931             15.3226               
1.51              868.674             15.305               
1.515              871.302             16.1014               
1.52              873.7             16.8625               
1.525              876.033             16.9673               
1.53              878.491             16.3421               
1.535              881.068             15.3899               
1.54              884.049             14.5243               
1.545              887.027             14.5856               
1.55              889.829             15.3484               
1.555              892.406             15.5909               
1.56              894.973             15.1448               
1.565              897.719             14.2029               
1.57              900.432             15.0668               
1.575              903.219             14.5648               
1.58              906.072             14.8398               
1.585              909.05             13.9732               
1.59              912.12             14.2903               
1.595              915.059             14.7072               
1.6              918.028             13.3689               
1.605              921.161             13.6916               
1.61              924.067             13.9806               
1.615              926.961             14.1384               
1.62              929.773             14.3668               
1.625              932.459             15.414               
1.63              935.02             15.6721               
1.635              937.571             15.9752               
1.64              940.074             16.1146               
1.645              942.382             16.9362               
1.65              944.36             18.1213               
1.655              945.938             19.2795               
1.66              946.989             20.884               
1.665              948.044             19.2993               
1.67              949.485             18.0537               
1.675              951.289             17.6435               
1.68              953.358             16.7382               
1.685              955.568             16.9632               
1.69              957.688             17.4506               
1.695              959.621             17.8451               
1.7              961.622             16.6328               
1.705              964.223             14.5982               
1.71              966.989             14.8832               
1.715              969.816             14.1158               
1.72              972.675             14.6314               
1.725              975.353             15.2509               
1.73              977.908             15.5914               
1.735              980.339             16.0859               
1.74              982.612             16.6123               
1.745              984.744             17.3653               
1.75              986.583             18.4593               
1.755              988.004             19.9742               
1.76              989.038             20.444               
1.765              990.233             19.1437               
1.77              991.64             19.3664               
1.775              993.001             18.8061               
1.78              994.797             17.4265               
1.785              996.695             17.6245               
1.79              998.478             18.1856               
1.795              1000.15             18.0716               
1.8              1002             16.9777               
1.805              1004.31             15.2375               
1.81              1006.95             14.8978               
1.815              1009.8             14.5347               
1.82              1012.73             14.3829               
1.825              1015.52             14.4968               
1.83              1018.19             15.0221               
1.835              1020.68             15.8699               
1.84              1022.86             17.0366               
1.845              1024.64             18.5237               
1.85              1026.08             19.5255               
1.855              1027.58             18.1036               
1.86              1029.35             18.4734               
1.865              1030.83             19.7549               
1.87              1031.99             20.2336               
1.875              1033.04             20.2595               
1.88              1034.07             20.4487               
1.885              1034.93             20.7638               
1.89              1036.27             18.049               
1.895              1038.3             16.4496               
1.9              1040.43             16.2763               
1.905              1042.64             15.7612               
1.91              1044.9             15.1113               
1.915              1047.62             13.0716               
1.92              1050.57             13.4838               
1.925              1053.46             13.4624               
1.93              1056.07             14.5361               
1.935              1058.33             15.3419               
1.94              1060.42             15.9569               
1.945              1062.23             16.8314               
1.95              1063.66             18.5488               
1.955              1064.6             19.765               
1.96              1065.19             20.786               
1.965              1065.51             21.4367               
1.97              1065.63             21.9866               
1.975              1066.03             20.7119               
1.98              1066.43             21.3107               
1.985              1066.64             21.0388               
1.99              1066.97             20.5045               
1.995              1067.77             18.7719               
