0.005              6.12324             46.335               
0.01              12.0577             46.2855               
0.015              17.9421             46.2818               
0.02              23.8941             46.216               
0.025              29.708             46.1248               
0.03              35.5289             45.9743               
0.035              41.2376             45.4685               
0.04              46.8719             45.5326               
0.045              52.4668             45.6724               
0.05              57.9402             45.8947               
0.055              63.3797             45.717               
0.06              68.8841             45.7444               
0.065              74.5389             45.8338               
0.07              80.4604             45.7325               
0.075              86.304             45.8946               
0.08              92.1117             46.0835               
0.085              97.7778             46.348               
0.09              103.099             46.7951               
0.095              108.119             47.3154               
0.1              113.663             47.6279               
0.105              119.49             47.6461               
0.11              125.396             47.8775               
0.115              131.378             48.1064               
0.12              137.174             48.1411               
0.125              142.919             48.2233               
0.13              148.398             48.4528               
0.135              154.07             48.7011               
0.14              159.668             49.0016               
0.145              165.012             48.5423               
0.15              170.418             49.0912               
0.155              175.72             49.1003               
0.16              180.973             49.5119               
0.165              185.916             49.3458               
0.17              191.46             49.3496               
0.175              197.116             49.4963               
0.18              202.962             49.5037               
0.185              209.045             49.4877               
0.19              215.392             49.0532               
0.195              221.307             47.9254               
0.2              226.613             46.0149               
0.205              232.821             45.4736               
0.21              239.309             45.1951               
0.215              245.042             45.4384               
0.22              250.661             45.6794               
0.225              255.562             46.2274               
0.23              260.031             46.0058               
0.235              265.06             45.5446               
0.24              269.517             46.3872               
0.245              274.105             47.3829               
0.25              279.049             48.0976               
0.255              283.672             49.4202               
0.26              287.492             51.2965               
0.265              289.488             51.4534               
0.27              288.932             49.141               
0.275              291.555             46.8275               
0.28              295.72             46.3742               
0.285              299.626             45.2212               
0.29              305.685             45.5288               
0.295              311.601             45.9848               
0.3              317.481             46.4571               
0.305              323.175             47.0693               
0.31              328.59             47.848               
0.315              333.044             47.074               
0.32              337.157             47.3               
0.325              340.513             45.4078               
0.33              343.48             45.5656               
0.335              345.866             44.0606               
0.34              351.277             44.434               
0.345              355.905             45.1353               
0.35              359.523             45.4291               
0.355              362.096             45.911               
0.36              366.025             43.0818               
0.365              370.225             42.2937               
0.37              374.8             40.7618               
0.375              378.485             37.4704               
0.38              384.076             36.5755               
0.385              390.373             36.5559               
0.39              396.69             36.582               
0.395              403.005             36.6514               
0.4              409.154             36.4917               
0.405              414.835             37.2098               
0.41              419.717             37.9263               
0.415              424.913             36.4588               
0.42              429.789             36.9564               
0.425              433.596             36.7501               
0.43              435.158             37.6719               
0.435              434.075             38.0599               
0.44              438.229             36.8381               
0.445              444.04             35.0321               
0.45              449.459             35.5611               
0.455              449.505             38.8091               
0.46              446.326             36.9797               
0.465              448.307             36.6237               
0.47              451.506             35.5876               
0.475              452.429             35.9015               
0.48              454.924             34.4452               
0.485              458.116             34.2143               
0.49              453.832             38.6305               
0.495              437.322             39.8624               
0.5              424.472             38.7612               
0.505              412.59             30.8863               
0.51              412.223             31.8965               
0.515              401.034             32.6486               
0.52              395.337             27.8283               
0.525              399.317             26.3066               
0.53              404.983             25.0719               
0.535              411.121             23.0759               
0.54              417.396             23.2209               
0.545              423.643             23.4179               
0.55              429.775             23.7236               
0.555              435.573             24.3443               
0.56              440.15             25.8583               
0.565              441.976             25.3777               
0.57              444.614             23.4525               
0.575              449.459             22.4308               
0.58              455.461             21.1878               
0.585              461.704             20.2934               
0.59              468.113             20.3085               
0.595              474.517             20.3392               
0.6              480.925             20.3526               
0.605              487.333             20.3798               
0.61              493.741             20.4147               
0.615              500.136             20.4329               
0.62              506.526             20.4339               
0.625              512.851             20.4971               
0.63              519.061             20.5373               
0.635              525.232             20.7461               
0.64              531.156             21.1448               
0.645              537.449             20.9276               
0.65              543.765             20.837               
0.655              549.755             21.1766               
0.66              556.009             21.0553               
0.665              562.268             21.0357               
0.67              568.341             21.269               
0.675              574.582             21.2667               
0.68              580.772             21.3156               
0.685              586.733             21.714               
0.69              592.745             21.0589               
0.695              598.879             21.0034               
0.7              603.906             21.6539               
0.705              602.274             22.7788               
0.71              591.742             22.6087               
0.715              579.523             23.5116               
0.72              553.003             21.8287               
0.725              540.75             15.9202               
0.73              542.115             15.7232               
0.735              539.341             15.6895               
0.74              538.888             13.0642               
0.745              545.305             13.0161               
0.75              551.72             12.9407               
0.755              558.132             12.9351               
0.76              564.545             12.8888               
0.765              570.955             12.8116               
0.77              577.368             12.7907               
0.775              583.78             12.7934               
0.78              590.189             12.8156               
0.785              596.594             12.8509               
0.79              602.995             12.8839               
0.795              609.395             12.9197               
0.8              615.784             12.924               
0.805              622.16             12.9106               
0.81              628.55             12.8994               
0.815              634.918             12.9291               
0.82              641.304             12.9517               
0.825              647.664             12.9342               
0.83              653.873             11.9822               
0.835              660.269             11.9639               
0.84              666.647             11.9704               
0.845              673.043             11.9552               
0.85              679.419             11.95               
0.855              685.813             11.9521               
0.86              692.183             11.9944               
0.865              698.561             12.0492               
0.87              704.937             12.0801               
0.875              711.308             12.087               
0.88              717.702             12.0722               
0.885              724.051             11.7865               
0.89              730.31             11.0971               
0.895              736.684             11.1249               
0.9              743.05             11.183               
0.905              749.432             11.1675               
0.91              755.787             11.2071               
0.915              761.903             11.7776               
0.92              766.528             14.1               
0.925              749.521             21.0954               
0.93              725.451             15.4713               
0.935              716.048             16.5594               
0.94              699.641             19.2483               
0.945              696.238             16.2183               
0.95              687.625             20.0347               
0.955              670.624             19.4709               
0.96              655.498             18.5109               
0.965              645.434             13.4045               
0.97              648.207             9.44267               
0.975              652.863             9.74326               
0.98              655.422             10.9882               
0.985              658.555             9.60581               
0.99              663.035             10.063               
0.995              664.903             10.6023               
1              668.226             9.55373               
1.005              672.423             10.242               
1.01              670.702             10.738               
1.015              673.792             9.64638               
1.02              677.538             10.5503               
1.025              673.079             11.058               
1.03              676.163             9.9655               
1.035              679.342             11.2107               
1.04              672.873             11.1285               
1.045              676.503             9.91471               
1.05              678.808             11.4017               
1.055              675.402             10.6985               
1.06              679.421             10.2873               
1.065              678.086             12.5629               
1.07              673.392             9.48892               
1.075              677.464             10.275               
1.08              673.505             12.0116               
1.085              670.835             9.71521               
1.09              675.018             10.3836               
1.095              673.463             10.909               
1.1              676.339             9.70328               
1.105              679.43             10.9645               
1.11              671.204             11.7999               
1.115              672.824             10.1568               
1.12              672.832             12.4009               
1.125              660.067             12.519               
1.13              661.211             9.8448               
1.135              664.804             10.6776               
1.14              666.067             10.5074               
1.145              670.112             10.0465               
1.15              671.647             11.7058               
1.155              669.461             10.0435               
1.16              673.533             10.2546               
1.165              670.845             12.8108               
1.17              666.1             9.61701               
1.175              670.406             10.2177               
1.18              669.281             11.4348               
1.185              671.624             9.54841               
1.19              675.761             10.2093               
1.195              673.559             10.8276               
1.2              676.31             9.88543               
1.205              679.704             10.9834               
1.21              672.712             11.4392               
1.215              674.505             9.79462               
1.22              677.417             11.1849               
1.225              669.497             11.4302               
1.23              672.917             10.0071               
1.235              675.809             11.3345               
1.24              674.163             10.5746               
1.245              678.231             10.0771               
1.25              677.335             12.2966               
1.255              672.813             9.6029               
1.26              677             10.3503               
1.265              674.18             11.8113               
1.27              674.062             9.55872               
1.275              678.164             10.2501               
1.28              675.787             10.8165               
1.285              678.603             9.88224               
1.29              681.761             11.1875               
1.295              673.645             11.6531               
1.3              675.882             10.0536               
1.305              674.991             12.4703               
1.31              662.223             11.9954               
1.315              664.49             9.92628               
1.32              667.901             10.942               
1.325              669.266             10.5314               
1.33              673.391             10.0014               
1.335              672.979             12.2451               
1.34              668             9.48464               
1.345              671.695             10.7027               
1.35              663.869             13.9285               
1.355              654.876             10.1888               
1.36              659.36             9.99027               
1.365              661.655             10.6132               
1.37              665.025             9.49883               
1.375              669.322             10.1195               
1.38              668.573             10.6848               
1.385              671.542             9.7485               
1.39              675.77             10.3247               
1.395              676.638             9.95483               
1.4              680.231             9.84555               
1.405              682.887             11.2755               
1.41              673.576             11.9012               
1.415              676.55             9.83633               
1.42              679.3             11.2549               
1.425              676.843             10.6541               
1.43              680.883             10.2208               
1.435              679.682             12.5971               
1.44              674.948             9.47214               
1.445              678.417             10.8758               
1.45              669.137             13.8332               
1.455              660.319             10.779               
1.46              664.217             9.9849               
1.465              665.469             10.2987               
1.47              668.864             9.54865               
1.475              672.792             10.3806               
1.48              669.712             10.8488               
1.485              672.729             10.0302               
1.49              673.55             11.8761               
1.495              660.701             13.6304               
1.5              659.774             9.82492               
1.505              663.559             10.5639               
1.51              663.92             10.2427               
1.515              667.797             9.8889               
1.52              671.204             10.8081               
1.525              671.008             10.4506               
1.53              674.873             10.077               
1.535              674.801             12.0284               
1.54              668.797             9.44292               
1.545              672.481             10.6459               
1.55              665.005             14.382               
1.555              654.068             10.6193               
1.56              657.968             9.77796               
1.565              659.893             11.385               
1.57              662.783             9.58403               
1.575              667.25             9.97809               
1.58              667.846             10.6537               
1.585              670.973             9.70018               
1.59              674.642             10.6103               
1.595              668.497             11.6775               
1.6              668.702             9.77663               
1.605              672.102             10.8824               
1.61              665.374             11.4632               
1.615              667.065             9.79098               
1.62              670.786             10.5891               
1.625              670.623             10.2392               
1.63              674.413             9.89645               
1.635              675.54             11.6761               
1.64              668.273             10.4315               
1.645              672.63             9.76689               
1.65              675.075             11.2718               
1.655              675.423             9.48313               
1.66              679.623             10.0604               
1.665              677.613             11.9504               
1.67              675.916             9.6488               
1.675              679.879             10.5478               
1.68              675.484             11.3968               
1.685              676.121             9.67421               
1.69              679.428             10.8864               
1.695              671.552             11.7673               
1.7              672.85             9.94909               
1.705              676.463             10.8427               
1.71              675.4             10.2461               
1.715              679.125             9.97011               
1.72              678.926             12.1288               
1.725              671.266             10.2679               
1.73              675.585             10.1481               
1.735              674.981             12.3498               
1.74              672.602             9.50595               
1.745              676.843             10.0845               
1.75              674.959             11.4654               
1.755              676.239             9.73876               
1.76              679.938             10.6226               
1.765              673.648             11.7771               
1.77              673.55             9.78356               
1.775              677             10.8521               
1.78              670.352             11.4168               
1.785              672.13             9.79086               
1.79              675.527             10.8647               
1.795              673.348             10.3467               
1.8              677.12             9.93478               
1.805              678.102             11.8553               
1.81              671.082             10.1674               
1.815              675.393             10.165               
1.82              675.146             12.2043               
1.825              674.294             9.50204               
1.83              678.565             10.066               
1.835              676.733             11.2399               
1.84              678.781             9.74391               
1.845              682.307             10.8833               
1.85              675.064             11.8563               
1.855              675.328             9.86209               
1.86              675.637             12.0857               
1.865              661.878             14.006               
1.87              659.937             9.87489               
1.875              663.886             10.5473               
1.88              665.704             10.1831               
1.885              669.597             9.811               
1.89              671.761             11.3756               
1.895              667.383             10.4446               
1.9              671.165             10.4346               
1.905              666.69             13.4743               
1.91              654.071             10.8298               
1.915              657.874             10.1029               
1.92              659.308             11.7422               
1.925              659.222             9.54676               
1.93              663.702             9.84702               
1.935              666.09             11.3075               
1.94              668.165             9.57796               
1.945              672.385             10.3514               
1.95              669.803             11.5908               
1.955              670.8             9.52981               
1.96              674.721             10.3634               
1.965              670.238             11.2092               
1.97              671.667             9.87809               
1.975              675.225             10.8903               
1.98              668.914             11.4062               
1.985              670.161             9.71427               
1.99              673.808             10.6351               
1.995              672.33             10.2873               
