0.005              5.54248             82.1677               
0.01              10.5686             74.1259               
0.015              16.6662             70.1895               
0.02              22.569             69.9316               
0.025              28.4269             66.6286               
0.03              34.1133             66.1315               
0.035              39.7661             66.0209               
0.04              45.4948             65.6511               
0.045              51.2051             65.7138               
0.05              56.851             65.8002               
0.055              62.4468             65.9001               
0.06              67.9564             66.0305               
0.065              73.2596             65.7716               
0.07              78.4524             65.8688               
0.075              84.0829             66.005               
0.08              89.4164             66.2606               
0.085              94.5801             64.5299               
0.09              100.315             64.6623               
0.095              106.276             64.5707               
0.1              112.161             67.4698               
0.105              117.869             64.1664               
0.11              123.833             64.2475               
0.115              129.815             64.4332               
0.12              135.75             64.5997               
0.125              141.718             64.782               
0.13              147.592             64.7634               
0.135              153.466             63.7832               
0.14              159.467             63.7688               
0.145              165.291             64.0001               
0.15              170.922             64.5338               
0.155              176.643             64.7989               
0.16              182.332             64.2319               
0.165              187.777             64.1929               
0.17              192.884             65.0172               
0.175              198.043             65.6441               
0.18              203.211             66.4033               
0.185              208.444             66.9154               
0.19              213.154             67.7001               
0.195              217.631             68.8772               
0.2              220.689             67.6321               
0.205              221.378             66.4762               
0.21              224.35             65.1004               
0.215              228.867             65.5976               
0.22              233.184             66.1217               
0.225              236.186             64.1911               
0.23              239.333             62.4306               
0.235              243.878             63.1136               
0.24              248.094             63.3453               
0.245              252.129             62.5201               
0.25              256.985             61.1003               
0.255              262.244             61.5927               
0.26              267.395             62.5299               
0.265              272.121             63.7416               
0.27              275.856             64.2787               
0.275              277.791             64.3288               
0.28              279.413             65.831               
0.285              281.281             67.2369               
0.29              283.938             65.9801               
0.295              286.651             66.5105               
0.3              283.28             69.7123               
0.305              282.15             66.6338               
0.31              284.225             66.1946               
0.315              288.084             66.387               
0.32              293.612             65.9334               
0.325              299.334             66.2205               
0.33              304.713             67.0135               
0.335              309.848             66.4691               
0.34              315.526             65.745               
0.345              321.008             66.6099               
0.35              325.817             68.0197               
0.355              329.101             67.0496               
0.36              331.604             63.8139               
0.365              335.459             59.7627               
0.37              339.227             59.3749               
0.375              343.786             57.1422               
0.38              349.864             57.2574               
0.385              355.706             57.724               
0.39              360.472             57.6144               
0.395              363.382             57.8597               
0.4              367.126             57.5462               
0.405              371.451             57.243               
0.41              377.287             57.4155               
0.415              382.846             56.1969               
0.42              388.99             54.5766               
0.425              394.836             54.8447               
0.43              400.035             55.7564               
0.435              403.029             55.2629               
0.44              404.278             55.2121               
0.445              409.448             54.3539               
0.45              415.518             54.3976               
0.455              421.673             54.618               
0.46              427.76             54.7913               
0.465              433.559             55.373               
0.47              437.557             57.0881               
0.475              437.144             57.1373               
0.48              437.053             55.155               
0.485              440.004             54.6143               
0.49              445.663             54.867               
0.495              450.438             56.2895               
0.5              447.629             57.5315               
0.505              441.349             56.9482               
0.51              434.061             59.1571               
0.515              425.354             60.3824               
0.52              424.629             58.1375               
0.525              417.066             56.7677               
0.53              419.511             55.4373               
0.535              422.938             56.2384               
0.54              426.945             54.3824               
0.545              432.063             49.6897               
0.55              437.937             46.3601               
0.555              444.029             44.5853               
0.56              450.219             44.2616               
0.565              456.273             43.944               
0.57              462.003             44.4061               
0.575              466.485             46.2526               
0.58              468.519             46.5996               
0.585              467.631             46.7876               
0.59              457.939             45.8964               
0.595              458.327             43.3219               
0.6              464.265             40.3381               
0.605              470.053             39.5323               
0.61              475.23             39.9038               
0.615              481.321             39.5464               
0.62              487.53             39.8572               
0.625              493.633             40.3066               
0.63              499.529             40.9279               
0.635              504.961             39.7843               
0.64              510.896             38.0595               
0.645              516.345             38.4768               
0.65              517.758             41.226               
0.655              510.017             39.5466               
0.66              514.665             37.3152               
0.665              520.755             37.8298               
0.67              526.325             38.4547               
0.675              527.969             40.5862               
0.68              519.587             39.3042               
0.685              522.298             39.5802               
0.69              519.061             40.9483               
0.695              514.878             37.9355               
0.7              519.913             36.6634               
0.705              524.175             36.8543               
0.71              528.151             36.8869               
0.715              531.692             37.9247               
0.72              528.045             39.0036               
0.725              531.114             36.9924               
0.73              535.615             36.9664               
0.735              539.99             36.7915               
0.74              544.207             37.9789               
0.745              539.32             40.9196               
0.75              536.472             37.1751               
0.755              541.466             36.6083               
0.76              546.166             36.5685               
0.765              550.999             36.4706               
0.77              555.54             36.8601               
0.775              560.874             36.2012               
0.78              566.791             36.9121               
0.785              570.698             39.2987               
0.79              562.173             41.093               
0.795              560.335             38.4428               
0.8              553.671             39.9283               
0.805              555.335             37.2751               
0.81              559.345             37.4352               
0.815              560.736             37.6503               
0.82              562.963             38.6707               
0.825              555.007             38.7318               
0.83              558.526             36.8511               
0.835              562.641             37.1433               
0.84              565.811             37.7532               
0.845              566.423             39.22               
0.85              559.264             38.1042               
0.855              563.497             36.9659               
0.86              566.581             37.9001               
0.865              568.478             38.0616               
0.87              566.248             39.4984               
0.875              562.253             37.1345               
0.88              566.538             37.1435               
0.885              568.684             38.5257               
0.89              569.811             38.8539               
0.895              564.48             39.682               
0.9              564.077             37.2726               
0.905              567.901             37.4698               
0.91              565.665             38.6409               
0.915              567.309             38.4173               
0.92              559.176             38.7809               
0.925              562.22             37.2775               
0.93              565.873             37.592               
0.935              566.745             37.5719               
0.94              566.47             39.3701               
0.945              559.619             37.866               
0.95              563.943             36.9433               
0.955              566.557             38.3192               
0.96              564.952             37.956               
0.965              562.645             39.4474               
0.97              558.764             37.0747               
0.975              563.105             37.0077               
0.98              565.926             38.2062               
0.985              568.083             38.7265               
0.99              562.32             39.6076               
0.995              561.222             37.3983               
1              565.292             37.1247               
1.005              567.744             38.3379               
1.01              569.915             38.312               
1.015              562.557             39.3789               
1.02              564.733             37.2233               
1.025              568.23             37.6433               
1.03              567.747             37.5647               
1.035              568.277             39.2075               
1.04              560.761             38.0103               
1.045              564.918             36.9609               
1.05              567.925             37.948               
1.055              568.713             37.9431               
1.06              566.525             39.5514               
1.065              562.317             37.1109               
1.07              566.574             37.1076               
1.075              568.927             38.3874               
1.08              570.572             38.8652               
1.085              564.334             39.6351               
1.09              563.728             37.3325               
1.095              567.597             37.4814               
1.1              565.88             38.8212               
1.105              567.425             38.6271               
1.11              559.529             38.9243               
1.115              562.203             37.2162               
1.12              565.817             37.5395               
1.125              566.516             37.5635               
1.13              566.725             39.2112               
1.135              559.333             37.9761               
1.14              563.539             36.9429               
1.145              566.536             37.9343               
1.15              567.307             37.8826               
1.155              565.383             39.8045               
1.16              560.917             37.0956               
1.165              565.293             36.9257               
1.17              568.616             37.7642               
1.175              571.023             38.6938               
1.18              565.187             39.6987               
1.185              563.978             37.3371               
1.19              567.897             37.4853               
1.195              566.594             39.1939               
1.2              568.035             38.2819               
1.205              560.56             39.2949               
1.21              562.833             37.2177               
1.215              566.55             37.431               
1.22              567.44             37.5442               
1.225              567.77             39.1448               
1.23              560.159             38.0342               
1.235              564.276             36.9581               
1.24              567.294             37.9187               
1.245              567.959             37.8635               
1.25              566.011             39.7889               
1.255              561.536             37.0966               
1.26              565.881             36.996               
1.265              568.922             38.2428               
1.27              570.89             38.5932               
1.275              565.55             39.7036               
1.28              564.539             37.3484               
1.285              568.422             37.465               
1.29              566.843             38.9746               
1.295              568.163             38.4808               
1.3              560.76             39.1344               
1.305              563.145             37.3479               
1.31              566.899             37.3912               
1.315              568.796             37.5695               
1.32              569.09             39.2455               
1.325              561.733             38.0131               
1.33              565.863             36.9397               
1.335              568.297             38.3883               
1.34              566.423             37.997               
1.345              563.892             39.4276               
1.35              560.233             37.0988               
1.355              564.504             37.0386               
1.36              567.03             38.3999               
1.365              568.808             38.8047               
1.37              563.422             39.6937               
1.375              562.998             37.2095               
1.38              567.069             37.2423               
1.385              568.805             38.3209               
1.39              570.777             38.4634               
1.395              562.647             38.8598               
1.4              565.635             37.1061               
1.405              569.114             37.7246               
1.41              568.484             37.5545               
1.415              569.029             39.2221               
1.42              562.139             37.9121               
1.425              566.369             36.9346               
1.43              569.284             37.9662               
1.435              571.094             38.2327               
1.44              567.169             39.4534               
1.445              564.354             37.1867               
1.45              568.467             37.2255               
1.455              569.945             38.8159               
1.46              571.199             38.2301               
1.465              564.649             39.824               
1.47              565.791             37.4604               
1.475              569.758             37.3043               
1.48              571.828             37.6239               
1.485              572.523             38.9968               
1.49              564.725             38.1822               
1.495              568.704             36.9106               
1.5              571.768             38.0214               
1.505              571.847             37.9358               
1.51              569.68             40.0078               
1.515              565.392             37.1718               
1.52              569.551             37.2069               
1.525              570.787             38.9341               
1.53              571.377             38.5168               
1.535              564.968             39.7353               
1.54              565.244             37.2592               
1.545              568.825             37.5823               
1.55              567.736             37.9782               
1.555              569.657             38.6213               
1.56              561.439             38.3668               
1.565              565.217             36.7645               
1.57              569.161             37.3793               
1.575              571.402             37.7279               
1.58              569.831             39.7351               
1.585              564.075             37.0939               
1.59              568.372             37.0218               
1.595              571.073             38.1546               
