5.000000000000000000e+06 1.066230000000000018e+03
5.000000000000000000e+06 8.739481250000000045e+02
5.000000000000000000e+06 9.473043355704699024e+02
5.000000000000000000e+06 9.399157222222222572e+02
