0.01              12.864             20.2928               
0.02              25.7281             20.2974               
0.03              38.5917             20.2972               
0.04              51.4546             20.2967               
0.05              64.3162             20.2963               
0.06              77.1762             20.2958               
0.07              90.0342             20.2951               
0.08              102.89             20.274               
0.09              115.743             20.279               
0.1              128.593             20.2785               
0.11              141.44             20.278               
0.12              154.283             20.2772               
0.13              167.122             20.2763               
0.14              179.957             20.2751               
0.15              192.788             20.2711               
0.16              205.615             20.2756               
0.17              218.437             20.2748               
0.18              231.253             20.2738               
0.19              244.065             20.2711               
0.2              256.871             20.2696               
0.21              269.672             20.2681               
0.22              282.467             20.2655               
0.23              295.256             20.2641               
0.24              308.04             20.2634               
0.25              320.817             20.2598               
0.26              333.59             20.2588               
0.27              346.357             20.2587               
0.28              359.117             20.259               
0.29              371.87             20.2596               
0.3              384.617             20.2605               
0.31              397.357             20.2645               
0.32              410.091             20.2632               
0.33              422.818             20.2571               
0.34              435.537             20.2603               
0.35              448.25             20.2641               
0.36              460.955             20.2686               
0.37              473.653             20.274               
0.38              486.343             20.2806               
0.39              499.027             20.2192               
0.4              511.702             20.234               
0.41              524.371             20.2421               
0.42              537.031             20.2536               
0.43              549.684             20.2665               
0.44              562.329             20.2807               
0.45              574.966             20.2968               
0.46              587.595             20.2933               
0.47              600.217             20.3163               
0.48              612.832             20.3384               
0.49              625.439             20.3625               
0.5              638.039             20.3889               
0.51              650.633             20.4174               
0.52              663.221             20.4486               
0.53              675.804             20.4823               
0.54              688.381             20.5167               
0.55              700.958             20.5612               
0.56              713.534             20.5615               
0.57              726.106             20.6069               
0.58              738.675             20.6326               
0.59              751.241             20.6817               
0.6              763.805             20.7355               
0.61              776.372             20.6553               
0.62              788.936             20.7018               
0.63              801.499             20.738               
0.64              814.065             20.7827               
0.65              826.629             20.8288               
0.66              839.192             20.8758               
0.67              851.753             20.924               
0.68              864.313             20.9856               
0.69              876.874             21.0354               
0.7              889.432             21.1038               
0.71              901.989             21.175               
0.72              914.544             21.2497               
0.73              927.101             21.2291               
0.74              939.656             21.3156               
0.75              952.207             21.405               
0.76              964.757             21.5108               
0.77              977.306             21.5383               
0.78              989.855             21.6204               
0.79              1002.41             21.6994               
0.8              1014.95             21.7852               
0.81              1027.5             21.8637               
0.82              1040.04             21.8592               
0.83              1052.59             21.8932               
0.84              1065.13             21.9708               
0.85              1077.66             22.0654               
0.86              1090.2             22.1161               
0.87              1102.73             22.184               
0.88              1115.26             22.2911               
0.89              1127.78             22.3317               
0.9              1140.31             22.4505               
0.91              1152.83             22.5333               
0.92              1165.35             22.6554               
0.93              1177.86             22.7824               
0.94              1190.37             22.9097               
0.95              1202.88             23.0116               
0.96              1215.38             23.1415               
0.97              1227.88             23.2724               
0.98              1240.38             23.3963               
0.99              1252.87             23.5003               
1              1265.36             23.6547               
1.01              1277.84             23.815               
1.02              1290.32             23.9757               
1.03              1302.8             24.1057               
1.04              1315.28             24.2458               
1.05              1327.74             24.4029               
1.06              1340.21             24.5807               
1.07              1352.67             24.7555               
1.08              1365.13             24.8453               
1.09              1377.59             24.9842               
1.1              1390.05             25.0469               
1.11              1402.5             25.2475               
1.12              1414.95             25.3879               
1.13              1427.4             25.5506               
1.14              1439.83             25.7172               
1.15              1452.27             25.8555               
1.16              1464.7             26.05               
1.17              1477.12             26.2451               
1.18              1489.53             26.3971               
1.19              1501.94             26.6018               
1.2              1514.35             26.7407               
1.21              1526.76             26.8865               
1.22              1539.15             27.1033               
1.23              1551.55             27.212               
1.24              1563.94             27.4097               
1.25              1576.32             27.6461               
1.26              1588.7             27.844               
1.27              1601.08             28.0483               
1.28              1613.45             28.1057               
1.29              1625.82             28.253               
1.3              1638.18             28.4266               
1.31              1650.54             28.6685               
1.32              1662.9             28.7793               
1.33              1675.25             29.0217               
1.33              1674.73             29.5036               
1.34              1687.07             29.735               
1.34              1686.54             30.241               
1.35              1698.86             30.4187               
1.35              1698.31             30.8696               
1.36              1710.63             31.0294               
1.36              1710.08             31.6761               
1.36              1709.52             32.092               
1.36              1708.95             32.7764               
1.37              1721.23             33.025               
1.37              1720.64             34.0407               
1.37              1720.04             34.8034               
1.37              1719.42             35.5074               
1.37              1718.8             36.0468               
1.37              1718.16             36.6429               
1.37              1717.51             37.3118               
1.37              1716.85             37.7352               
1.37              1716.18             38.1315               
1.38              1728.37             38.3864               
1.38              1727.68             39.4161               
1.38              1726.98             39.8944               
1.38              1726.26             40.6021               
1.38              1725.54             40.9705               
1.38              1724.8             41.874               
1.38              1724.05             42.5853               
1.38              1723.29             42.9864               
1.38              1722.52             43.1884               
1.38              1721.74             43.7317               
1.38              1720.94             44.4545               
1.38              1720.14             45.0234               
1.38              1719.32             45.5111               
1.38              1718.49             46.0667               
1.38              1717.65             46.6093               
1.38              1716.79             47.0288               
1.38              1715.93             47.6909               
1.38              1715.06             47.9547               
1.38              1714.17             48.4722               
1.38              1713.27             49.1394               
1.38              1712.36             49.833               
1.38              1711.43             50.4169               
1.38              1710.49             51.0788               
1.39              1722.4             51.4237               
1.39              1721.43             52.1641               
1.39              1720.45             53.1076               
1.39              1719.46             53.6605               
1.39              1718.47             54.3043               
1.39              1717.46             54.8966               
1.39              1716.44             55.5552               
1.39              1715.4             56.1306               
1.4              1727.22             56.2892               
1.4              1726.15             57.3933               
1.4              1725.07             58.0685               
1.4              1723.97             58.7675               
1.4              1722.86             59.4695               
1.4              1721.73             60.1601               
1.4              1720.58             60.8967               
1.4              1719.41             61.6253               
1.4              1718.23             62.2794               
1.4              1717.04             62.9279               
1.4              1715.83             63.713               
1.4              1714.61             64.1535               
1.4              1713.37             64.6931               
1.4              1712.13             65.2129               
1.4              1710.89             65.8168               
1.4              1709.64             66.4404               
1.4              1708.38             67.0257               
1.41              1719.98             67.3211               
1.41              1718.7             68.0058               
1.41              1717.41             68.6711               
1.41              1716.11             69.0464               
1.41              1714.79             69.6711               
1.41              1713.46             70.3512               
1.41              1712.11             70.9755               
1.41              1710.76             71.7842               
1.41              1709.4             72.2525               
1.41              1708.03             73.2054               
1.42              1719.52             73.7102               
1.42              1718.12             74.3779               
1.42              1716.71             75.2203               
1.42              1715.29             75.9455               
1.42              1713.85             76.807               
1.42              1712.39             77.4053               
1.42              1710.92             78.2336               
1.42              1709.44             78.9306               
1.42              1707.95             79.4563               
1.43              1719.3             79.9678               
1.43              1717.78             80.9074               
1.43              1716.24             81.7352               
1.43              1714.69             82.6048               
1.43              1713.13             83.2724               
1.43              1711.55             84.1647               
1.43              1709.95             84.9579               
1.43              1708.34             85.7695               
1.43              1706.7             86.7289               
1.44              1717.91             87.3306               
1.44              1716.23             88.1059               
1.44              1714.54             89.0389               
1.44              1712.83             89.8669               
1.44              1711.1             90.6786               
1.44              1709.36             91.6574               
1.44              1707.6             92.4919               
1.45              1718.68             93.0346               
1.45              1716.89             93.9788               
1.45              1715.08             94.9622               
1.45              1713.26             95.8157               
1.45              1711.43             96.9297               
1.45              1709.56             98.0187               
1.45              1707.7             98.9429               
1.45              1705.8             99.9945               
1.46              1716.75             100.534               
1.46              1714.83             101.601               
1.46              1712.89             102.566               
1.46              1710.93             103.416               
1.46              1708.96             104.315               
1.46              1706.96             105.347               
1.47              1717.82             106.08               
1.47              1715.79             107.159               
1.47              1713.75             108.217               
1.47              1711.69             109.162               
1.47              1709.6             110.305               
1.47              1707.5             111.428               
1.47              1705.39             112.56               
1.48              1716.13             113.394               
1.48              1713.99             114.555               
1.48              1711.82             115.466               
1.48              1709.65             116.471               
1.48              1707.45             117.392               
1.48              1705.23             118.551               
1.49              1715.87             119.359               
1.49              1713.63             120.393               
1.49              1711.39             121.737               
1.49              1709.13             122.609               
1.49              1706.88             123.506               
1.5              1717.47             124.38               
1.5              1715.18             125.257               
