0.005              6.43286             97.4035               
0.01              12.8651             96.5721               
0.015              19.2735             95.485               
0.02              25.633             95.2228               
0.025              31.9469             94.6359               
0.03              38.2123             94.0315               
0.035              44.4246             92.8425               
0.04              50.5872             99.3646               
0.045              56.6794             93.5445               
0.05              62.693             92.2615               
0.055              68.6613             91.523               
0.06              74.5786             90.7343               
0.065              80.4418             89.515               
0.07              86.2768             90.1319               
0.075              92.1007             88.336               
0.08              97.9226             87.8445               
0.085              103.717             87.4434               
0.09              109.482             85.7798               
0.095              115.241             85.4076               
0.1              120.962             84.4595               
0.105              126.647             84.1103               
0.11              132.287             84.028               
0.115              137.884             83.9149               
0.12              143.488             83.5892               
0.125              149.099             83.3062               
0.13              154.735             82.8663               
0.135              160.383             81.9877               
0.14              166.025             81.1771               
0.145              171.655             80.4111               
0.15              177.275             80.1817               
0.155              182.897             79.7596               
0.16              188.514             79.8081               
0.165              194.14             79.7491               
0.17              199.769             79.3624               
0.175              205.383             79.1291               
0.18              210.987             79.3091               
0.185              216.591             78.6985               
0.19              222.155             78.7708               
0.195              227.708             78.865               
0.2              233.234             78.5125               
0.205              238.734             78.7562               
0.21              244.201             78.7303               
0.215              249.67             77.6096               
0.22              255.155             77.0051               
0.225              260.639             77.2836               
0.23              266.124             77.5252               
0.235              271.61             77.1598               
0.24              277.075             81.6145               
0.245              282.525             78.2592               
0.25              287.977             78.1058               
0.255              293.417             78.1312               
0.26              298.872             78.3229               
0.265              304.323             78.2535               
0.27              309.735             87.4516               
0.275              315.078             87.8988               
0.28              320.364             88.0046               
0.285              325.622             84.962               
0.29              330.852             84.8752               
0.295              336.062             84.0042               
0.3              341.262             82.7921               
0.305              346.484             82.7886               
0.31              351.728             82.5128               
0.315              356.979             82.6035               
0.32              362.244             82.3424               
0.325              367.533             81.796               
0.33              372.791             82.1809               
0.335              378.034             82.6096               
0.34              383.245             83.0058               
0.345              388.403             83.1596               
0.35              393.51             83.058               
0.355              398.606             83.0879               
0.36              403.677             83.4503               
0.365              408.707             84.1034               
0.37              413.689             84.2588               
0.375              418.702             84.7117               
0.38              423.719             85.2589               
0.385              428.691             85.7769               
0.39              433.615             86.6154               
0.395              438.485             87.5508               
0.4              443.313             88.0068               
0.405              448.084             88.8742               
0.41              452.802             88.8764               
0.415              457.513             89.0552               
0.42              462.233             88.7814               
0.425              466.91             88.9177               
0.43              471.528             89.4283               
0.435              476.076             89.4081               
0.44              480.64             88.7249               
0.445              485.162             88.1184               
0.45              489.655             88.478               
0.455              494.069             88.753               
0.46              498.466             88.4033               
0.465              502.925             87.7307               
0.47              507.419             87.0086               
0.475              511.967             87.0755               
0.48              516.519             87.3372               
0.485              521.056             87.9117               
0.49              525.574             87.9902               
0.495              530.037             88.3233               
0.5              534.453             88.8082               
0.505              538.771             88.9152               
0.51              542.981             89.58               
0.515              547.061             90.3088               
0.52              551.065             89.7385               
0.525              555.067             90.6341               
0.53              559.035             90.6986               
0.535              562.942             90.4804               
0.54              566.82             90.2891               
0.545              570.618             90.6581               
0.55              574.354             91.1097               
0.555              578.029             92.1194               
0.56              581.701             93.1367               
0.565              585.343             94.2956               
0.57              588.987             95.0503               
0.575              592.547             96.366               
0.58              595.979             97.0068               
0.585              599.275             98.1797               
0.59              602.509             97.9645               
0.595              605.686             98.9374               
0.6              608.874             98.4842               
0.605              612.075             99.0327               
0.61              615.21             99.5178               
0.615              618.278             99.1372               
0.62              621.295             99.0547               
0.625              624.227             99.977               
0.63              627.046             100.476               
0.635              629.746             100.691               
0.64              632.485             100.585               
0.645              635.315             100.683               
0.65              638.107             101.661               
0.655              640.82             101.9               
0.66              643.658             101.057               
0.665              646.576             101.043               
0.67              649.465             101.695               
0.675              652.198             102.847               
0.68              654.801             104.002               
0.685              657.461             103.445               
0.69              660.109             103.795               
0.695              662.704             104.651               
0.7              665.257             105.532               
0.705              667.745             107.053               
0.71              670.122             107.87               
0.715              672.31             109.438               
0.72              674.356             110.221               
0.725              676.184             111.986               
0.73              677.769             112.118               
0.735              679.189             112.862               
0.74              680.359             115.003               
0.745              681.295             116.369               
0.75              682.001             117.035               
0.755              682.594             117.801               
0.76              683.078             118.703               
0.765              683.392             119.785               
0.77              683.474             120.768               
0.775              676.973             122.246               
0.78              670.437             122.213               
0.785              663.917             121.434               
0.79              661.362             120.253               
0.795              661.499             119.598               
0.8              661.881             118.308               
0.805              662.495             117.963               
0.81              663.14             118.341               
0.815              663.879             116.872               
0.82              664.751             113.963               
0.825              665.717             116.718               
0.83              666.727             116.144               
0.835              667.807             116.258               
0.84              668.779             116.542               
0.845              669.844             114.285               
0.85              670.882             113.626               
0.855              671.911             112.769               
0.86              673.048             111.512               
0.865              674.266             110.746               
0.87              675.461             109.956               
0.875              676.665             108.219               
0.88              677.916             107.1               
0.885              679.106             105.713               
0.89              680.308             105.426               
0.895              681.373             104.613               
0.9              682.661             102.731               
0.905              684.125             99.5827               
0.91              685.684             98.9002               
0.915              687.319             99.2613               
0.92              689.087             98.1454               
0.925              691.005             97.4624               
0.93              692.97             97.8367               
0.935              694.836             98.9862               
0.94              696.614             100.273               
0.945              698.192             101.167               
0.95              699.721             101.277               
0.955              701.187             102.135               
0.96              702.723             102.377               
0.965              704.294             102.276               
0.97              705.809             103.094               
0.975              707.187             103.686               
0.98              708.357             105.366               
0.985              709.41             106.047               
0.99              710.387             105.896               
0.995              711.263             106.389               
1              712             106.483               
1.005              712.53             107.514               
1.01              712.984             108.552               
1.015              713.276             111.024               
1.02              709.424             111.881               
1.025              705.561             111.767               
1.03              700.368             111.492               
1.035              700.45             111.377               
1.04              700.604             111.356               
1.045              700.735             111.847               
1.05              700.84             111.857               
1.055              701.001             111.367               
1.06              701.18             110.433               
1.065              701.477             109.704               
1.07              701.864             108.645               
1.075              702.176             109.058               
1.08              702.334             109.22               
1.085              702.561             108.923               
1.09              702.906             109.075               
1.095              703.402             108.023               
1.1              704.167             106.894               
1.105              705.083             105.865               
1.11              706.141             105.042               
1.115              707.285             105.553               
1.12              708.653             104.431               
1.125              710.545             102.305               
1.13              712.654             101.78               
1.135              714.878             103.483               
1.14              717.142             102.629               
1.145              719.351             111.066               
1.15              721.358             109.103               
1.155              723.144             109.492               
1.16              724.726             110.235               
1.165              726.211             108.912               
1.17              727.591             109.731               
1.175              728.999             107.017               
1.18              730.483             106.616               
1.185              731.884             105.688               
1.19              733.326             105.786               
1.195              734.589             106.627               
1.2              735.805             107.144               
1.205              736.943             107.883               
1.21              738.112             108.454               
1.215              739.318             107.7               
1.22              740.495             108.541               
1.225              741.542             108.941               
1.23              742.482             108.891               
1.235              743.3             108.713               
1.24              744.302             107.736               
1.245              745.356             105.746               
1.25              746.433             104.511               
1.255              747.447             104.696               
1.26              748.49             103.081               
1.265              749.532             102.219               
1.27              750.404             102.264               
1.275              751.085             102.267               
1.28              751.741             100.396               
1.285              752.432             99.4491               
1.29              753.146             97.6712               
1.295              754.035             96.9661               
1.3              754.908             97.8035               
1.305              755.754             98.3384               
1.31              756.606             98.0686               
1.315              757.514             98.3178               
1.32              758.37             99.8328               
1.325              759.233             99.1106               
1.33              760.006             100.792               
1.335              760.653             100.36               
1.34              761.354             98.882               
1.345              762.073             98.3483               
1.35              762.886             93.7791               
1.355              763.759             94.2395               
1.36              764.522             94.7483               
1.365              765.115             95.6666               
1.37              765.493             97.4033               
1.375              765.819             97.8861               
1.38              766.16             98.5722               
1.385              766.573             97.1719               
1.39              767.123             96.2158               
1.395              767.983             91.4957               
1.4              769.235             88.9533               
1.405              770.439             89.0774               
1.41              771.653             90.3572               
1.415              772.735             88.1015               
1.42              773.791             89.0944               
1.425              774.86             88.0604               
1.43              775.954             86.4552               
1.435              777.148             86.0426               
1.44              778.138             87.8632               
1.445              778.753             90.5506               
1.45              779.1             91.7822               
1.455              779.28             92.8595               
1.46              774.116             94.1284               
1.465              768.928             94.7574               
1.47              762.387             94.7888               
1.475              757.234             94.8135               
1.48              755.958             96.9378               
1.485              756.224             96.245               
1.49              756.687             94.3598               
1.495              757.356             92.8701               
1.5              758.008             93.1064               
1.505              758.589             94.3862               
1.51              759.074             94.9893               
1.515              759.761             93.3509               
1.52              760.62             92.1538               
1.525              761.52             91.1574               
1.53              762.666             89.5227               
1.535              763.817             89.2785               
1.54              764.926             88.6342               
1.545              765.976             89.5676               
1.55              766.938             89.7848               
1.555              767.842             89.7171               
1.56              768.628             90.0207               
1.565              769.222             91.2269               
1.57              769.782             91.3052               
1.575              770.49             91.2403               
1.58              771.296             91.6564               
1.585              772.23             91.9208               
1.59              773.252             89.9061               
1.595              774.456             87.7213               
1.6              775.627             88.2906               
1.605              776.8             88.1868               
1.61              778.02             87.7476               
1.615              779.376             85.0971               
1.62              780.722             85.0956               
1.625              782             81.9243               
1.63              783.204             82.4029               
1.635              784.22             82.3649               
1.64              785.031             83.2421               
1.645              785.764             83.7194               
1.65              786.293             84.1161               
1.655              786.798             84.3982               
1.66              787.482             82.4557               
1.665              788.471             82.5022               
1.67              789.415             83.7763               
1.675              790.512             82.8015               
1.68              791.7             81.6635               
1.685              792.987             81.152               
1.69              794.401             80.172               
1.695              795.705             80.195               
1.7              796.865             81.3352               
1.705              797.784             82.1569               
1.71              798.573             82.8126               
1.715              799.157             83.1588               
1.72              799.783             84.5728               
1.725              800.425             84.956               
1.73              801.094             85.0114               
1.735              801.793             83.2536               
1.74              802.717             82.1842               
1.745              803.727             80.7717               
1.75              804.79             81.2368               
1.755              805.785             81.2691               
1.76              806.754             81.6524               
1.765              807.698             80.9834               
1.77              808.568             80.876               
1.775              809.439             78.6329               
1.78              810.425             78.0695               
1.785              811.305             78.6121               
1.79              812.137             79.0393               
1.795              812.938             79.4019               
1.8              813.79             79.5272               
1.805              814.723             79.5511               
1.81              815.877             78.7936               
1.815              817.24             78.2332               
1.82              818.968             78.1826               
1.825              820.673             79.4861               
1.83              822.28             81.3104               
1.835              823.732             82.6845               
1.84              825.162             84.3622               
1.845              826.325             85.9471               
1.85              827.189             88.7514               
1.855              827.788             90.6097               
1.86              828.079             91.9646               
1.865              824.21             93.8211               
1.87              817.504             96.1952               
1.875              810.59             97.6678               
1.88              803.403             100.618               
1.885              795.876             102.74               
1.89              788.24             103.252               
1.895              780.792             102.029               
1.9              773.517             102.328               
1.905              766.407             100.366               
1.91              759.317             101.47               
1.915              752.24             101.157               
1.92              745.317             98.754               
1.925              738.469             98.8876               
1.93              731.665             99.4651               
1.935              724.838             100.047               
1.94              718.039             100.685               
1.945              711.317             101.386               
1.95              704.584             101.917               
1.955              697.943             101.136               
1.96              692.713             99.8441               
1.965              693.018             97.5588               
1.97              693.46             96.6252               
1.975              693.871             96.4758               
1.98              694.449             93.7622               
1.985              695.476             92.5381               
1.99              696.7             90.9929               
1.995              698.123             89.5951               
2              699.55             88.1674               
