1E-7	483.0337
1.17681E-7	483.03371
1.38489E-7	483.03371
1.62975E-7	483.03372
1.91791E-7	483.03373
2.25702E-7	483.03375
2.65609E-7	483.03376
3.12572E-7	483.03378
3.67838E-7	483.0338
4.32876E-7	483.03383
5.09414E-7	483.03386
5.99484E-7	483.03389
7.0548E-7	483.03393
8.30218E-7	483.03398
9.7701E-7	483.03403
1.14976E-6	483.0341
1.35305E-6	483.03418
1.59228E-6	483.03427
1.87382E-6	483.03438
2.20513E-6	483.0345
2.59502E-6	483.03465
3.05386E-6	483.03483
3.59381E-6	483.03503
4.22924E-6	483.03527
4.97702E-6	483.03556
5.85702E-6	483.0359
6.89261E-6	483.03629
8.11131E-6	483.03676
9.54548E-6	483.0373
1.12332E-5	483.03795
1.32194E-5	483.0387
1.55568E-5	483.0396
1.83074E-5	483.04065
2.15443E-5	483.04188
2.53536E-5	483.04333
2.98365E-5	483.04505
3.51119E-5	483.04706
4.13201E-5	483.04943
4.8626E-5	483.05221
5.72237E-5	483.05549
6.73415E-5	483.05936
7.92483E-5	483.0639
9.32603E-5	483.06925
1.0975E-4	483.07554
1.29155E-4	483.08294
1.51991E-4	483.09165
1.78865E-4	483.10191
2.1049E-4	483.11398
2.47708E-4	483.12818
2.91505E-4	483.14489
3.43047E-4	483.16455
4.03702E-4	483.1877
4.75081E-4	483.21493
5.59081E-4	483.24698
6.57933E-4	483.2847
7.74264E-4	483.32909
9.11163E-4	483.38132
0.00107	483.44279
0.00126	483.51513
0.00148	483.60027
0.00175	483.70045
0.00206	483.81834
0.00242	483.95708
0.00285	484.12036
0.00335	484.3125
0.00394	484.53861
0.00464	484.80471
0.00546	485.11785
0.00643	485.48636
0.00756	485.92002
0.0089	486.43037
0.01048	487.03094
0.01233	487.73771
0.01451	488.56944
0.01707	489.54824
0.02009	490.70009
0.02364	492.05561
0.02783	493.65079
0.03275	495.52803
0.03854	497.73718
0.04535	500.33694
0.05337	503.39637
0.0628	506.99674
0.07391	511.2337
0.08697	516.2198
0.10235	522.08751
0.12045	528.9927
0.14175	537.1188
0.16681	546.6817
0.1963	557.93544
0.23101	571.17897
0.27186	586.76411
0.31993	605.10489
0.37649	626.68855
0.44306	652.08845
0.5214	681.97935
0.61359	717.15533
