1.000000000000000000e+06 5.792646692524682521e+02
1.000000000000000000e+06 5.693385433255269845e+02
1.000000000000000000e+06 1.583809583333333421e+03
1.000000000000000000e+06 5.749781052631579996e+02
1.000000000000000000e+06 6.780024264326277716e+02
1.000000000000000000e+06 5.102627207122773711e+02
