{
	"info": {
		"_postman_id": "67da6052-b6dd-499d-9b37-8aaea96cb155",
		"name": "Distribution Center",
		"schema": "https://schema.getpostman.com/json/collection/v2.1.0/collection.json"
	},
	"item": [
		{
			"name": "Clock",
			"item": [
				{
					"name": "Register Service",
					"request": {
						"method": "POST",
						"header": [],
						"body": {
							"mode": "raw",
							"raw": "{\r\n    \"name\" : \"order\",\r\n    \"uri\" : \"http://localhost:5000/clock\"\r\n}",
							"options": {
								"raw": {
									"language": "json"
								}
							}
						},
						"url": {
							"raw": "http://localhost:9000/registry",
							"protocol": "http",
							"host": [
								"localhost"
							],
							"port": "9000",
							"path": [
								"registry"
							]
						}
					},
					"response": []
				}
			],
			"protocolProfileBehavior": {}
		},
		{
			"name": "Order Generation",
			"item": [
				{
					"name": "Get clock steps",
					"request": {
						"method": "PUT",
						"header": [],
						"body": {
							"mode": "raw",
							"raw": "{\r\n    \"step\" : 1\r\n}",
							"options": {
								"raw": {
									"language": "json"
								}
							}
						},
						"url": {
							"raw": "http://localhost:5000/clock",
							"protocol": "http",
							"host": [
								"localhost"
							],
							"port": "5000",
							"path": [
								"clock"
							]
						}
					},
					"response": []
				},
				{
					"name": "Get all Orders",
					"request": {
						"method": "GET",
						"header": [],
						"url": {
							"raw": "https://ordergen.herokuapp.com/orders/5f15f48f8784c9d310adcd9f",
							"protocol": "https",
							"host": [
								"ordergen",
								"herokuapp",
								"com"
							],
							"path": [
								"orders",
								"5f15f48f8784c9d310adcd9f"
							]
						}
					},
					"response": []
				},
				{
					"name": "Get Order By ID",
					"request": {
						"method": "GET",
						"header": [],
						"url": {
							"raw": "http://localhost:5000/orders/5f07f4dac2a445583c0bafdc",
							"protocol": "http",
							"host": [
								"localhost"
							],
							"port": "5000",
							"path": [
								"orders",
								"5f07f4dac2a445583c0bafdc"
							]
						}
					},
					"response": []
				},
				{
					"name": "Update order status",
					"request": {
						"method": "PUT",
						"header": [],
						"body": {
							"mode": "raw",
							"raw": "{\r\n    \"status\" : \"PROCESSING\"\r\n}",
							"options": {
								"raw": {
									"language": "json"
								}
							}
						},
						"url": {
							"raw": "https://ordergen.herokuapp.com/orders/5f15f48f8784c9d310adcd9f",
							"protocol": "https",
							"host": [
								"ordergen",
								"herokuapp",
								"com"
							],
							"path": [
								"orders",
								"5f15f48f8784c9d310adcd9f"
							]
						}
					},
					"response": []
				}
			],
			"protocolProfileBehavior": {}
		},
		{
			"name": "Worker Service",
			"item": [
				{
					"name": "Notify worker on success",
					"request": {
						"method": "POST",
						"header": [],
						"body": {
							"mode": "raw",
							"raw": "{\r\n    \"success\": true,\r\n    \"type\": \"MOVE\",\r\n    \"arguments\": [\r\n        \"a0.1\"\r\n    ],\r\n    \"step\": 2343\r\n}",
							"options": {
								"raw": {
									"language": "json"
								}
							}
						},
						"url": {
							"raw": "http://localhost:6000/notification/kalana",
							"protocol": "http",
							"host": [
								"localhost"
							],
							"port": "6000",
							"path": [
								"notification",
								"kalana"
							]
						}
					},
					"response": []
				},
				{
					"name": "Get workers ",
					"request": {
						"method": "GET",
						"header": [],
						"url": {
							"raw": "http://localhost:6000/workers",
							"protocol": "http",
							"host": [
								"localhost"
							],
							"port": "6000",
							"path": [
								"workers"
							]
						}
					},
					"response": []
				},
				{
					"name": "Asign worker orders",
					"request": {
						"method": "POST",
						"header": [],
						"body": {
							"mode": "raw",
							"raw": "{\r\n    \"order\": {\r\n        \"id\": \"5f15f48f8784c9d310adcd9f\",\r\n        \"items\": [\r\n            {\r\n                \"id\": \"Cake\",\r\n                \"name\": \"Cake\",\r\n                \"weight\": 1,\r\n                \"supplier\": \"CocaCola\",\r\n                \"location\": \"a0.2\",\r\n                \"quantity\": 2\r\n            },\r\n            {\r\n                \"id\": \"Coke\",\r\n                \"name\": \"Coke\",\r\n                \"weight\": 1,\r\n                \"supplier\": \"CocaCola\",\r\n                \"location\": \"a1.3\",\r\n                \"quantity\": 2\r\n            }\r\n        ],\r\n        \"status\": \"PROCESSING\",\r\n        \"weight\": 1\r\n  \r\n    }\r\n}",
							"options": {
								"raw": {
									"language": "json"
								}
							}
						},
						"url": {
							"raw": "http://localhost:6000/workers/kalana",
							"protocol": "http",
							"host": [
								"localhost"
							],
							"port": "6000",
							"path": [
								"workers",
								"kalana"
							]
						}
					},
					"response": []
				}
			],
			"protocolProfileBehavior": {}
		},
		{
			"name": "Simulator Service",
			"item": [
				{
					"name": "item",
					"item": [
						{
							"name": "get items",
							"request": {
								"method": "GET",
								"header": [
									{
										"key": "Accept",
										"value": "application/json",
										"type": "text"
									}
								],
								"url": {
									"raw": "http://localhost:8300/items",
									"protocol": "http",
									"host": [
										"localhost"
									],
									"port": "8300",
									"path": [
										"items"
									]
								}
							},
							"response": []
						},
						{
							"name": "get particular item",
							"request": {
								"method": "GET",
								"header": [
									{
										"key": "Accept",
										"value": "application/json",
										"type": "text"
									}
								],
								"url": {
									"raw": "http://localhost:8300/v1/items/1",
									"protocol": "http",
									"host": [
										"localhost"
									],
									"port": "8300",
									"path": [
										"v1",
										"items",
										"1"
									]
								}
							},
							"response": []
						},
						{
							"name": "create item",
							"request": {
								"method": "POST",
								"header": [
									{
										"key": "Content-Type",
										"value": "application/json",
										"type": "text"
									},
									{
										"key": "Accept",
										"value": "application/json",
										"type": "text"
									}
								],
								"body": {
									"mode": "raw",
									"raw": "{\r\n    \"item_name\": \"Kit Kat\",\r\n    \"supplier\": \"Nestle\",\r\n    \"weight\": 1,\r\n    \"location\" : \"a3\"\r\n}",
									"options": {
										"raw": {
											"language": "json"
										}
									}
								},
								"url": {
									"raw": "http://localhost:8300/v1/items",
									"protocol": "http",
									"host": [
										"localhost"
									],
									"port": "8300",
									"path": [
										"v1",
										"items"
									]
								}
							},
							"response": []
						}
					],
					"protocolProfileBehavior": {},
					"_postman_isSubFolder": true
				},
				{
					"name": "worker",
					"item": [
						{
							"name": "Update notification url",
							"request": {
								"method": "PATCH",
								"header": [],
								"body": {
									"mode": "raw",
									"raw": "{\r\n    \"notificationUri\" : \"http://localhost:9000/notification/mila\"\r\n}",
									"options": {
										"raw": {
											"language": "json"
										}
									}
								},
								"url": {
									"raw": "http://localhost:8300/workers/mila",
									"protocol": "http",
									"host": [
										"localhost"
									],
									"port": "8300",
									"path": [
										"workers",
										"mila"
									]
								}
							},
							"response": []
						},
						{
							"name": "Fetch all workers",
							"request": {
								"method": "GET",
								"header": [],
								"url": {
									"raw": "http://localhost:8300/workers",
									"protocol": "http",
									"host": [
										"localhost"
									],
									"port": "8300",
									"path": [
										"workers"
									]
								}
							},
							"response": []
						},
						{
							"name": "Worker next action",
							"request": {
								"method": "PUT",
								"header": [],
								"body": {
									"mode": "raw",
									"raw": "{\r\n    \"type\": \"move\",\r\n    \"arguments\": [\r\n        \"a1.1\"\r\n    ]\r\n}",
									"options": {
										"raw": {
											"language": "json"
										}
									}
								},
								"url": {
									"raw": "http://localhost:8300/workers/kalana/nextAction",
									"protocol": "http",
									"host": [
										"localhost"
									],
									"port": "8300",
									"path": [
										"workers",
										"kalana",
										"nextAction"
									]
								}
							},
							"response": []
						}
					],
					"protocolProfileBehavior": {},
					"_postman_isSubFolder": true
				},
				{
					"name": "Config",
					"item": [
						{
							"name": "Add Config",
							"protocolProfileBehavior": {
								"disableBodyPruning": true
							},
							"request": {
								"method": "GET",
								"header": [],
								"body": {
									"mode": "raw",
									"raw": "{\r\n    \"aisles\": 2,\r\n    \"sections\": 4,\r\n    \"shelves\": 2,\r\n    \"packagingAreas\": [\r\n        \"a1.0\",\r\n        \"a1.1\"\r\n    ],\r\n    \"workers\": [\r\n        {\r\n            \"name\": \"kalana\",\r\n            \"location\": \"a1.2\",\r\n            \"capacity\": 2\r\n        },\r\n        {\r\n            \"name\": \"kasun\",\r\n            \"location\": \"a1.3\",\r\n            \"capacity\": 2\r\n        }\r\n    ],\r\n    \"items\": [\r\n        {\r\n            \"id\": \"Coke\",\r\n            \"name\": \"Coke\",\r\n            \"supplier\": \"CocaCola\",\r\n            \"location\": \"a1.2\",\r\n            \"weight\": 1\r\n        },\r\n        {\r\n            \"id\": \"Cake\",\r\n            \"name\": \"Cake\",\r\n            \"supplier\": \"CocaCola\",\r\n            \"location\": \"a0.1\",\r\n            \"weight\": 1\r\n        }\r\n    ]\r\n}",
									"options": {
										"raw": {
											"language": "json"
										}
									}
								},
								"url": {
									"raw": "http://localhost:8300/configuration",
									"protocol": "http",
									"host": [
										"localhost"
									],
									"port": "8300",
									"path": [
										"configuration"
									]
								}
							},
							"response": []
						}
					],
					"protocolProfileBehavior": {},
					"_postman_isSubFolder": true
				},
				{
					"name": "map",
					"item": [
						{
							"name": "get all map",
							"request": {
								"method": "GET",
								"header": [],
								"url": {
									"raw": "http://localhost:8300/map",
									"protocol": "http",
									"host": [
										"localhost"
									],
									"port": "8300",
									"path": [
										"map"
									]
								}
							},
							"response": []
						}
					],
					"protocolProfileBehavior": {},
					"_postman_isSubFolder": true
				}
			],
			"protocolProfileBehavior": {}
		},
		{
			"name": "Managment",
			"item": [
				{
					"name": "Init service",
					"request": {
						"method": "GET",
						"header": [],
						"url": {
							"raw": "http://localhost:5500/init",
							"protocol": "http",
							"host": [
								"localhost"
							],
							"port": "5500",
							"path": [
								"init"
							]
						}
					},
					"response": []
				},
				{
					"name": "Get all orders for each worker",
					"request": {
						"method": "GET",
						"header": [],
						"url": {
							"raw": "http://localhost:5500/orders",
							"protocol": "http",
							"host": [
								"localhost"
							],
							"port": "5500",
							"path": [
								"orders"
							]
						}
					},
					"response": []
				},
				{
					"name": "Get all orders for specific worker",
					"request": {
						"method": "GET",
						"header": [],
						"url": {
							"raw": "http://localhost:5500/orders/kalana",
							"protocol": "http",
							"host": [
								"localhost"
							],
							"port": "5500",
							"path": [
								"orders",
								"kalana"
							]
						}
					},
					"response": []
				}
			],
			"protocolProfileBehavior": {}
		}
	],
	"protocolProfileBehavior": {}
}