<?xml version="1.0" encoding="UTF-8" standalone="no"?>
<svg
   xmlns:dc="http://purl.org/dc/elements/1.1/"
   xmlns:cc="http://creativecommons.org/ns#"
   xmlns:rdf="http://www.w3.org/1999/02/22-rdf-syntax-ns#"
   xmlns:svg="http://www.w3.org/2000/svg"
   xmlns="http://www.w3.org/2000/svg"
   xmlns:sodipodi="http://sodipodi.sourceforge.net/DTD/sodipodi-0.dtd"
   xmlns:inkscape="http://www.inkscape.org/namespaces/inkscape"
   data-name="Layer 1"
   id="Layer_1"
   viewBox="0 0 180 180"
   version="1.1"
   sodipodi:docname="link.svg"
   width="180"
   height="180"
   inkscape:version="0.92.4 5da689c313, 2019-01-14">
  <metadata
     id="metadata948">
    <rdf:RDF>
      <cc:Work
         rdf:about="">
        <dc:format>image/svg+xml</dc:format>
        <dc:type
           rdf:resource="http://purl.org/dc/dcmitype/StillImage" />
        <dc:title></dc:title>
      </cc:Work>
    </rdf:RDF>
  </metadata>
  <sodipodi:namedview
     pagecolor="#ffffff"
     bordercolor="#666666"
     borderopacity="1"
     objecttolerance="10"
     gridtolerance="10"
     guidetolerance="10"
     inkscape:pageopacity="0"
     inkscape:pageshadow="2"
     inkscape:window-width="3200"
     inkscape:window-height="1676"
     id="namedview946"
     showgrid="false"
     inkscape:zoom="3.6822917"
     inkscape:cx="88.449735"
     inkscape:cy="81.924698"
     inkscape:window-x="3840"
     inkscape:window-y="52"
     inkscape:window-maximized="1"
     inkscape:current-layer="Layer_1" />
  <defs
     id="defs938">
    <style
       id="style936">.cls-1{fill:none;stroke:#1d1d1b;stroke-linecap:round;stroke-linejoin:round;stroke-width:2px;}</style>
  </defs>
  <g
     data-name="&lt;Group&gt;"
     id="_Group_"
     transform="matrix(5.6257939,0,0,5.6257939,21.562218,22.490474)">
    <path
       class="cls-1"
       d="m 13.38,10.79 v 0 a 3.5,3.5 0 0 1 0,5 l -2.86,2.81 a 3.5,3.5 0 0 1 -5,0 v 0 a 3.5,3.5 0 0 1 0,-5 l 0.86,-0.86"
       data-name="&lt;Path&gt;"
       id="_Path_"
       inkscape:connector-curvature="0"
       style="fill:none;stroke:#1d1d1b;stroke-width:2px;stroke-linecap:round;stroke-linejoin:round" />
    <path
       class="cls-1"
       d="m 11,13.21 v 0 a 3.5,3.5 0 0 1 0,-5 L 13.81,5.4 a 3.5,3.5 0 0 1 5,0 v 0 a 3.5,3.5 0 0 1 0,5 l -0.86,0.86"
       data-name="&lt;Path&gt;"
       id="_Path_2"
       inkscape:connector-curvature="0"
       style="fill:none;stroke:#1d1d1b;stroke-width:2px;stroke-linecap:round;stroke-linejoin:round" />
  </g>
</svg>
