EESchema Schematic File Version 4
LIBS:KiCAD-cache
EELAYER 26 0
EELAYER END
$Descr A4 11693 8268
encoding utf-8
Sheet 1 1
Title "Troglometer"
Date "2020-01-01"
Rev "1.0"
Comp "CommonsLab.gr"
Comment1 ""
Comment2 ""
Comment3 ""
Comment4 "CC-by-SA 4.0 intl."
$EndDescr
Text Label 10300 1600 0    60   ~ 0
RAW
Text Label 9300 1600 2    60   ~ 0
1
Text Label 9300 1700 2    60   ~ 0
0
Text Label 9300 1800 2    60   ~ 0
Reset
Text Label 10300 1800 0    60   ~ 0
Reset
Text Label 9300 2000 2    60   ~ 0
2
Text Label 9300 2100 2    60   ~ 0
3
Text Label 9300 2200 2    60   ~ 0
4
Text Label 9300 2300 2    60   ~ 0
5
Text Label 9300 2400 2    60   ~ 0
6
Text Label 9300 2500 2    60   ~ 0
7
Text Label 9300 2600 2    60   ~ 0
8
Text Label 9300 2700 2    60   ~ 0
9
Text Label 10300 2700 0    60   ~ 0
10
Text Label 10300 2600 0    60   ~ 0
11
Text Label 10300 2500 0    60   ~ 0
12
Text Label 10300 2400 0    60   ~ 0
13
Text Label 10300 2300 0    60   ~ 0
A0
Text Label 10300 2200 0    60   ~ 0
A1
Text Label 10300 2100 0    60   ~ 0
A2
Text Label 10300 2000 0    60   ~ 0
A3
Text Label 10300 2850 0    60   ~ 0
A4
Text Label 10300 2950 0    60   ~ 0
A5
Text Notes 8550 600  0    50   ~ 0
Arduino Pro Mini 
Text Label 10300 3250 0    60   ~ 0
A7
Text Label 10300 3150 0    60   ~ 0
A6
$Comp
L Connector_Generic:Conn_01x02 P4
U 1 1 56D74FB3
P 10050 2950
F 0 "P4" H 10050 3050 50  0000 C CNN
F 1 "I2C" V 10150 2950 50  0000 C CNN
F 2 "Connector_PinSocket_2.54mm:PinSocket_1x02_P2.54mm_Vertical" H 10050 2950 50  0001 C CNN
F 3 "" H 10050 2950 50  0000 C CNN
	1    10050 2950
	-1   0    0    1   
$EndComp
$Comp
L Connector_Generic:Conn_01x02 P5
U 1 1 56D7505C
P 10050 3250
F 0 "P5" H 10050 3350 50  0000 C CNN
F 1 "ADC" V 10150 3250 50  0000 C CNN
F 2 "Connector_PinSocket_2.54mm:PinSocket_1x02_P2.54mm_Vertical" H 10050 3250 50  0001 C CNN
F 3 "" H 10050 3250 50  0000 C CNN
	1    10050 3250
	-1   0    0    1   
$EndComp
$Comp
L Connector_Generic:Conn_01x12 P1
U 1 1 56D754D1
P 9550 2100
F 0 "P1" H 9550 2700 50  0000 C CNN
F 1 "Digital" V 9650 2100 50  0000 C CNN
F 2 "Connector_PinSocket_2.54mm:PinSocket_1x12_P2.54mm_Vertical" H 9550 2100 50  0001 C CNN
F 3 "" H 9550 2100 50  0000 C CNN
	1    9550 2100
	1    0    0    -1  
$EndComp
$Comp
L Connector_Generic:Conn_01x12 P3
U 1 1 56D755F3
P 10050 2100
F 0 "P3" H 10050 2700 50  0000 C CNN
F 1 "Analog" V 10150 2100 50  0000 C CNN
F 2 "Connector_PinSocket_2.54mm:PinSocket_1x12_P2.54mm_Vertical" H 10050 2100 50  0001 C CNN
F 3 "" H 10050 2100 50  0000 C CNN
	1    10050 2100
	-1   0    0    -1  
$EndComp
$Comp
L power:GND #PWR03
U 1 1 56D756B8
P 9200 1900
F 0 "#PWR03" H 9200 1650 50  0001 C CNN
F 1 "GND" V 9200 1700 50  0000 C CNN
F 2 "" H 9200 1900 50  0000 C CNN
F 3 "" H 9200 1900 50  0000 C CNN
	1    9200 1900
	0    1    1    0   
$EndComp
$Comp
L power:GND #PWR04
U 1 1 56D75A03
P 10500 1700
F 0 "#PWR04" H 10500 1450 50  0001 C CNN
F 1 "GND" V 10500 1500 50  0000 C CNN
F 2 "" H 10500 1700 50  0000 C CNN
F 3 "" H 10500 1700 50  0000 C CNN
	1    10500 1700
	0    -1   -1   0   
$EndComp
$Comp
L power:VCC #PWR05
U 1 1 56D75A9D
P 10500 1900
F 0 "#PWR05" H 10500 1750 50  0001 C CNN
F 1 "VCC" V 10500 2100 50  0000 C CNN
F 2 "" H 10500 1900 50  0000 C CNN
F 3 "" H 10500 1900 50  0000 C CNN
	1    10500 1900
	0    1    1    0   
$EndComp
Wire Wire Line
	10300 2000 10250 2000
Wire Wire Line
	10250 2100 10300 2100
Wire Notes Line
	11200 3400 8500 3400
Text Notes 9650 1600 0    60   ~ 0
1
Wire Wire Line
	10250 1700 10500 1700
Wire Wire Line
	10250 1900 10500 1900
Wire Wire Line
	9200 1900 9350 1900
Text GLabel 10500 2200 2    39   Input ~ 0
ADC_WIND
Text GLabel 10500 2300 2    39   Input ~ 0
ADC_COND
Text GLabel 10500 2600 2    39   Output ~ 0
MOSI
Text GLabel 10500 2500 2    39   Input ~ 0
MISO
Text GLabel 10500 2700 2    39   Output ~ 0
CS_CAM
Text GLabel 9200 2700 0    39   Output ~ 0
CS_SD
Text GLabel 10500 2400 2    39   Output ~ 0
SCK
Text GLabel 10500 2850 2    39   BiDi ~ 0
SDA
Wire Wire Line
	10250 2400 10500 2400
Wire Wire Line
	10250 2500 10500 2500
Wire Wire Line
	10250 2600 10500 2600
Wire Wire Line
	10250 2700 10500 2700
Wire Wire Line
	10250 2850 10500 2850
Text GLabel 10500 2950 2    39   Output ~ 0
SCL
Wire Wire Line
	10250 2950 10500 2950
Text GLabel 10500 3150 2    39   Input ~ 0
+BATT25%
Text GLabel 10500 3250 2    39   Input ~ 0
+BATT50%
Wire Wire Line
	10250 3150 10500 3150
Wire Wire Line
	10250 3250 10500 3250
Wire Wire Line
	9200 2700 9350 2700
Wire Wire Line
	9200 1600 9350 1600
Wire Wire Line
	9200 1700 9350 1700
Text GLabel 9200 2000 0    39   Input ~ 0
INT_WIND
Wire Wire Line
	9200 2000 9350 2000
$Comp
L Connector:RJ45 J1
U 1 1 5E02D275
P 1650 4825
F 0 "J1" H 1320 4829 50  0000 R CNN
F 1 "COM-CHARGE" H 1320 4920 50  0000 R CNN
F 2 "Connector_RJ:RJ45_Amphenol_54602-x08_Horizontal" V 1650 4850 50  0001 C CNN
F 3 "~" V 1650 4850 50  0001 C CNN
	1    1650 4825
	1    0    0    1   
$EndComp
Text GLabel 2100 4525 2    39   Input ~ 0
TxD
Text GLabel 2100 4625 2    39   Output ~ 0
RxD
Wire Wire Line
	2050 4525 2100 4525
Wire Wire Line
	2100 4625 2050 4625
$Comp
L power:VCC #PWR0101
U 1 1 5E02FA49
P 2100 4725
F 0 "#PWR0101" H 2100 4575 50  0001 C CNN
F 1 "VCC" V 2100 4925 50  0000 C CNN
F 2 "" H 2100 4725 50  0000 C CNN
F 3 "" H 2100 4725 50  0000 C CNN
	1    2100 4725
	0    1    1    0   
$EndComp
Text GLabel 2100 5025 2    39   Output ~ 0
DTR
Wire Wire Line
	2050 4725 2100 4725
Wire Wire Line
	2100 5025 2050 5025
$Comp
L power:GND #PWR0102
U 1 1 5E034037
P 2100 5225
F 0 "#PWR0102" H 2100 4975 50  0001 C CNN
F 1 "GND" V 2100 5025 50  0000 C CNN
F 2 "" H 2100 5225 50  0000 C CNN
F 3 "" H 2100 5225 50  0000 C CNN
	1    2100 5225
	0    -1   -1   0   
$EndComp
Text Notes 2075 5150 0    39   ~ 0
(ADC)
Text Notes 2075 4950 0    39   ~ 0
(FLASH)
$Comp
L Connector:RJ45 J2
U 1 1 5E0372D7
P 1650 5825
F 0 "J2" H 1320 5829 50  0000 R CNN
F 1 "WATER-SOIL" H 1320 5920 50  0000 R CNN
F 2 "Connector_RJ:RJ45_Amphenol_54602-x08_Horizontal" V 1650 5850 50  0001 C CNN
F 3 "~" V 1650 5850 50  0001 C CNN
	1    1650 5825
	1    0    0    1   
$EndComp
Text GLabel 2100 5525 2    39   BiDi ~ 0
SDA
Text GLabel 2100 5625 2    39   Input ~ 0
SCL
Wire Wire Line
	2050 5525 2100 5525
Wire Wire Line
	2100 5625 2050 5625
Text GLabel 2100 6025 2    39   BiDi ~ 0
DS
Wire Wire Line
	2050 5725 2100 5725
Wire Wire Line
	2100 6025 2050 6025
$Comp
L power:GND #PWR0104
U 1 1 5E0372EA
P 2100 6225
F 0 "#PWR0104" H 2100 5975 50  0001 C CNN
F 1 "GND" V 2100 6025 50  0000 C CNN
F 2 "" H 2100 6225 50  0000 C CNN
F 3 "" H 2100 6225 50  0000 C CNN
	1    2100 6225
	0    -1   -1   0   
$EndComp
Wire Wire Line
	2050 6225 2100 6225
Text GLabel 2100 6125 2    39   Output ~ 0
ADC_COND
Text Notes 2075 5950 0    39   ~ 0
(FLASH)
Wire Wire Line
	2050 6125 2100 6125
Text Notes 2075 5850 0    39   ~ 0
(+BATT)
$Comp
L Connector:RJ45 J3
U 1 1 5E039F6D
P 1650 6825
F 0 "J3" H 1320 6829 50  0000 R CNN
F 1 "AIR-FLASH" H 1320 6920 50  0000 R CNN
F 2 "Connector_RJ:RJ45_Amphenol_54602-x08_Horizontal" V 1650 6850 50  0001 C CNN
F 3 "~" V 1650 6850 50  0001 C CNN
	1    1650 6825
	1    0    0    1   
$EndComp
Text GLabel 2100 6525 2    39   BiDi ~ 0
SDA
Text GLabel 2100 6625 2    39   Input ~ 0
SCL
Wire Wire Line
	2050 6525 2100 6525
Wire Wire Line
	2100 6625 2050 6625
Text GLabel 2100 7025 2    39   Output ~ 0
INT_WIND
Wire Wire Line
	2050 6725 2100 6725
Wire Wire Line
	2100 7025 2050 7025
$Comp
L power:GND #PWR0106
U 1 1 5E039F80
P 2100 7225
F 0 "#PWR0106" H 2100 6975 50  0001 C CNN
F 1 "GND" V 2100 7025 50  0000 C CNN
F 2 "" H 2100 7225 50  0000 C CNN
F 3 "" H 2100 7225 50  0000 C CNN
	1    2100 7225
	0    -1   -1   0   
$EndComp
Wire Wire Line
	2050 7225 2100 7225
Text GLabel 2100 7125 2    39   Output ~ 0
ADC_WIND
Wire Wire Line
	2050 7125 2100 7125
Text Notes 2075 6850 0    39   ~ 0
(+BATT)
$Comp
L power:+12V #PWR0107
U 1 1 5E042AD1
P 2100 6925
F 0 "#PWR0107" H 2100 6775 50  0001 C CNN
F 1 "+12V" V 2100 7050 50  0000 L CNN
F 2 "" H 2100 6925 50  0001 C CNN
F 3 "" H 2100 6925 50  0001 C CNN
	1    2100 6925
	0    1    1    0   
$EndComp
$Comp
L Connector_Generic:Conn_01x06 J5
U 1 1 5E044C20
P 10100 3975
F 0 "J5" H 10200 3925 50  0000 C CNN
F 1 "RTC" H 10100 4275 50  0000 C CNN
F 2 "Connector_PinSocket_2.54mm:PinSocket_1x06_P2.54mm_Horizontal" H 10100 3975 50  0001 C CNN
F 3 "~" H 10100 3975 50  0001 C CNN
	1    10100 3975
	-1   0    0    -1  
$EndComp
$Comp
L Connector_Generic:Conn_01x08 J4
U 1 1 5E044CE6
P 9150 4075
F 0 "J4" H 9250 4075 50  0000 C CNN
F 1 "CAM" H 9150 4475 50  0000 C CNN
F 2 "Connector_PinSocket_2.54mm:PinSocket_1x08_P2.54mm_Horizontal" H 9150 4075 50  0001 C CNN
F 3 "~" H 9150 4075 50  0001 C CNN
	1    9150 4075
	-1   0    0    -1  
$EndComp
Wire Wire Line
	2050 6925 2100 6925
Text GLabel 9200 2200 0    39   BiDi ~ 0
DS
Text GLabel 9400 3775 2    39   Input ~ 0
CS_CAM
Text GLabel 9400 3875 2    39   Input ~ 0
MOSI
Text GLabel 9400 3975 2    39   Output ~ 0
MISO
Text GLabel 9400 4075 2    39   Input ~ 0
SCK
$Comp
L power:GND #PWR0109
U 1 1 5E078468
P 9400 4175
F 0 "#PWR0109" H 9400 3925 50  0001 C CNN
F 1 "GND" V 9400 3975 50  0000 C CNN
F 2 "" H 9400 4175 50  0000 C CNN
F 3 "" H 9400 4175 50  0000 C CNN
	1    9400 4175
	0    -1   -1   0   
$EndComp
$Comp
L power:+3V3 #PWR0110
U 1 1 5E0784A4
P 9400 4275
F 0 "#PWR0110" H 9400 4125 50  0001 C CNN
F 1 "+3V3" V 9415 4403 50  0000 L CNN
F 2 "" H 9400 4275 50  0001 C CNN
F 3 "" H 9400 4275 50  0001 C CNN
	1    9400 4275
	0    1    1    0   
$EndComp
Text GLabel 9400 4375 2    39   BiDi ~ 0
SDA
Text GLabel 9400 4475 2    39   Input ~ 0
SCL
Wire Wire Line
	9350 3775 9400 3775
Wire Wire Line
	9350 3875 9400 3875
Wire Wire Line
	9350 3975 9400 3975
Wire Wire Line
	9350 4075 9400 4075
Wire Wire Line
	9350 4175 9400 4175
Wire Wire Line
	9350 4275 9400 4275
Wire Wire Line
	9350 4375 9400 4375
Wire Wire Line
	9350 4475 9400 4475
Text GLabel 10350 3775 2    39   Output ~ 0
32kHz
Text GLabel 9200 2100 0    39   Input ~ 0
SQW
Text GLabel 10350 3975 2    39   Input ~ 0
SCL
Text GLabel 10350 4075 2    39   BiDi ~ 0
SDA
$Comp
L power:+3V3 #PWR0111
U 1 1 5E084B20
P 10350 4175
F 0 "#PWR0111" H 10350 4025 50  0001 C CNN
F 1 "+3V3" V 10365 4303 50  0000 L CNN
F 2 "" H 10350 4175 50  0001 C CNN
F 3 "" H 10350 4175 50  0001 C CNN
	1    10350 4175
	0    1    1    0   
$EndComp
$Comp
L power:GND #PWR0112
U 1 1 5E084B3F
P 10350 4275
F 0 "#PWR0112" H 10350 4025 50  0001 C CNN
F 1 "GND" V 10350 4075 50  0000 C CNN
F 2 "" H 10350 4275 50  0000 C CNN
F 3 "" H 10350 4275 50  0000 C CNN
	1    10350 4275
	0    -1   -1   0   
$EndComp
Wire Wire Line
	10300 3775 10350 3775
Wire Wire Line
	10300 3875 10350 3875
Wire Wire Line
	10300 3975 10350 3975
Wire Wire Line
	10300 4075 10350 4075
Wire Wire Line
	10300 4175 10350 4175
Wire Wire Line
	10300 4275 10350 4275
Text GLabel 10350 3875 2    39   Output ~ 0
SQW
$Comp
L Connector_Generic:Conn_01x06 J7
U 1 1 5E09FD50
P 10100 4950
F 0 "J7" H 10200 4900 50  0000 C CNN
F 1 "BME280" H 10100 5250 50  0000 C CNN
F 2 "Connector_Molex:Molex_KK-254_AE-6410-06A_1x06_P2.54mm_Vertical" H 10100 4950 50  0001 C CNN
F 3 "~" H 10100 4950 50  0001 C CNN
	1    10100 4950
	-1   0    0    -1  
$EndComp
$Comp
L power:+3V3 #PWR0113
U 1 1 5E09FE07
P 10650 4750
F 0 "#PWR0113" H 10650 4600 50  0001 C CNN
F 1 "+3V3" V 10665 4878 50  0000 L CNN
F 2 "" H 10650 4750 50  0001 C CNN
F 3 "" H 10650 4750 50  0001 C CNN
	1    10650 4750
	1    0    0    -1  
$EndComp
$Comp
L power:GND #PWR0114
U 1 1 5E09FE28
P 10350 4850
F 0 "#PWR0114" H 10350 4600 50  0001 C CNN
F 1 "GND" V 10350 4650 50  0000 C CNN
F 2 "" H 10350 4850 50  0000 C CNN
F 3 "" H 10350 4850 50  0000 C CNN
	1    10350 4850
	0    -1   -1   0   
$EndComp
Text GLabel 10350 4950 2    39   Input ~ 0
SCL
Text GLabel 10350 5050 2    39   BiDi ~ 0
SDA
Text GLabel 10350 5150 2    39   Input ~ 0
CSB
Text GLabel 10750 5250 2    39   Input ~ 0
SDO
Wire Wire Line
	10350 4850 10300 4850
Wire Wire Line
	10300 4950 10350 4950
Wire Wire Line
	10350 5050 10300 5050
Wire Wire Line
	10300 5150 10350 5150
$Comp
L Connector_Generic:Conn_01x02 J8
U 1 1 5E0ACC61
P 10125 5950
F 0 "J8" H 10225 5900 50  0000 C CNN
F 1 "LED" H 10125 6050 50  0000 C CNN
F 2 "LED_THT:LED_D5.0mm" H 10125 5950 50  0001 C CNN
F 3 "~" H 10125 5950 50  0001 C CNN
	1    10125 5950
	-1   0    0    -1  
$EndComp
$Comp
L power:GND #PWR0115
U 1 1 5E0ACDF4
P 10375 6050
F 0 "#PWR0115" H 10375 5800 50  0001 C CNN
F 1 "GND" V 10375 5850 50  0000 C CNN
F 2 "" H 10375 6050 50  0000 C CNN
F 3 "" H 10375 6050 50  0000 C CNN
	1    10375 6050
	0    -1   -1   0   
$EndComp
Text GLabel 10375 5950 2    39   Input ~ 0
LED
Wire Wire Line
	10325 5950 10375 5950
Wire Wire Line
	10325 6050 10375 6050
Text GLabel 9200 2300 0    39   Output ~ 0
LED
$Comp
L Connector_Generic:Conn_01x06 J6
U 1 1 5E0B68B3
P 9150 4950
F 0 "J6" H 9250 4900 50  0000 C CNN
F 1 "uSD" H 9150 5250 50  0000 C CNN
F 2 "Connector_PinSocket_2.54mm:PinSocket_1x06_P2.54mm_Vertical" H 9150 4950 50  0001 C CNN
F 3 "~" H 9150 4950 50  0001 C CNN
	1    9150 4950
	-1   0    0    -1  
$EndComp
$Comp
L power:+3V3 #PWR0116
U 1 1 5E0B9115
P 9400 4750
F 0 "#PWR0116" H 9400 4600 50  0001 C CNN
F 1 "+3V3" V 9415 4878 50  0000 L CNN
F 2 "" H 9400 4750 50  0001 C CNN
F 3 "" H 9400 4750 50  0001 C CNN
	1    9400 4750
	0    1    1    0   
$EndComp
$Comp
L power:GND #PWR0117
U 1 1 5E0B91AF
P 9400 5250
F 0 "#PWR0117" H 9400 5000 50  0001 C CNN
F 1 "GND" V 9400 5050 50  0000 C CNN
F 2 "" H 9400 5250 50  0000 C CNN
F 3 "" H 9400 5250 50  0000 C CNN
	1    9400 5250
	0    -1   -1   0   
$EndComp
Text GLabel 9400 4850 2    39   Input ~ 0
CS_SD
Text GLabel 9400 4950 2    39   Input ~ 0
MOSI
Text GLabel 9400 5050 2    39   Input ~ 0
SCK
Text GLabel 9400 5150 2    39   Output ~ 0
MISO
Wire Wire Line
	9400 4750 9350 4750
Wire Wire Line
	9350 4850 9400 4850
Wire Wire Line
	9400 4950 9350 4950
Wire Wire Line
	9350 5050 9400 5050
Wire Wire Line
	9400 5150 9350 5150
Wire Wire Line
	9350 5250 9400 5250
$Comp
L Regulator_Linear:LP2985-3.3 U2
U 1 1 5E0C9B12
P 3925 2950
F 0 "U2" H 3925 3292 50  0000 C CNN
F 1 "LP2985-3.3" H 3925 3201 50  0000 C CNN
F 2 "Package_TO_SOT_SMD:SOT-23-5" H 3925 3275 50  0001 C CNN
F 3 "http://www.ti.com/lit/ds/symlink/lp2985.pdf" H 3925 2950 50  0001 C CNN
	1    3925 2950
	1    0    0    -1  
$EndComp
$Comp
L power:GND #PWR0118
U 1 1 5E0C9D70
P 4325 3650
F 0 "#PWR0118" H 4325 3400 50  0001 C CNN
F 1 "GND" V 4325 3450 50  0000 C CNN
F 2 "" H 4325 3650 50  0000 C CNN
F 3 "" H 4325 3650 50  0000 C CNN
	1    4325 3650
	1    0    0    -1  
$EndComp
$Comp
L power:+BATT #PWR0119
U 1 1 5E0C9E3F
P 2675 4750
F 0 "#PWR0119" H 2675 4600 50  0001 C CNN
F 1 "+BATT" H 2650 4900 50  0000 C CNN
F 2 "" H 2675 4750 50  0001 C CNN
F 3 "" H 2675 4750 50  0001 C CNN
	1    2675 4750
	1    0    0    -1  
$EndComp
Text GLabel 9200 2500 0    39   Output ~ 0
PWR_PERI
Text GLabel 3450 2950 0    39   Input ~ 0
PWR_PERI
$Comp
L power:+3V3 #PWR0120
U 1 1 5E0CA002
P 4750 2850
F 0 "#PWR0120" H 4750 2700 50  0001 C CNN
F 1 "+3V3" V 4765 2978 50  0000 L CNN
F 2 "" H 4750 2850 50  0001 C CNN
F 3 "" H 4750 2850 50  0001 C CNN
	1    4750 2850
	0    1    1    0   
$EndComp
Wire Wire Line
	3925 3250 3925 3425
$Comp
L Device:C_Small C1
U 1 1 5E0CFF01
P 4325 3125
F 0 "C1" H 4417 3171 50  0000 L CNN
F 1 "10nF" H 4417 3080 50  0000 L CNN
F 2 "Capacitor_SMD:C_1206_3216Metric_Pad1.42x1.75mm_HandSolder" H 4325 3125 50  0001 C CNN
F 3 "~" H 4325 3125 50  0001 C CNN
	1    4325 3125
	1    0    0    -1  
$EndComp
$Comp
L Device:C_Small C2
U 1 1 5E0CFFBE
P 4725 3125
F 0 "C2" H 4817 3171 50  0000 L CNN
F 1 "10uF" H 4817 3080 50  0000 L CNN
F 2 "Capacitor_SMD:C_1206_3216Metric_Pad1.42x1.75mm_HandSolder" H 4725 3125 50  0001 C CNN
F 3 "~" H 4725 3125 50  0001 C CNN
	1    4725 3125
	1    0    0    -1  
$EndComp
Wire Wire Line
	4325 2850 4725 2850
Wire Wire Line
	4725 3025 4725 2850
Connection ~ 4725 2850
Wire Wire Line
	4725 2850 4750 2850
Wire Wire Line
	4325 3025 4325 2950
Wire Wire Line
	3925 3425 4325 3425
Wire Wire Line
	4725 3425 4725 3225
Wire Wire Line
	4325 3225 4325 3425
Connection ~ 4325 3425
Wire Wire Line
	4325 3425 4725 3425
Wire Wire Line
	3475 2850 3525 2850
Wire Notes Line
	2975 2375 5225 2375
Wire Notes Line
	5225 4000 2975 4000
Text Notes 3000 2475 0    50   ~ 0
Peripherals power
$Comp
L Transistor_FET:IRF7309IPBF Q2
U 2 1 5E0ADE73
P 3700 1175
F 0 "Q2" V 4028 1175 50  0000 C CNN
F 1 "IRF7309IPBF" V 3937 1175 50  0000 C CNN
F 2 "Package_SO:SOIC-8_3.9x4.9mm_P1.27mm" H 3900 1100 50  0001 L CNN
F 3 "http://www.irf.com/product-info/datasheets/data/irf7309ipbf.pdf" H 3700 1175 50  0001 L CNN
	2    3700 1175
	0    1    -1   0   
$EndComp
$Comp
L Transistor_FET:IRF7309IPBF Q2
U 1 1 5E0ADF3C
P 3800 1625
F 0 "Q2" H 3600 1700 50  0000 L CNN
F 1 "IRF7309IPBF" H 3350 1775 50  0000 L CNN
F 2 "Package_SO:SOIC-8_3.9x4.9mm_P1.27mm" H 4000 1550 50  0001 L CNN
F 3 "http://www.irf.com/product-info/datasheets/data/irf7309ipbf.pdf" H 3800 1625 50  0001 L CNN
	1    3800 1625
	-1   0    0    -1  
$EndComp
Wire Wire Line
	3700 1825 3700 1875
$Comp
L Device:R_Small R4
U 1 1 5E108B84
P 3400 1250
F 0 "R4" H 3342 1204 50  0000 R CNN
F 1 "470k" H 3342 1295 50  0000 R CNN
F 2 "Resistor_SMD:R_1206_3216Metric_Pad1.42x1.75mm_HandSolder" H 3400 1250 50  0001 C CNN
F 3 "~" H 3400 1250 50  0001 C CNN
	1    3400 1250
	1    0    0    1   
$EndComp
Wire Wire Line
	3400 1150 3400 1075
Wire Wire Line
	3400 1350 3400 1400
$Comp
L Device:R_Small R5
U 1 1 5E120F10
P 4025 1750
F 0 "R5" H 3967 1704 50  0000 R CNN
F 1 "100k" H 3967 1795 50  0000 R CNN
F 2 "Resistor_SMD:R_1206_3216Metric_Pad1.42x1.75mm_HandSolder" H 4025 1750 50  0001 C CNN
F 3 "~" H 4025 1750 50  0001 C CNN
	1    4025 1750
	-1   0    0    1   
$EndComp
Wire Wire Line
	3700 1375 3700 1400
Wire Wire Line
	3400 1075 3500 1075
Wire Wire Line
	3400 1400 3700 1400
Connection ~ 3700 1400
Wire Wire Line
	3700 1400 3700 1425
$Comp
L Switch:SW_Push SW1
U 1 1 5E15BF26
P 3400 1625
F 0 "SW1" V 3475 1850 50  0000 R CNN
F 1 "START" V 3350 1725 50  0000 L CNN
F 2 "Button_Switch_THT:SW_PUSH_6mm" H 3400 1825 50  0001 C CNN
F 3 "" H 3400 1825 50  0001 C CNN
	1    3400 1625
	0    -1   -1   0   
$EndComp
Wire Wire Line
	3700 1875 3400 1875
Wire Wire Line
	3400 1875 3400 1825
Wire Wire Line
	3400 1425 3400 1400
Connection ~ 3400 1400
$Comp
L Device:Battery BT1
U 1 1 5E180A32
P 1025 1450
F 0 "BT1" H 1250 1525 50  0000 R CNN
F 1 "3xAA" H 1300 1400 50  0000 R CNN
F 2 "Connector_Molex:Molex_KK-254_AE-6410-02A_1x02_P2.54mm_Vertical" V 1025 1510 50  0001 C CNN
F 3 "~" V 1025 1510 50  0001 C CNN
	1    1025 1450
	-1   0    0    -1  
$EndComp
Text GLabel 9200 2600 0    39   Output ~ 0
PWR_MAIN
Text GLabel 4075 1625 2    39   Input ~ 0
PWR_MAIN
Wire Notes Line
	4525 650  4525 2275
Wire Notes Line
	5675 2275 5675 650 
Text Notes 3075 750  0    50   ~ 0
Main Power Switch
$Comp
L Transistor_FET:IRF7309IPBF Q3
U 2 1 5E19C9CE
P 1475 2950
F 0 "Q3" V 1750 2950 50  0000 C CNN
F 1 "IRF7309IPBF" V 1675 2975 50  0000 C CNN
F 2 "Package_SO:SOIC-8_3.9x4.9mm_P1.27mm" H 1675 2875 50  0001 L CNN
F 3 "http://www.irf.com/product-info/datasheets/data/irf7309ipbf.pdf" H 1475 2950 50  0001 L CNN
	2    1475 2950
	0    1    -1   0   
$EndComp
$Comp
L Transistor_FET:IRF7309IPBF Q3
U 1 1 5E19C9D5
P 1375 3400
F 0 "Q3" H 1575 3375 50  0000 L CNN
F 1 "IRF7309IPBF" H 1550 3300 50  0000 L CNN
F 2 "Package_SO:SOIC-8_3.9x4.9mm_P1.27mm" H 1575 3325 50  0001 L CNN
F 3 "http://www.irf.com/product-info/datasheets/data/irf7309ipbf.pdf" H 1375 3400 50  0001 L CNN
	1    1375 3400
	1    0    0    -1  
$EndComp
$Comp
L power:GND #PWR0122
U 1 1 5E19C9DC
P 2125 3650
F 0 "#PWR0122" H 2125 3400 50  0001 C CNN
F 1 "GND" V 2125 3450 50  0000 C CNN
F 2 "" H 2125 3650 50  0000 C CNN
F 3 "" H 2125 3650 50  0000 C CNN
	1    2125 3650
	1    0    0    -1  
$EndComp
$Comp
L Device:R_Small R6
U 1 1 5E19C9E3
P 1150 3025
F 0 "R6" H 1092 2979 50  0000 R CNN
F 1 "100k" H 1092 3070 50  0000 R CNN
F 2 "Resistor_SMD:R_1206_3216Metric_Pad1.42x1.75mm_HandSolder" H 1150 3025 50  0001 C CNN
F 3 "~" H 1150 3025 50  0001 C CNN
	1    1150 3025
	1    0    0    1   
$EndComp
Wire Wire Line
	1150 2925 1150 2850
Wire Wire Line
	1150 3125 1150 3175
Wire Wire Line
	1475 3150 1475 3175
Wire Wire Line
	1150 2850 1275 2850
Wire Wire Line
	1150 3175 1475 3175
Connection ~ 1475 3175
Wire Wire Line
	1475 3175 1475 3200
Text GLabel 1125 3400 0    39   Input ~ 0
PWR_FLASH
Connection ~ 1150 2850
Text GLabel 9200 2400 0    39   Output ~ 0
PWR_FLASH
$Comp
L Regulator_Switching:R-781.5-0.5 U1
U 1 1 5E1B8C1F
P 2125 2850
F 0 "U1" H 2125 3092 50  0000 C CNN
F 1 "POLOLU-U3V50F12" H 2125 3001 50  0000 C CNN
F 2 "Connector_PinSocket_2.54mm:PinSocket_1x08_P2.54mm_Vertical" H 2175 2600 50  0001 L CIN
F 3 "https://www.recom-power.com/pdf/Innoline/R-78xx-0.5.pdf" H 2125 2850 50  0001 C CNN
	1    2125 2850
	1    0    0    -1  
$EndComp
$Comp
L power:GND #PWR0123
U 1 1 5E1C5181
P 1475 3650
F 0 "#PWR0123" H 1475 3400 50  0001 C CNN
F 1 "GND" V 1475 3450 50  0000 C CNN
F 2 "" H 1475 3650 50  0000 C CNN
F 3 "" H 1475 3650 50  0000 C CNN
	1    1475 3650
	1    0    0    -1  
$EndComp
Wire Wire Line
	2125 3150 2125 3650
$Comp
L power:+12V #PWR0124
U 1 1 5E1CB1EC
P 2450 2850
F 0 "#PWR0124" H 2450 2700 50  0001 C CNN
F 1 "+12V" V 2450 2975 50  0000 L CNN
F 2 "" H 2450 2850 50  0001 C CNN
F 3 "" H 2450 2850 50  0001 C CNN
	1    2450 2850
	0    1    1    0   
$EndComp
Wire Wire Line
	2425 2850 2450 2850
Wire Wire Line
	1125 3400 1150 3400
Wire Wire Line
	1675 2850 1825 2850
Wire Notes Line
	675  2375 2850 2375
Wire Notes Line
	2850 2375 2850 4000
Wire Notes Line
	2850 4000 675  4000
Wire Notes Line
	675  4000 675  2375
Text Notes 700  2475 0    50   ~ 0
Flash LED power
$Comp
L Device:R_Small R2
U 1 1 5E1F5DD4
P 4750 1450
F 0 "R2" H 4692 1404 50  0000 R CNN
F 1 "100k" H 4692 1495 50  0000 R CNN
F 2 "Resistor_SMD:R_1206_3216Metric_Pad1.42x1.75mm_HandSolder" H 4750 1450 50  0001 C CNN
F 3 "~" H 4750 1450 50  0001 C CNN
	1    4750 1450
	-1   0    0    1   
$EndComp
$Comp
L Device:R_Small R1
U 1 1 5E1F5EAC
P 4750 1200
F 0 "R1" H 4692 1154 50  0000 R CNN
F 1 "200k" H 4692 1245 50  0000 R CNN
F 2 "Resistor_SMD:R_1206_3216Metric_Pad1.42x1.75mm_HandSolder" H 4750 1200 50  0001 C CNN
F 3 "~" H 4750 1200 50  0001 C CNN
	1    4750 1200
	-1   0    0    1   
$EndComp
$Comp
L Device:R_Small R3
U 1 1 5E1F6073
P 4750 1700
F 0 "R3" H 4692 1654 50  0000 R CNN
F 1 "100k" H 4692 1745 50  0000 R CNN
F 2 "Resistor_SMD:R_1206_3216Metric_Pad1.42x1.75mm_HandSolder" H 4750 1700 50  0001 C CNN
F 3 "~" H 4750 1700 50  0001 C CNN
	1    4750 1700
	-1   0    0    1   
$EndComp
Wire Wire Line
	4750 1350 4750 1325
Wire Wire Line
	4750 1600 4750 1575
Wire Wire Line
	1025 1875 1025 1650
Wire Wire Line
	4750 1100 4750 1075
Text GLabel 4975 1325 2    39   Output ~ 0
+BATT50%
Text GLabel 4975 1575 2    39   Output ~ 0
+BATT25%
Wire Wire Line
	4975 1325 4750 1325
Connection ~ 4750 1325
Wire Wire Line
	4750 1325 4750 1300
Wire Wire Line
	4975 1575 4750 1575
Connection ~ 4750 1575
Wire Wire Line
	4750 1575 4750 1550
Wire Notes Line
	3050 650  3050 2275
Wire Notes Line
	2100 650  2100 2275
Text Notes 2125 825  0    50   ~ 0
Reverse Polarity\nProtection
Text Notes 4550 750  0    50   ~ 0
Battery Monitor
Wire Notes Line
	2975 2375 2975 4000
Wire Notes Line
	5225 2375 5225 4000
Wire Wire Line
	3450 2950 3475 2950
Wire Wire Line
	4325 3425 4325 3650
Text Notes 8575 3550 0    50   ~ 0
On-Board Peripherals
Wire Notes Line
	8500 6225 11200 6225
Wire Notes Line
	8500 500  8500 6225
$Comp
L power:+BATT #PWR0126
U 1 1 5E31D249
P 1025 1025
F 0 "#PWR0126" H 1025 875 50  0001 C CNN
F 1 "+BATT" H 1000 1175 50  0000 C CNN
F 2 "" H 1025 1025 50  0001 C CNN
F 3 "" H 1025 1025 50  0001 C CNN
	1    1025 1025
	1    0    0    -1  
$EndComp
$Comp
L power:GND #PWR0127
U 1 1 5E31D2EA
P 6275 1900
F 0 "#PWR0127" H 6275 1650 50  0001 C CNN
F 1 "GND" V 6275 1700 50  0000 C CNN
F 2 "" H 6275 1900 50  0000 C CNN
F 3 "" H 6275 1900 50  0000 C CNN
	1    6275 1900
	1    0    0    -1  
$EndComp
$Comp
L Device:CP_Small C3
U 1 1 5E31D3CF
P 5875 1550
F 0 "C3" H 5963 1596 50  0000 L CNN
F 1 "500uF" H 5963 1505 50  0000 L CNN
F 2 "Capacitor_SMD:CP_Elec_10x10" H 5875 1550 50  0001 C CNN
F 3 "~" H 5875 1550 50  0001 C CNN
	1    5875 1550
	1    0    0    -1  
$EndComp
$Comp
L Device:C_Small C4
U 1 1 5E31D64A
P 6275 1550
F 0 "C4" H 6367 1596 50  0000 L CNN
F 1 "10uF" H 6367 1505 50  0000 L CNN
F 2 "Capacitor_SMD:C_1206_3216Metric_Pad1.42x1.75mm_HandSolder" H 6275 1550 50  0001 C CNN
F 3 "~" H 6275 1550 50  0001 C CNN
	1    6275 1550
	1    0    0    -1  
$EndComp
Wire Wire Line
	6275 1075 6275 1450
Wire Wire Line
	5875 1450 5875 1075
Wire Wire Line
	5875 1075 6275 1075
Wire Wire Line
	6275 1650 6275 1875
Wire Wire Line
	5875 1650 5875 1875
Wire Wire Line
	5875 1875 6275 1875
Wire Notes Line
	6800 650  6800 2275
Text Notes 5700 750  0    50   ~ 0
Power Stabilization
$Comp
L power:+VDC #PWR0128
U 1 1 5E0B074D
P 6275 1050
F 0 "#PWR0128" H 6275 950 50  0001 C CNN
F 1 "+VDC" H 6250 1300 50  0000 C CNN
F 2 "" H 6275 1050 50  0001 C CNN
F 3 "" H 6275 1050 50  0001 C CNN
	1    6275 1050
	1    0    0    -1  
$EndComp
$Comp
L power:+VDC #PWR0129
U 1 1 5E0B08DF
P 1150 2850
F 0 "#PWR0129" H 1150 2750 50  0001 C CNN
F 1 "+VDC" H 1125 3100 50  0000 C CNN
F 2 "" H 1150 2850 50  0001 C CNN
F 3 "" H 1150 2850 50  0001 C CNN
	1    1150 2850
	1    0    0    -1  
$EndComp
$Comp
L Device:Fuse_Small F1
U 1 1 5E0B0B9C
P 2500 4825
F 0 "F1" H 2500 4900 50  0000 C CNN
F 1 "F2A" H 2500 4750 50  0000 C CNN
F 2 "Fuse:Fuseholder_Cylinder-5x20mm_Schurter_0031_8201_Horizontal_Open" H 2500 4825 50  0001 C CNN
F 3 "https://gr.mouser.com/ProductDetail/Bel-Fuse/FC-203-bright-tin?qs=sGAEpiMZZMuxTAA0eeO5G5KoEtN24M1h209sKDiE%2FzaM4rmVKr6jyA%3D%3D" H 2500 4825 50  0001 C CNN
	1    2500 4825
	1    0    0    -1  
$EndComp
$Comp
L Device:D_Zener_Small D1
U 1 1 5E0B916C
P 1925 1475
F 0 "D1" V 1925 1325 50  0000 L CNN
F 1 "SMCJ8V5A" V 2000 1075 50  0000 L CNN
F 2 "Diode_SMD:D_SMC_Handsoldering" V 1925 1475 50  0001 C CNN
F 3 "~" V 1925 1475 50  0001 C CNN
	1    1925 1475
	0    1    1    0   
$EndComp
Wire Wire Line
	2675 4750 2675 4825
Wire Wire Line
	2600 4825 2675 4825
Wire Notes Line
	675  4125 3000 4125
Wire Notes Line
	3000 4125 3000 7475
Wire Notes Line
	3000 7475 675  7475
Wire Notes Line
	675  7475 675  4125
Wire Wire Line
	2050 4825 2400 4825
$Comp
L power:+VDC #PWR0130
U 1 1 5E0F000A
P 3475 2850
F 0 "#PWR0130" H 3475 2750 50  0001 C CNN
F 1 "+VDC" H 3450 3100 50  0000 C CNN
F 2 "" H 3475 2850 50  0001 C CNN
F 3 "" H 3475 2850 50  0001 C CNN
	1    3475 2850
	1    0    0    -1  
$EndComp
$Comp
L power:+VDC #PWR0131
U 1 1 5E13AA0B
P 10550 1600
F 0 "#PWR0131" H 10550 1500 50  0001 C CNN
F 1 "+VDC" H 10525 1850 50  0000 C CNN
F 2 "" H 10550 1600 50  0001 C CNN
F 3 "" H 10550 1600 50  0001 C CNN
	1    10550 1600
	1    0    0    -1  
$EndComp
Wire Wire Line
	10250 1600 10550 1600
Wire Wire Line
	1025 1025 1025 1075
Connection ~ 1025 1075
Wire Wire Line
	1025 1075 1025 1250
Wire Wire Line
	2650 1375 2650 1875
Wire Wire Line
	4750 1800 4750 1875
Wire Wire Line
	6275 1050 6275 1075
Connection ~ 6275 1075
Wire Wire Line
	6275 1875 6275 1900
Connection ~ 6275 1875
Wire Wire Line
	2050 5225 2100 5225
Wire Wire Line
	1025 1075 1925 1075
Wire Wire Line
	1025 1875 1925 1875
Wire Wire Line
	1925 1375 1925 1075
Connection ~ 1925 1075
Wire Wire Line
	1925 1075 2450 1075
Wire Wire Line
	1925 1575 1925 1875
Connection ~ 1925 1875
Wire Wire Line
	1925 1875 2650 1875
Wire Notes Line
	675  650  675  2275
Wire Notes Line
	675  2275 6800 2275
Wire Notes Line
	675  650  6800 650 
Wire Notes Line
	1450 650  1450 2275
Text Notes 1475 825  0    50   ~ 0
Over Voltage\nProtection
Text Notes 700  4225 0    50   ~ 0
External connectors
$Comp
L Transistor_FET:IRLML6402 Q1
U 1 1 5E2165E3
P 2650 1175
F 0 "Q1" V 2993 1175 50  0000 C CNN
F 1 "IRLML6402" V 2902 1175 50  0000 C CNN
F 2 "Package_TO_SOT_SMD:SOT-23_Handsoldering" H 2850 1100 50  0001 L CIN
F 3 "https://www.infineon.com/dgdl/irlml6402pbf.pdf?fileId=5546d462533600a401535668d5c2263c" H 2650 1175 50  0001 L CNN
	1    2650 1175
	0    -1   -1   0   
$EndComp
Wire Wire Line
	5875 1075 4750 1075
Connection ~ 5875 1075
Connection ~ 4750 1075
Wire Wire Line
	3700 1875 4025 1875
Connection ~ 3700 1875
Connection ~ 5875 1875
Connection ~ 4750 1875
Wire Wire Line
	4750 1875 5875 1875
Wire Wire Line
	3400 1075 2850 1075
Connection ~ 3400 1075
Wire Wire Line
	2650 1875 3400 1875
Connection ~ 2650 1875
Connection ~ 3400 1875
Wire Wire Line
	10250 2200 10500 2200
Wire Wire Line
	10250 2300 10500 2300
Wire Wire Line
	9200 2600 9350 2600
Wire Wire Line
	9200 2500 9350 2500
Wire Wire Line
	9200 2400 9350 2400
Wire Wire Line
	9200 2300 9350 2300
Wire Wire Line
	9200 2200 9350 2200
Wire Wire Line
	9200 2100 9350 2100
$Comp
L power:+3V3 #PWR0103
U 1 1 5E2C6967
P 2100 5725
F 0 "#PWR0103" H 2100 5575 50  0001 C CNN
F 1 "+3V3" V 2115 5853 50  0000 L CNN
F 2 "" H 2100 5725 50  0001 C CNN
F 3 "" H 2100 5725 50  0001 C CNN
	1    2100 5725
	0    1    1    0   
$EndComp
$Comp
L power:+3V3 #PWR0105
U 1 1 5E2C69FA
P 2100 6725
F 0 "#PWR0105" H 2100 6575 50  0001 C CNN
F 1 "+3V3" V 2115 6853 50  0000 L CNN
F 2 "" H 2100 6725 50  0001 C CNN
F 3 "" H 2100 6725 50  0001 C CNN
	1    2100 6725
	0    1    1    0   
$EndComp
$Comp
L Connector_Generic:Conn_01x06 J9
U 1 1 5E2D62FF
P 9150 5750
F 0 "J9" H 9250 5700 50  0000 C CNN
F 1 "TSL2591" H 9150 6050 50  0000 C CNN
F 2 "Connector_PinHeader_2.54mm:PinHeader_1x06_P2.54mm_Vertical" H 9150 5750 50  0001 C CNN
F 3 "~" H 9150 5750 50  0001 C CNN
	1    9150 5750
	-1   0    0    -1  
$EndComp
$Comp
L power:+3V3 #PWR0121
U 1 1 5E2D6305
P 9400 5750
F 0 "#PWR0121" H 9400 5600 50  0001 C CNN
F 1 "+3V3" V 9415 5878 50  0000 L CNN
F 2 "" H 9400 5750 50  0001 C CNN
F 3 "" H 9400 5750 50  0001 C CNN
	1    9400 5750
	0    1    1    0   
$EndComp
$Comp
L power:GND #PWR0125
U 1 1 5E2D630B
P 9400 5650
F 0 "#PWR0125" H 9400 5400 50  0001 C CNN
F 1 "GND" V 9400 5450 50  0000 C CNN
F 2 "" H 9400 5650 50  0000 C CNN
F 3 "" H 9400 5650 50  0000 C CNN
	1    9400 5650
	0    -1   -1   0   
$EndComp
Text GLabel 9400 6050 2    39   Input ~ 0
SCL
Text GLabel 9400 5950 2    39   BiDi ~ 0
SDA
Wire Wire Line
	9350 5550 9400 5550
Wire Wire Line
	9400 5650 9350 5650
Wire Wire Line
	9350 5750 9400 5750
Wire Wire Line
	9400 5850 9350 5850
Wire Wire Line
	9350 5950 9400 5950
Wire Wire Line
	9400 6050 9350 6050
Text Notes 9425 5875 0    39   ~ 0
(INT)
Text Notes 9425 5575 0    39   ~ 0
(5V)
$Comp
L Device:R_Small R7
U 1 1 5E2DFCDB
P 1150 3525
F 0 "R7" H 1092 3479 50  0000 R CNN
F 1 "100k" H 1092 3570 50  0000 R CNN
F 2 "Resistor_SMD:R_1206_3216Metric_Pad1.42x1.75mm_HandSolder" H 1150 3525 50  0001 C CNN
F 3 "~" H 1150 3525 50  0001 C CNN
	1    1150 3525
	1    0    0    1   
$EndComp
Wire Wire Line
	1150 3425 1150 3400
Connection ~ 1150 3400
Wire Wire Line
	1150 3400 1175 3400
Wire Wire Line
	1150 3625 1475 3625
Wire Wire Line
	1475 3600 1475 3625
Connection ~ 1475 3625
Wire Wire Line
	1475 3625 1475 3650
$Comp
L Device:R_Small R8
U 1 1 5E32412B
P 3475 3150
F 0 "R8" H 3417 3104 50  0000 R CNN
F 1 "100k" H 3417 3195 50  0000 R CNN
F 2 "Resistor_SMD:R_1206_3216Metric_Pad1.42x1.75mm_HandSolder" H 3475 3150 50  0001 C CNN
F 3 "~" H 3475 3150 50  0001 C CNN
	1    3475 3150
	1    0    0    1   
$EndComp
Wire Wire Line
	3475 3050 3475 2950
Connection ~ 3475 2950
Wire Wire Line
	3475 2950 3525 2950
Wire Wire Line
	3475 3250 3475 3425
Wire Wire Line
	3475 3425 3925 3425
Connection ~ 3925 3425
$Comp
L power:GND #PWR0108
U 1 1 5E0685AC
P 9950 1100
F 0 "#PWR0108" H 9950 850 50  0001 C CNN
F 1 "GND" V 9950 900 50  0000 C CNN
F 2 "" H 9950 1100 50  0000 C CNN
F 3 "" H 9950 1100 50  0000 C CNN
	1    9950 1100
	-1   0    0    1   
$EndComp
Wire Wire Line
	9750 1100 9750 1150
Wire Wire Line
	9650 1100 9650 1150
Wire Wire Line
	9550 1100 9550 1150
Text GLabel 8800 1800 0    39   Input ~ 0
DTR
Text GLabel 9200 1700 0    39   Input ~ 0
RxD
Text GLabel 9200 1600 0    39   Output ~ 0
TxD
Wire Wire Line
	10050 1100 10050 1150
Wire Wire Line
	9950 1150 9950 1100
$Comp
L power:VCC #PWR02
U 1 1 56D753B8
P 9850 1150
F 0 "#PWR02" H 9850 1000 50  0001 C CNN
F 1 "VCC" V 9850 1350 50  0000 C CNN
F 2 "" H 9850 1150 50  0000 C CNN
F 3 "" H 9850 1150 50  0000 C CNN
	1    9850 1150
	1    0    0    -1  
$EndComp
$Comp
L power:GND #PWR01
U 1 1 56D7539A
P 10050 1100
F 0 "#PWR01" H 10050 850 50  0001 C CNN
F 1 "GND" V 10050 900 50  0000 C CNN
F 2 "" H 10050 1100 50  0000 C CNN
F 3 "" H 10050 1100 50  0000 C CNN
	1    10050 1100
	-1   0    0    1   
$EndComp
$Comp
L Device:C_Small C5
U 1 1 609AB89E
P 9000 1800
F 0 "C5" V 8850 1700 50  0000 L CNN
F 1 ".1uF" V 8900 1650 50  0000 L CNN
F 2 "Capacitor_SMD:C_1206_3216Metric_Pad1.42x1.75mm_HandSolder" H 9000 1800 50  0001 C CNN
F 3 "~" H 9000 1800 50  0001 C CNN
	1    9000 1800
	0    1    1    0   
$EndComp
Wire Wire Line
	9100 1800 9350 1800
Wire Wire Line
	8900 1800 8800 1800
$Comp
L Device:R_Small R9
U 1 1 609C7650
P 10650 5100
F 0 "R9" H 10592 5054 50  0000 R CNN
F 1 "10k" H 10592 5145 50  0000 R CNN
F 2 "Resistor_SMD:R_1206_3216Metric_Pad1.42x1.75mm_HandSolder" H 10650 5100 50  0001 C CNN
F 3 "~" H 10650 5100 50  0001 C CNN
	1    10650 5100
	-1   0    0    1   
$EndComp
Wire Wire Line
	10300 4750 10650 4750
Wire Wire Line
	10300 5250 10650 5250
Wire Wire Line
	10650 5000 10650 4750
Connection ~ 10650 4750
Wire Wire Line
	10650 5200 10650 5250
Connection ~ 10650 5250
Wire Wire Line
	10650 5250 10750 5250
Wire Wire Line
	4000 1625 4025 1625
Wire Wire Line
	3900 1075 4750 1075
Wire Wire Line
	4025 1650 4025 1625
Connection ~ 4025 1625
Wire Wire Line
	4025 1625 4075 1625
Wire Wire Line
	4025 1850 4025 1875
Connection ~ 4025 1875
Wire Wire Line
	4025 1875 4750 1875
$EndSCHEMATC
