G04 #@! TF.GenerationSoftware,KiCad,Pcbnew,5.0.2+dfsg1-1*
G04 #@! TF.CreationDate,2021-05-12T11:55:44+03:00*
G04 #@! TF.ProjectId,KiCAD,4b694341-442e-46b6-9963-61645f706362,rev?*
G04 #@! TF.SameCoordinates,PX5f5e100PY5f5e100*
G04 #@! TF.FileFunction,Legend,Bot*
G04 #@! TF.FilePolarity,Positive*
%FSLAX46Y46*%
G04 Gerber Fmt 4.6, Leading zero omitted, Abs format (unit mm)*
G04 Created by KiCad (PCBNEW 5.0.2+dfsg1-1) date Wed 12 May 2021 11:55:44 EEST*
%MOMM*%
%LPD*%
G01*
G04 APERTURE LIST*
%ADD10C,0.100000*%
%ADD11C,0.120000*%
%ADD12C,0.150000*%
%ADD13R,2.000000X2.000000*%
%ADD14O,2.000000X2.000000*%
%ADD15C,4.110000*%
%ADD16C,1.800000*%
%ADD17R,1.800000X1.800000*%
%ADD18O,3.800000X3.800000*%
%ADD19O,2.500000X2.040000*%
%ADD20C,2.040000*%
%ADD21C,2.078000*%
%ADD22O,2.027200X2.332000*%
%ADD23C,1.100000*%
%ADD24O,7.300000X7.300000*%
%ADD25C,7.300000*%
%ADD26C,3.300000*%
%ADD27R,2.100000X2.100000*%
%ADD28C,2.100000*%
%ADD29C,2.300000*%
%ADD30C,4.364000*%
%ADD31C,2.800000*%
%ADD32C,1.725000*%
%ADD33O,2.040000X2.500000*%
%ADD34R,4.800000X3.600000*%
%ADD35R,1.100000X2.200000*%
%ADD36R,0.900000X1.850000*%
%ADD37R,0.950000X1.360000*%
G04 APERTURE END LIST*
D10*
X-8000000Y50000000D02*
X-3000000Y50000000D01*
X-8000000Y48000000D02*
X-8000000Y50000000D01*
X-3000000Y48000000D02*
X-8000000Y48000000D01*
X8000000Y48000000D02*
X3000000Y48000000D01*
X8000000Y50000000D02*
X8000000Y48000000D01*
X3000000Y50000000D02*
X8000000Y50000000D01*
X-48000000Y-8000000D02*
X-48000000Y-3000000D01*
X-50000000Y-8000000D02*
X-48000000Y-8000000D01*
X-50000000Y-3000000D02*
X-50000000Y-8000000D01*
X-48000000Y8000000D02*
X-48000000Y3000000D01*
X-50000000Y8000000D02*
X-48000000Y8000000D01*
X-50000000Y3000000D02*
X-50000000Y8000000D01*
X-8000000Y-50000000D02*
X-3000000Y-50000000D01*
X-8000000Y-48000000D02*
X-8000000Y-50000000D01*
X-3000000Y-48000000D02*
X-8000000Y-48000000D01*
X8000000Y-50000000D02*
X3000000Y-50000000D01*
X8000000Y-48000000D02*
X8000000Y-50000000D01*
X3000000Y-48000000D02*
X8000000Y-48000000D01*
X50000000Y-8000000D02*
X50000000Y-3000000D01*
X48000000Y-8000000D02*
X50000000Y-8000000D01*
X48000000Y-3000000D02*
X48000000Y-8000000D01*
X50000000Y8000000D02*
X50000000Y3000000D01*
X48000000Y8000000D02*
X50000000Y8000000D01*
X48000000Y3000000D02*
X48000000Y8000000D01*
X-45675000Y0D02*
G75*
G03X-45675000Y0I-3300000J0D01*
G01*
X52275000Y0D02*
G75*
G03X52275000Y0I-3300000J0D01*
G01*
X3300000Y-48975000D02*
G75*
G03X3300000Y-48975000I-3300000J0D01*
G01*
X3300000Y48975000D02*
G75*
G03X3300000Y48975000I-3300000J0D01*
G01*
X3300000Y-28000000D02*
G75*
G03X3300000Y-28000000I-3300000J0D01*
G01*
X3300000Y27975000D02*
G75*
G03X3300000Y27975000I-3300000J0D01*
G01*
D11*
G04 #@! TO.C,R5*
X-15515000Y-38767936D02*
X-15515000Y-39972064D01*
X-13695000Y-38767936D02*
X-13695000Y-39972064D01*
G04 #@! TO.C,C1*
X29570000Y12097936D02*
X29570000Y13302064D01*
X31390000Y12097936D02*
X31390000Y13302064D01*
G04 #@! TO.C,C2*
X25040000Y12097936D02*
X25040000Y13302064D01*
X23220000Y12097936D02*
X23220000Y13302064D01*
G04 #@! TO.C,C4*
X17177936Y-8530000D02*
X18382064Y-8530000D01*
X17177936Y-6710000D02*
X18382064Y-6710000D01*
G04 #@! TO.C,D1*
X-43300000Y-31040000D02*
X-43300000Y-37540000D01*
X-43300000Y-31040000D02*
X-32100000Y-31040000D01*
X-43300000Y-37540000D02*
X-32100000Y-37540000D01*
G04 #@! TO.C,Q1*
X-28900000Y-40130000D02*
X-28900000Y-38670000D01*
X-32060000Y-40130000D02*
X-32060000Y-36970000D01*
X-32060000Y-40130000D02*
X-31130000Y-40130000D01*
X-28900000Y-40130000D02*
X-29830000Y-40130000D01*
D12*
G04 #@! TO.C,Q2*
X-27975000Y-40470000D02*
X-27925000Y-40470000D01*
X-27975000Y-44620000D02*
X-27830000Y-44620000D01*
X-22825000Y-44620000D02*
X-22970000Y-44620000D01*
X-22825000Y-40470000D02*
X-22970000Y-40470000D01*
X-27975000Y-40470000D02*
X-27975000Y-44620000D01*
X-22825000Y-40470000D02*
X-22825000Y-44620000D01*
X-27925000Y-40470000D02*
X-27925000Y-39070000D01*
G04 #@! TO.C,Q3*
X32400000Y9695000D02*
X32400000Y11095000D01*
X37500000Y9695000D02*
X37500000Y5545000D01*
X32350000Y9695000D02*
X32350000Y5545000D01*
X37500000Y9695000D02*
X37355000Y9695000D01*
X37500000Y5545000D02*
X37355000Y5545000D01*
X32350000Y5545000D02*
X32495000Y5545000D01*
X32350000Y9695000D02*
X32400000Y9695000D01*
D11*
G04 #@! TO.C,R1*
X33806883Y-12140096D02*
X32602755Y-12140096D01*
X33806883Y-10320096D02*
X32602755Y-10320096D01*
G04 #@! TO.C,R2*
X38886883Y-10320096D02*
X37682755Y-10320096D01*
X38886883Y-12140096D02*
X37682755Y-12140096D01*
G04 #@! TO.C,R3*
X43858064Y-10320096D02*
X42653936Y-10320096D01*
X43858064Y-12140096D02*
X42653936Y-12140096D01*
G04 #@! TO.C,R4*
X-24797936Y-37740000D02*
X-26002064Y-37740000D01*
X-24797936Y-35920000D02*
X-26002064Y-35920000D01*
G04 #@! TO.C,R6*
X29570000Y7017936D02*
X29570000Y8222064D01*
X31390000Y7017936D02*
X31390000Y8222064D01*
G04 #@! TO.C,U2*
X28915000Y13600000D02*
X28915000Y11800000D01*
X25695000Y11800000D02*
X25695000Y14250000D01*
G04 #@! TO.C,R7*
X23843064Y15600000D02*
X22638936Y15600000D01*
X23843064Y17420000D02*
X22638936Y17420000D01*
G04 #@! TO.C,R8*
X19561564Y14118000D02*
X18357436Y14118000D01*
X19561564Y12298000D02*
X18357436Y12298000D01*
G04 #@! TO.C,C5*
X20668064Y-15854000D02*
X19463936Y-15854000D01*
X20668064Y-17674000D02*
X19463936Y-17674000D01*
G04 #@! TO.C,R9*
X42905000Y-29697936D02*
X42905000Y-30902064D01*
X44725000Y-29697936D02*
X44725000Y-30902064D01*
G04 #@! TO.C,R5*
D12*
X-16184620Y-40182833D02*
X-16660810Y-39849500D01*
X-16184620Y-39611404D02*
X-17184620Y-39611404D01*
X-17184620Y-39992357D01*
X-17137000Y-40087595D01*
X-17089381Y-40135214D01*
X-16994143Y-40182833D01*
X-16851286Y-40182833D01*
X-16756048Y-40135214D01*
X-16708429Y-40087595D01*
X-16660810Y-39992357D01*
X-16660810Y-39611404D01*
X-17184620Y-41087595D02*
X-17184620Y-40611404D01*
X-16708429Y-40563785D01*
X-16756048Y-40611404D01*
X-16803667Y-40706642D01*
X-16803667Y-40944738D01*
X-16756048Y-41039976D01*
X-16708429Y-41087595D01*
X-16613191Y-41135214D01*
X-16375096Y-41135214D01*
X-16279858Y-41087595D01*
X-16232239Y-41039976D01*
X-16184620Y-40944738D01*
X-16184620Y-40706642D01*
X-16232239Y-40611404D01*
X-16279858Y-40563785D01*
G04 #@! TO.C,C1*
X32657142Y12866667D02*
X32704761Y12914286D01*
X32752380Y13057143D01*
X32752380Y13152381D01*
X32704761Y13295239D01*
X32609523Y13390477D01*
X32514285Y13438096D01*
X32323809Y13485715D01*
X32180952Y13485715D01*
X31990476Y13438096D01*
X31895238Y13390477D01*
X31800000Y13295239D01*
X31752380Y13152381D01*
X31752380Y13057143D01*
X31800000Y12914286D01*
X31847619Y12866667D01*
X32752380Y11914286D02*
X32752380Y12485715D01*
X32752380Y12200000D02*
X31752380Y12200000D01*
X31895238Y12295239D01*
X31990476Y12390477D01*
X32038095Y12485715D01*
G04 #@! TO.C,C2*
X22836142Y13120667D02*
X22883761Y13168286D01*
X22931380Y13311143D01*
X22931380Y13406381D01*
X22883761Y13549239D01*
X22788523Y13644477D01*
X22693285Y13692096D01*
X22502809Y13739715D01*
X22359952Y13739715D01*
X22169476Y13692096D01*
X22074238Y13644477D01*
X21979000Y13549239D01*
X21931380Y13406381D01*
X21931380Y13311143D01*
X21979000Y13168286D01*
X22026619Y13120667D01*
X22026619Y12739715D02*
X21979000Y12692096D01*
X21931380Y12596858D01*
X21931380Y12358762D01*
X21979000Y12263524D01*
X22026619Y12215905D01*
X22121857Y12168286D01*
X22217095Y12168286D01*
X22359952Y12215905D01*
X22931380Y12787334D01*
X22931380Y12168286D01*
G04 #@! TO.C,C4*
X17946666Y-9797142D02*
X17994285Y-9844761D01*
X18137142Y-9892380D01*
X18232380Y-9892380D01*
X18375238Y-9844761D01*
X18470476Y-9749523D01*
X18518095Y-9654285D01*
X18565714Y-9463809D01*
X18565714Y-9320952D01*
X18518095Y-9130476D01*
X18470476Y-9035238D01*
X18375238Y-8940000D01*
X18232380Y-8892380D01*
X18137142Y-8892380D01*
X17994285Y-8940000D01*
X17946666Y-8987619D01*
X17089523Y-9225714D02*
X17089523Y-9892380D01*
X17327619Y-8844761D02*
X17565714Y-9559047D01*
X16946666Y-9559047D01*
G04 #@! TO.C,D1*
X-35761905Y-38842380D02*
X-35761905Y-37842380D01*
X-36000000Y-37842380D01*
X-36142858Y-37890000D01*
X-36238096Y-37985238D01*
X-36285715Y-38080476D01*
X-36333334Y-38270952D01*
X-36333334Y-38413809D01*
X-36285715Y-38604285D01*
X-36238096Y-38699523D01*
X-36142858Y-38794761D01*
X-36000000Y-38842380D01*
X-35761905Y-38842380D01*
X-37285715Y-38842380D02*
X-36714286Y-38842380D01*
X-37000000Y-38842380D02*
X-37000000Y-37842380D01*
X-36904762Y-37985238D01*
X-36809524Y-38080476D01*
X-36714286Y-38128095D01*
G04 #@! TO.C,Q1*
X-31456381Y-40925761D02*
X-31504000Y-40830523D01*
X-31599239Y-40735285D01*
X-31742096Y-40592428D01*
X-31789715Y-40497190D01*
X-31789715Y-40401952D01*
X-31551620Y-40449571D02*
X-31599239Y-40354333D01*
X-31694477Y-40259095D01*
X-31884953Y-40211476D01*
X-32218286Y-40211476D01*
X-32408762Y-40259095D01*
X-32504000Y-40354333D01*
X-32551620Y-40449571D01*
X-32551620Y-40640047D01*
X-32504000Y-40735285D01*
X-32408762Y-40830523D01*
X-32218286Y-40878142D01*
X-31884953Y-40878142D01*
X-31694477Y-40830523D01*
X-31599239Y-40735285D01*
X-31551620Y-40640047D01*
X-31551620Y-40449571D01*
X-31551620Y-41830523D02*
X-31551620Y-41259095D01*
X-31551620Y-41544809D02*
X-32551620Y-41544809D01*
X-32408762Y-41449571D01*
X-32313524Y-41354333D01*
X-32265905Y-41259095D01*
G04 #@! TO.C,Q2*
X-21423381Y-41560761D02*
X-21471000Y-41465523D01*
X-21566239Y-41370285D01*
X-21709096Y-41227428D01*
X-21756715Y-41132190D01*
X-21756715Y-41036952D01*
X-21518620Y-41084571D02*
X-21566239Y-40989333D01*
X-21661477Y-40894095D01*
X-21851953Y-40846476D01*
X-22185286Y-40846476D01*
X-22375762Y-40894095D01*
X-22471000Y-40989333D01*
X-22518620Y-41084571D01*
X-22518620Y-41275047D01*
X-22471000Y-41370285D01*
X-22375762Y-41465523D01*
X-22185286Y-41513142D01*
X-21851953Y-41513142D01*
X-21661477Y-41465523D01*
X-21566239Y-41370285D01*
X-21518620Y-41275047D01*
X-21518620Y-41084571D01*
X-22423381Y-41894095D02*
X-22471000Y-41941714D01*
X-22518620Y-42036952D01*
X-22518620Y-42275047D01*
X-22471000Y-42370285D01*
X-22423381Y-42417904D01*
X-22328143Y-42465523D01*
X-22232905Y-42465523D01*
X-22090048Y-42417904D01*
X-21518620Y-41846476D01*
X-21518620Y-42465523D01*
G04 #@! TO.C,Q3*
X38774619Y7207239D02*
X38727000Y7302477D01*
X38631761Y7397715D01*
X38488904Y7540572D01*
X38441285Y7635810D01*
X38441285Y7731048D01*
X38679380Y7683429D02*
X38631761Y7778667D01*
X38536523Y7873905D01*
X38346047Y7921524D01*
X38012714Y7921524D01*
X37822238Y7873905D01*
X37727000Y7778667D01*
X37679380Y7683429D01*
X37679380Y7492953D01*
X37727000Y7397715D01*
X37822238Y7302477D01*
X38012714Y7254858D01*
X38346047Y7254858D01*
X38536523Y7302477D01*
X38631761Y7397715D01*
X38679380Y7492953D01*
X38679380Y7683429D01*
X37679380Y6921524D02*
X37679380Y6302477D01*
X38060333Y6635810D01*
X38060333Y6492953D01*
X38107952Y6397715D01*
X38155571Y6350096D01*
X38250809Y6302477D01*
X38488904Y6302477D01*
X38584142Y6350096D01*
X38631761Y6397715D01*
X38679380Y6492953D01*
X38679380Y6778667D01*
X38631761Y6873905D01*
X38584142Y6921524D01*
G04 #@! TO.C,R1*
X33371485Y-9862476D02*
X33704819Y-9386286D01*
X33942914Y-9862476D02*
X33942914Y-8862476D01*
X33561961Y-8862476D01*
X33466723Y-8910096D01*
X33419104Y-8957715D01*
X33371485Y-9052953D01*
X33371485Y-9195810D01*
X33419104Y-9291048D01*
X33466723Y-9338667D01*
X33561961Y-9386286D01*
X33942914Y-9386286D01*
X32419104Y-9862476D02*
X32990533Y-9862476D01*
X32704819Y-9862476D02*
X32704819Y-8862476D01*
X32800057Y-9005334D01*
X32895295Y-9100572D01*
X32990533Y-9148191D01*
G04 #@! TO.C,R2*
X38451485Y-9862476D02*
X38784819Y-9386286D01*
X39022914Y-9862476D02*
X39022914Y-8862476D01*
X38641961Y-8862476D01*
X38546723Y-8910096D01*
X38499104Y-8957715D01*
X38451485Y-9052953D01*
X38451485Y-9195810D01*
X38499104Y-9291048D01*
X38546723Y-9338667D01*
X38641961Y-9386286D01*
X39022914Y-9386286D01*
X38070533Y-8957715D02*
X38022914Y-8910096D01*
X37927676Y-8862476D01*
X37689580Y-8862476D01*
X37594342Y-8910096D01*
X37546723Y-8957715D01*
X37499104Y-9052953D01*
X37499104Y-9148191D01*
X37546723Y-9291048D01*
X38118152Y-9862476D01*
X37499104Y-9862476D01*
G04 #@! TO.C,R3*
X43422666Y-9862476D02*
X43756000Y-9386286D01*
X43994095Y-9862476D02*
X43994095Y-8862476D01*
X43613142Y-8862476D01*
X43517904Y-8910096D01*
X43470285Y-8957715D01*
X43422666Y-9052953D01*
X43422666Y-9195810D01*
X43470285Y-9291048D01*
X43517904Y-9338667D01*
X43613142Y-9386286D01*
X43994095Y-9386286D01*
X43089333Y-8862476D02*
X42470285Y-8862476D01*
X42803619Y-9243429D01*
X42660761Y-9243429D01*
X42565523Y-9291048D01*
X42517904Y-9338667D01*
X42470285Y-9433905D01*
X42470285Y-9672000D01*
X42517904Y-9767238D01*
X42565523Y-9814857D01*
X42660761Y-9862476D01*
X42946476Y-9862476D01*
X43041714Y-9814857D01*
X43089333Y-9767238D01*
G04 #@! TO.C,R4*
X-25233334Y-35462380D02*
X-24900000Y-34986190D01*
X-24661905Y-35462380D02*
X-24661905Y-34462380D01*
X-25042858Y-34462380D01*
X-25138096Y-34510000D01*
X-25185715Y-34557619D01*
X-25233334Y-34652857D01*
X-25233334Y-34795714D01*
X-25185715Y-34890952D01*
X-25138096Y-34938571D01*
X-25042858Y-34986190D01*
X-24661905Y-34986190D01*
X-26090477Y-34795714D02*
X-26090477Y-35462380D01*
X-25852381Y-34414761D02*
X-25614286Y-35129047D01*
X-26233334Y-35129047D01*
G04 #@! TO.C,R6*
X29408380Y7913667D02*
X28932190Y8247000D01*
X29408380Y8485096D02*
X28408380Y8485096D01*
X28408380Y8104143D01*
X28456000Y8008905D01*
X28503619Y7961286D01*
X28598857Y7913667D01*
X28741714Y7913667D01*
X28836952Y7961286D01*
X28884571Y8008905D01*
X28932190Y8104143D01*
X28932190Y8485096D01*
X28408380Y7056524D02*
X28408380Y7247000D01*
X28456000Y7342239D01*
X28503619Y7389858D01*
X28646476Y7485096D01*
X28836952Y7532715D01*
X29217904Y7532715D01*
X29313142Y7485096D01*
X29360761Y7437477D01*
X29408380Y7342239D01*
X29408380Y7151762D01*
X29360761Y7056524D01*
X29313142Y7008905D01*
X29217904Y6961286D01*
X28979809Y6961286D01*
X28884571Y7008905D01*
X28836952Y7056524D01*
X28789333Y7151762D01*
X28789333Y7342239D01*
X28836952Y7437477D01*
X28884571Y7485096D01*
X28979809Y7532715D01*
G04 #@! TO.C,U2*
X29082904Y10707620D02*
X29082904Y9898096D01*
X29035285Y9802858D01*
X28987666Y9755239D01*
X28892428Y9707620D01*
X28701952Y9707620D01*
X28606714Y9755239D01*
X28559095Y9802858D01*
X28511476Y9898096D01*
X28511476Y10707620D01*
X28082904Y10612381D02*
X28035285Y10660000D01*
X27940047Y10707620D01*
X27701952Y10707620D01*
X27606714Y10660000D01*
X27559095Y10612381D01*
X27511476Y10517143D01*
X27511476Y10421905D01*
X27559095Y10279048D01*
X28130523Y9707620D01*
X27511476Y9707620D01*
G04 #@! TO.C,R7*
X23407666Y17877620D02*
X23741000Y18353810D01*
X23979095Y17877620D02*
X23979095Y18877620D01*
X23598142Y18877620D01*
X23502904Y18830000D01*
X23455285Y18782381D01*
X23407666Y18687143D01*
X23407666Y18544286D01*
X23455285Y18449048D01*
X23502904Y18401429D01*
X23598142Y18353810D01*
X23979095Y18353810D01*
X23074333Y18877620D02*
X22407666Y18877620D01*
X22836238Y17877620D01*
G04 #@! TO.C,R8*
X19126166Y14575620D02*
X19459500Y15051810D01*
X19697595Y14575620D02*
X19697595Y15575620D01*
X19316642Y15575620D01*
X19221404Y15528000D01*
X19173785Y15480381D01*
X19126166Y15385143D01*
X19126166Y15242286D01*
X19173785Y15147048D01*
X19221404Y15099429D01*
X19316642Y15051810D01*
X19697595Y15051810D01*
X18554738Y15147048D02*
X18649976Y15194667D01*
X18697595Y15242286D01*
X18745214Y15337524D01*
X18745214Y15385143D01*
X18697595Y15480381D01*
X18649976Y15528000D01*
X18554738Y15575620D01*
X18364261Y15575620D01*
X18269023Y15528000D01*
X18221404Y15480381D01*
X18173785Y15385143D01*
X18173785Y15337524D01*
X18221404Y15242286D01*
X18269023Y15194667D01*
X18364261Y15147048D01*
X18554738Y15147048D01*
X18649976Y15099429D01*
X18697595Y15051810D01*
X18745214Y14956572D01*
X18745214Y14766096D01*
X18697595Y14670858D01*
X18649976Y14623239D01*
X18554738Y14575620D01*
X18364261Y14575620D01*
X18269023Y14623239D01*
X18221404Y14670858D01*
X18173785Y14766096D01*
X18173785Y14956572D01*
X18221404Y15051810D01*
X18269023Y15099429D01*
X18364261Y15147048D01*
G04 #@! TO.C,C5*
X20232666Y-15301142D02*
X20280285Y-15348761D01*
X20423142Y-15396380D01*
X20518380Y-15396380D01*
X20661238Y-15348761D01*
X20756476Y-15253523D01*
X20804095Y-15158285D01*
X20851714Y-14967809D01*
X20851714Y-14824952D01*
X20804095Y-14634476D01*
X20756476Y-14539238D01*
X20661238Y-14444000D01*
X20518380Y-14396380D01*
X20423142Y-14396380D01*
X20280285Y-14444000D01*
X20232666Y-14491619D01*
X19327904Y-14396380D02*
X19804095Y-14396380D01*
X19851714Y-14872571D01*
X19804095Y-14824952D01*
X19708857Y-14777333D01*
X19470761Y-14777333D01*
X19375523Y-14824952D01*
X19327904Y-14872571D01*
X19280285Y-14967809D01*
X19280285Y-15205904D01*
X19327904Y-15301142D01*
X19375523Y-15348761D01*
X19470761Y-15396380D01*
X19708857Y-15396380D01*
X19804095Y-15348761D01*
X19851714Y-15301142D01*
G04 #@! TO.C,R9*
X42447380Y-30133333D02*
X41971190Y-29800000D01*
X42447380Y-29561904D02*
X41447380Y-29561904D01*
X41447380Y-29942857D01*
X41495000Y-30038095D01*
X41542619Y-30085714D01*
X41637857Y-30133333D01*
X41780714Y-30133333D01*
X41875952Y-30085714D01*
X41923571Y-30038095D01*
X41971190Y-29942857D01*
X41971190Y-29561904D01*
X42447380Y-30609523D02*
X42447380Y-30800000D01*
X42399761Y-30895238D01*
X42352142Y-30942857D01*
X42209285Y-31038095D01*
X42018809Y-31085714D01*
X41637857Y-31085714D01*
X41542619Y-31038095D01*
X41495000Y-30990476D01*
X41447380Y-30895238D01*
X41447380Y-30704761D01*
X41495000Y-30609523D01*
X41542619Y-30561904D01*
X41637857Y-30514285D01*
X41875952Y-30514285D01*
X41971190Y-30561904D01*
X42018809Y-30609523D01*
X42066428Y-30704761D01*
X42066428Y-30895238D01*
X42018809Y-30990476D01*
X41971190Y-31038095D01*
X41875952Y-31085714D01*
G04 #@! TD*
%LPC*%
D13*
G04 #@! TO.C,U1*
X31750000Y2540000D03*
D14*
X36830000Y2540000D03*
X34290000Y2540000D03*
X41910000Y40640000D03*
X39370000Y40640000D03*
D13*
X29210000Y2540000D03*
X36830000Y40640000D03*
X34290000Y40640000D03*
D14*
X40640000Y5080000D03*
D15*
X30480000Y43180000D03*
X40640000Y0D03*
G04 #@! TD*
D13*
G04 #@! TO.C,J5*
X34925000Y-29210000D03*
D14*
X34925000Y-31750000D03*
X34925000Y-34290000D03*
X34925000Y-36830000D03*
X34925000Y-39370000D03*
X34925000Y-41910000D03*
G04 #@! TD*
D16*
G04 #@! TO.C,J1*
X-43815000Y-12700000D03*
X-41275000Y-13970000D03*
X-43815000Y-15240000D03*
X-41275000Y-16510000D03*
X-43815000Y-17780000D03*
X-41275000Y-19050000D03*
X-43815000Y-20320000D03*
D17*
X-41275000Y-21590000D03*
D18*
X-34925000Y-22860000D03*
X-34925000Y-11430000D03*
G04 #@! TD*
D19*
G04 #@! TO.C,J7*
X41275000Y-29210000D03*
X41275000Y-31750000D03*
X41275000Y-34290000D03*
X41275000Y-36830000D03*
X41275000Y-39370000D03*
D10*
G36*
X42260626Y-40891411D02*
X42289079Y-40895632D01*
X42316980Y-40902621D01*
X42344063Y-40912311D01*
X42370065Y-40924609D01*
X42394736Y-40939397D01*
X42417840Y-40956531D01*
X42439152Y-40975848D01*
X42458469Y-40997160D01*
X42475603Y-41020264D01*
X42490391Y-41044935D01*
X42502689Y-41070937D01*
X42512379Y-41098020D01*
X42519368Y-41125921D01*
X42523589Y-41154374D01*
X42525000Y-41183103D01*
X42525000Y-42636897D01*
X42523589Y-42665626D01*
X42519368Y-42694079D01*
X42512379Y-42721980D01*
X42502689Y-42749063D01*
X42490391Y-42775065D01*
X42475603Y-42799736D01*
X42458469Y-42822840D01*
X42439152Y-42844152D01*
X42417840Y-42863469D01*
X42394736Y-42880603D01*
X42370065Y-42895391D01*
X42344063Y-42907689D01*
X42316980Y-42917379D01*
X42289079Y-42924368D01*
X42260626Y-42928589D01*
X42231897Y-42930000D01*
X40318103Y-42930000D01*
X40289374Y-42928589D01*
X40260921Y-42924368D01*
X40233020Y-42917379D01*
X40205937Y-42907689D01*
X40179935Y-42895391D01*
X40155264Y-42880603D01*
X40132160Y-42863469D01*
X40110848Y-42844152D01*
X40091531Y-42822840D01*
X40074397Y-42799736D01*
X40059609Y-42775065D01*
X40047311Y-42749063D01*
X40037621Y-42721980D01*
X40030632Y-42694079D01*
X40026411Y-42665626D01*
X40025000Y-42636897D01*
X40025000Y-41183103D01*
X40026411Y-41154374D01*
X40030632Y-41125921D01*
X40037621Y-41098020D01*
X40047311Y-41070937D01*
X40059609Y-41044935D01*
X40074397Y-41020264D01*
X40091531Y-40997160D01*
X40110848Y-40975848D01*
X40132160Y-40956531D01*
X40155264Y-40939397D01*
X40179935Y-40924609D01*
X40205937Y-40912311D01*
X40233020Y-40902621D01*
X40260921Y-40895632D01*
X40289374Y-40891411D01*
X40318103Y-40890000D01*
X42231897Y-40890000D01*
X42260626Y-40891411D01*
X42260626Y-40891411D01*
G37*
D20*
X41275000Y-41910000D03*
G04 #@! TD*
D21*
G04 #@! TO.C,P5*
X35527319Y-7500000D03*
X38067319Y-7500000D03*
G04 #@! TD*
G04 #@! TO.C,P4*
X25367319Y-7500000D03*
X27907319Y-7500000D03*
G04 #@! TD*
D22*
G04 #@! TO.C,P3*
X16477319Y-4880096D03*
X19017319Y-4880096D03*
X21557319Y-4880096D03*
X24097319Y-4880096D03*
X26637319Y-4880096D03*
X29177319Y-4880096D03*
X31717319Y-4880096D03*
X34257319Y-4880096D03*
X36797319Y-4880096D03*
X39337319Y-4880096D03*
X41877319Y-4880096D03*
X44417319Y-4880096D03*
G04 #@! TD*
G04 #@! TO.C,P1*
X16477319Y-20120096D03*
X19017319Y-20120096D03*
X21557319Y-20120096D03*
X24097319Y-20120096D03*
X26637319Y-20120096D03*
X29177319Y-20120096D03*
X31717319Y-20120096D03*
X34257319Y-20120096D03*
X36797319Y-20120096D03*
X39337319Y-20120096D03*
X41877319Y-20120096D03*
X44417319Y-20120096D03*
G04 #@! TD*
D23*
G04 #@! TO.C,REF\002A\002A*
X50831155Y29831155D03*
X48975000Y30600000D03*
X47118845Y29831155D03*
X46350000Y27975000D03*
X47118845Y26118845D03*
X48975000Y25350000D03*
X50831155Y26118845D03*
X51600000Y27975000D03*
D24*
X48975000Y27975000D03*
G04 #@! TD*
D23*
G04 #@! TO.C,REF\002A\002A*
X40831155Y50831155D03*
X38975000Y51600000D03*
X37118845Y50831155D03*
X36350000Y48975000D03*
X37118845Y47118845D03*
X38975000Y46350000D03*
X40831155Y47118845D03*
X41600000Y48975000D03*
D24*
X38975000Y48975000D03*
G04 #@! TD*
D23*
G04 #@! TO.C,REF\002A\002A*
X-37118845Y50831155D03*
X-38975000Y51600000D03*
X-40831155Y50831155D03*
X-41600000Y48975000D03*
X-40831155Y47118845D03*
X-38975000Y46350000D03*
X-37118845Y47118845D03*
X-36350000Y48975000D03*
D24*
X-38975000Y48975000D03*
G04 #@! TD*
G04 #@! TO.C,REF\002A\002A*
X-48975000Y27975000D03*
D23*
X-46350000Y27975000D03*
X-47118845Y26118845D03*
X-48975000Y25350000D03*
X-50831155Y26118845D03*
X-51600000Y27975000D03*
X-50831155Y29831155D03*
X-48975000Y30600000D03*
X-47118845Y29831155D03*
G04 #@! TD*
D24*
G04 #@! TO.C,REF\002A\002A*
X-48975000Y-27975000D03*
D23*
X-46350000Y-27975000D03*
X-47118845Y-29831155D03*
X-48975000Y-30600000D03*
X-50831155Y-29831155D03*
X-51600000Y-27975000D03*
X-50831155Y-26118845D03*
X-48975000Y-25350000D03*
X-47118845Y-26118845D03*
G04 #@! TD*
D24*
G04 #@! TO.C,REF\002A\002A*
X-38975000Y-48975000D03*
D23*
X-36350000Y-48975000D03*
X-37118845Y-50831155D03*
X-38975000Y-51600000D03*
X-40831155Y-50831155D03*
X-41600000Y-48975000D03*
X-40831155Y-47118845D03*
X-38975000Y-46350000D03*
X-37118845Y-47118845D03*
G04 #@! TD*
G04 #@! TO.C,REF\002A\002A*
X40831155Y-47118845D03*
X38975000Y-46350000D03*
X37118845Y-47118845D03*
X36350000Y-48975000D03*
X37118845Y-50831155D03*
X38975000Y-51600000D03*
X40831155Y-50831155D03*
X41600000Y-48975000D03*
D24*
X38975000Y-48975000D03*
G04 #@! TD*
D25*
G04 #@! TO.C,REF\002A\002A*
X48975000Y-27975000D03*
D23*
X51600000Y-27975000D03*
X50831155Y-29831155D03*
X48975000Y-30600000D03*
X47118845Y-29831155D03*
X46350000Y-27975000D03*
X47118845Y-26118845D03*
X48975000Y-25350000D03*
X50831155Y-26118845D03*
G04 #@! TD*
D26*
G04 #@! TO.C,REF\002A\002A*
X-12522400Y-6375200D03*
G04 #@! TD*
D27*
G04 #@! TO.C,J8*
X-29210000Y-30480000D03*
D28*
X-31750000Y-30480000D03*
G04 #@! TD*
D13*
G04 #@! TO.C,J4*
X6350000Y35052000D03*
D14*
X3810000Y35052000D03*
X1270000Y35052000D03*
X-1270000Y35052000D03*
X-3810000Y35052000D03*
X-6350000Y35052000D03*
X-8890000Y35052000D03*
X-11430000Y35052000D03*
G04 #@! TD*
D29*
G04 #@! TO.C,REF\002A\002A*
X-2540000Y11430000D03*
G04 #@! TD*
G04 #@! TO.C,REF\002A\002A*
X-2540000Y21082000D03*
D10*
G36*
X-2540000Y19455654D02*
X-4166346Y21082000D01*
X-2540000Y22708346D01*
X-913654Y21082000D01*
X-2540000Y19455654D01*
X-2540000Y19455654D01*
G37*
G04 #@! TD*
D29*
G04 #@! TO.C,REF\002A\002A*
X-2540000Y6350000D03*
G04 #@! TD*
D13*
G04 #@! TO.C,J9*
X-39370000Y41910000D03*
D14*
X-39370000Y39370000D03*
X-39370000Y36830000D03*
X-39370000Y34290000D03*
X-39370000Y31750000D03*
X-39370000Y29210000D03*
D30*
X-27940000Y42545000D03*
X-27940000Y28575000D03*
G04 #@! TD*
D10*
G04 #@! TO.C,C3*
G36*
X15454764Y4138556D02*
X15481944Y4134524D01*
X15508599Y4127847D01*
X15534470Y4118590D01*
X15559310Y4106842D01*
X15582879Y4092715D01*
X15604949Y4076347D01*
X15625309Y4057894D01*
X15643762Y4037534D01*
X15660130Y4015464D01*
X15674257Y3991895D01*
X15686005Y3967055D01*
X15695262Y3941184D01*
X15701939Y3914529D01*
X15705971Y3887349D01*
X15707319Y3859904D01*
X15707319Y1619904D01*
X15705971Y1592459D01*
X15701939Y1565279D01*
X15695262Y1538624D01*
X15686005Y1512753D01*
X15674257Y1487913D01*
X15660130Y1464344D01*
X15643762Y1442274D01*
X15625309Y1421914D01*
X15604949Y1403461D01*
X15582879Y1387093D01*
X15559310Y1372966D01*
X15534470Y1361218D01*
X15508599Y1351961D01*
X15481944Y1345284D01*
X15454764Y1341252D01*
X15427319Y1339904D01*
X11687319Y1339904D01*
X11659874Y1341252D01*
X11632694Y1345284D01*
X11606039Y1351961D01*
X11580168Y1361218D01*
X11555328Y1372966D01*
X11531759Y1387093D01*
X11509689Y1403461D01*
X11489329Y1421914D01*
X11470876Y1442274D01*
X11454508Y1464344D01*
X11440381Y1487913D01*
X11428633Y1512753D01*
X11419376Y1538624D01*
X11412699Y1565279D01*
X11408667Y1592459D01*
X11407319Y1619904D01*
X11407319Y3859904D01*
X11408667Y3887349D01*
X11412699Y3914529D01*
X11419376Y3941184D01*
X11428633Y3967055D01*
X11440381Y3991895D01*
X11454508Y4015464D01*
X11470876Y4037534D01*
X11489329Y4057894D01*
X11509689Y4076347D01*
X11531759Y4092715D01*
X11555328Y4106842D01*
X11580168Y4118590D01*
X11606039Y4127847D01*
X11632694Y4134524D01*
X11659874Y4138556D01*
X11687319Y4139904D01*
X15427319Y4139904D01*
X15454764Y4138556D01*
X15454764Y4138556D01*
G37*
D31*
X13557319Y2739904D03*
D10*
G36*
X23454764Y4138556D02*
X23481944Y4134524D01*
X23508599Y4127847D01*
X23534470Y4118590D01*
X23559310Y4106842D01*
X23582879Y4092715D01*
X23604949Y4076347D01*
X23625309Y4057894D01*
X23643762Y4037534D01*
X23660130Y4015464D01*
X23674257Y3991895D01*
X23686005Y3967055D01*
X23695262Y3941184D01*
X23701939Y3914529D01*
X23705971Y3887349D01*
X23707319Y3859904D01*
X23707319Y1619904D01*
X23705971Y1592459D01*
X23701939Y1565279D01*
X23695262Y1538624D01*
X23686005Y1512753D01*
X23674257Y1487913D01*
X23660130Y1464344D01*
X23643762Y1442274D01*
X23625309Y1421914D01*
X23604949Y1403461D01*
X23582879Y1387093D01*
X23559310Y1372966D01*
X23534470Y1361218D01*
X23508599Y1351961D01*
X23481944Y1345284D01*
X23454764Y1341252D01*
X23427319Y1339904D01*
X19687319Y1339904D01*
X19659874Y1341252D01*
X19632694Y1345284D01*
X19606039Y1351961D01*
X19580168Y1361218D01*
X19555328Y1372966D01*
X19531759Y1387093D01*
X19509689Y1403461D01*
X19489329Y1421914D01*
X19470876Y1442274D01*
X19454508Y1464344D01*
X19440381Y1487913D01*
X19428633Y1512753D01*
X19419376Y1538624D01*
X19412699Y1565279D01*
X19408667Y1592459D01*
X19407319Y1619904D01*
X19407319Y3859904D01*
X19408667Y3887349D01*
X19412699Y3914529D01*
X19419376Y3941184D01*
X19428633Y3967055D01*
X19440381Y3991895D01*
X19454508Y4015464D01*
X19470876Y4037534D01*
X19489329Y4057894D01*
X19509689Y4076347D01*
X19531759Y4092715D01*
X19555328Y4106842D01*
X19580168Y4118590D01*
X19606039Y4127847D01*
X19632694Y4134524D01*
X19659874Y4138556D01*
X19687319Y4139904D01*
X23427319Y4139904D01*
X23454764Y4138556D01*
X23454764Y4138556D01*
G37*
D31*
X21557319Y2739904D03*
G04 #@! TD*
D10*
G04 #@! TO.C,R5*
G36*
X-13852969Y-37021457D02*
X-13823591Y-37025815D01*
X-13794783Y-37033031D01*
X-13766820Y-37043036D01*
X-13739972Y-37055734D01*
X-13714499Y-37071003D01*
X-13690644Y-37088694D01*
X-13668639Y-37108639D01*
X-13648694Y-37130644D01*
X-13631003Y-37154499D01*
X-13615734Y-37179972D01*
X-13603036Y-37206820D01*
X-13593031Y-37234783D01*
X-13585815Y-37263591D01*
X-13581457Y-37292969D01*
X-13580000Y-37322632D01*
X-13580000Y-38442368D01*
X-13581457Y-38472031D01*
X-13585815Y-38501409D01*
X-13593031Y-38530217D01*
X-13603036Y-38558180D01*
X-13615734Y-38585028D01*
X-13631003Y-38610501D01*
X-13648694Y-38634356D01*
X-13668639Y-38656361D01*
X-13690644Y-38676306D01*
X-13714499Y-38693997D01*
X-13739972Y-38709266D01*
X-13766820Y-38721964D01*
X-13794783Y-38731969D01*
X-13823591Y-38739185D01*
X-13852969Y-38743543D01*
X-13882632Y-38745000D01*
X-15327368Y-38745000D01*
X-15357031Y-38743543D01*
X-15386409Y-38739185D01*
X-15415217Y-38731969D01*
X-15443180Y-38721964D01*
X-15470028Y-38709266D01*
X-15495501Y-38693997D01*
X-15519356Y-38676306D01*
X-15541361Y-38656361D01*
X-15561306Y-38634356D01*
X-15578997Y-38610501D01*
X-15594266Y-38585028D01*
X-15606964Y-38558180D01*
X-15616969Y-38530217D01*
X-15624185Y-38501409D01*
X-15628543Y-38472031D01*
X-15630000Y-38442368D01*
X-15630000Y-37322632D01*
X-15628543Y-37292969D01*
X-15624185Y-37263591D01*
X-15616969Y-37234783D01*
X-15606964Y-37206820D01*
X-15594266Y-37179972D01*
X-15578997Y-37154499D01*
X-15561306Y-37130644D01*
X-15541361Y-37108639D01*
X-15519356Y-37088694D01*
X-15495501Y-37071003D01*
X-15470028Y-37055734D01*
X-15443180Y-37043036D01*
X-15415217Y-37033031D01*
X-15386409Y-37025815D01*
X-15357031Y-37021457D01*
X-15327368Y-37020000D01*
X-13882632Y-37020000D01*
X-13852969Y-37021457D01*
X-13852969Y-37021457D01*
G37*
D32*
X-14605000Y-37882500D03*
D10*
G36*
X-13852969Y-39996457D02*
X-13823591Y-40000815D01*
X-13794783Y-40008031D01*
X-13766820Y-40018036D01*
X-13739972Y-40030734D01*
X-13714499Y-40046003D01*
X-13690644Y-40063694D01*
X-13668639Y-40083639D01*
X-13648694Y-40105644D01*
X-13631003Y-40129499D01*
X-13615734Y-40154972D01*
X-13603036Y-40181820D01*
X-13593031Y-40209783D01*
X-13585815Y-40238591D01*
X-13581457Y-40267969D01*
X-13580000Y-40297632D01*
X-13580000Y-41417368D01*
X-13581457Y-41447031D01*
X-13585815Y-41476409D01*
X-13593031Y-41505217D01*
X-13603036Y-41533180D01*
X-13615734Y-41560028D01*
X-13631003Y-41585501D01*
X-13648694Y-41609356D01*
X-13668639Y-41631361D01*
X-13690644Y-41651306D01*
X-13714499Y-41668997D01*
X-13739972Y-41684266D01*
X-13766820Y-41696964D01*
X-13794783Y-41706969D01*
X-13823591Y-41714185D01*
X-13852969Y-41718543D01*
X-13882632Y-41720000D01*
X-15327368Y-41720000D01*
X-15357031Y-41718543D01*
X-15386409Y-41714185D01*
X-15415217Y-41706969D01*
X-15443180Y-41696964D01*
X-15470028Y-41684266D01*
X-15495501Y-41668997D01*
X-15519356Y-41651306D01*
X-15541361Y-41631361D01*
X-15561306Y-41609356D01*
X-15578997Y-41585501D01*
X-15594266Y-41560028D01*
X-15606964Y-41533180D01*
X-15616969Y-41505217D01*
X-15624185Y-41476409D01*
X-15628543Y-41447031D01*
X-15630000Y-41417368D01*
X-15630000Y-40297632D01*
X-15628543Y-40267969D01*
X-15624185Y-40238591D01*
X-15616969Y-40209783D01*
X-15606964Y-40181820D01*
X-15594266Y-40154972D01*
X-15578997Y-40129499D01*
X-15561306Y-40105644D01*
X-15541361Y-40083639D01*
X-15519356Y-40063694D01*
X-15495501Y-40046003D01*
X-15470028Y-40030734D01*
X-15443180Y-40018036D01*
X-15415217Y-40008031D01*
X-15386409Y-40000815D01*
X-15357031Y-39996457D01*
X-15327368Y-39995000D01*
X-13882632Y-39995000D01*
X-13852969Y-39996457D01*
X-13852969Y-39996457D01*
G37*
D32*
X-14605000Y-40857500D03*
G04 #@! TD*
D10*
G04 #@! TO.C,BT1*
G36*
X-39249374Y-29231411D02*
X-39220921Y-29235632D01*
X-39193020Y-29242621D01*
X-39165937Y-29252311D01*
X-39139935Y-29264609D01*
X-39115264Y-29279397D01*
X-39092160Y-29296531D01*
X-39070848Y-29315848D01*
X-39051531Y-29337160D01*
X-39034397Y-29360264D01*
X-39019609Y-29384935D01*
X-39007311Y-29410937D01*
X-38997621Y-29438020D01*
X-38990632Y-29465921D01*
X-38986411Y-29494374D01*
X-38985000Y-29523103D01*
X-38985000Y-31436897D01*
X-38986411Y-31465626D01*
X-38990632Y-31494079D01*
X-38997621Y-31521980D01*
X-39007311Y-31549063D01*
X-39019609Y-31575065D01*
X-39034397Y-31599736D01*
X-39051531Y-31622840D01*
X-39070848Y-31644152D01*
X-39092160Y-31663469D01*
X-39115264Y-31680603D01*
X-39139935Y-31695391D01*
X-39165937Y-31707689D01*
X-39193020Y-31717379D01*
X-39220921Y-31724368D01*
X-39249374Y-31728589D01*
X-39278103Y-31730000D01*
X-40731897Y-31730000D01*
X-40760626Y-31728589D01*
X-40789079Y-31724368D01*
X-40816980Y-31717379D01*
X-40844063Y-31707689D01*
X-40870065Y-31695391D01*
X-40894736Y-31680603D01*
X-40917840Y-31663469D01*
X-40939152Y-31644152D01*
X-40958469Y-31622840D01*
X-40975603Y-31599736D01*
X-40990391Y-31575065D01*
X-41002689Y-31549063D01*
X-41012379Y-31521980D01*
X-41019368Y-31494079D01*
X-41023589Y-31465626D01*
X-41025000Y-31436897D01*
X-41025000Y-29523103D01*
X-41023589Y-29494374D01*
X-41019368Y-29465921D01*
X-41012379Y-29438020D01*
X-41002689Y-29410937D01*
X-40990391Y-29384935D01*
X-40975603Y-29360264D01*
X-40958469Y-29337160D01*
X-40939152Y-29315848D01*
X-40917840Y-29296531D01*
X-40894736Y-29279397D01*
X-40870065Y-29264609D01*
X-40844063Y-29252311D01*
X-40816980Y-29242621D01*
X-40789079Y-29235632D01*
X-40760626Y-29231411D01*
X-40731897Y-29230000D01*
X-39278103Y-29230000D01*
X-39249374Y-29231411D01*
X-39249374Y-29231411D01*
G37*
D20*
X-40005000Y-30480000D03*
D33*
X-42545000Y-30480000D03*
G04 #@! TD*
D10*
G04 #@! TO.C,C1*
G36*
X31232031Y15048543D02*
X31261409Y15044185D01*
X31290217Y15036969D01*
X31318180Y15026964D01*
X31345028Y15014266D01*
X31370501Y14998997D01*
X31394356Y14981306D01*
X31416361Y14961361D01*
X31436306Y14939356D01*
X31453997Y14915501D01*
X31469266Y14890028D01*
X31481964Y14863180D01*
X31491969Y14835217D01*
X31499185Y14806409D01*
X31503543Y14777031D01*
X31505000Y14747368D01*
X31505000Y13627632D01*
X31503543Y13597969D01*
X31499185Y13568591D01*
X31491969Y13539783D01*
X31481964Y13511820D01*
X31469266Y13484972D01*
X31453997Y13459499D01*
X31436306Y13435644D01*
X31416361Y13413639D01*
X31394356Y13393694D01*
X31370501Y13376003D01*
X31345028Y13360734D01*
X31318180Y13348036D01*
X31290217Y13338031D01*
X31261409Y13330815D01*
X31232031Y13326457D01*
X31202368Y13325000D01*
X29757632Y13325000D01*
X29727969Y13326457D01*
X29698591Y13330815D01*
X29669783Y13338031D01*
X29641820Y13348036D01*
X29614972Y13360734D01*
X29589499Y13376003D01*
X29565644Y13393694D01*
X29543639Y13413639D01*
X29523694Y13435644D01*
X29506003Y13459499D01*
X29490734Y13484972D01*
X29478036Y13511820D01*
X29468031Y13539783D01*
X29460815Y13568591D01*
X29456457Y13597969D01*
X29455000Y13627632D01*
X29455000Y14747368D01*
X29456457Y14777031D01*
X29460815Y14806409D01*
X29468031Y14835217D01*
X29478036Y14863180D01*
X29490734Y14890028D01*
X29506003Y14915501D01*
X29523694Y14939356D01*
X29543639Y14961361D01*
X29565644Y14981306D01*
X29589499Y14998997D01*
X29614972Y15014266D01*
X29641820Y15026964D01*
X29669783Y15036969D01*
X29698591Y15044185D01*
X29727969Y15048543D01*
X29757632Y15050000D01*
X31202368Y15050000D01*
X31232031Y15048543D01*
X31232031Y15048543D01*
G37*
D32*
X30480000Y14187500D03*
D10*
G36*
X31232031Y12073543D02*
X31261409Y12069185D01*
X31290217Y12061969D01*
X31318180Y12051964D01*
X31345028Y12039266D01*
X31370501Y12023997D01*
X31394356Y12006306D01*
X31416361Y11986361D01*
X31436306Y11964356D01*
X31453997Y11940501D01*
X31469266Y11915028D01*
X31481964Y11888180D01*
X31491969Y11860217D01*
X31499185Y11831409D01*
X31503543Y11802031D01*
X31505000Y11772368D01*
X31505000Y10652632D01*
X31503543Y10622969D01*
X31499185Y10593591D01*
X31491969Y10564783D01*
X31481964Y10536820D01*
X31469266Y10509972D01*
X31453997Y10484499D01*
X31436306Y10460644D01*
X31416361Y10438639D01*
X31394356Y10418694D01*
X31370501Y10401003D01*
X31345028Y10385734D01*
X31318180Y10373036D01*
X31290217Y10363031D01*
X31261409Y10355815D01*
X31232031Y10351457D01*
X31202368Y10350000D01*
X29757632Y10350000D01*
X29727969Y10351457D01*
X29698591Y10355815D01*
X29669783Y10363031D01*
X29641820Y10373036D01*
X29614972Y10385734D01*
X29589499Y10401003D01*
X29565644Y10418694D01*
X29543639Y10438639D01*
X29523694Y10460644D01*
X29506003Y10484499D01*
X29490734Y10509972D01*
X29478036Y10536820D01*
X29468031Y10564783D01*
X29460815Y10593591D01*
X29456457Y10622969D01*
X29455000Y10652632D01*
X29455000Y11772368D01*
X29456457Y11802031D01*
X29460815Y11831409D01*
X29468031Y11860217D01*
X29478036Y11888180D01*
X29490734Y11915028D01*
X29506003Y11940501D01*
X29523694Y11964356D01*
X29543639Y11986361D01*
X29565644Y12006306D01*
X29589499Y12023997D01*
X29614972Y12039266D01*
X29641820Y12051964D01*
X29669783Y12061969D01*
X29698591Y12069185D01*
X29727969Y12073543D01*
X29757632Y12075000D01*
X31202368Y12075000D01*
X31232031Y12073543D01*
X31232031Y12073543D01*
G37*
D32*
X30480000Y11212500D03*
G04 #@! TD*
D10*
G04 #@! TO.C,C2*
G36*
X24882031Y12073543D02*
X24911409Y12069185D01*
X24940217Y12061969D01*
X24968180Y12051964D01*
X24995028Y12039266D01*
X25020501Y12023997D01*
X25044356Y12006306D01*
X25066361Y11986361D01*
X25086306Y11964356D01*
X25103997Y11940501D01*
X25119266Y11915028D01*
X25131964Y11888180D01*
X25141969Y11860217D01*
X25149185Y11831409D01*
X25153543Y11802031D01*
X25155000Y11772368D01*
X25155000Y10652632D01*
X25153543Y10622969D01*
X25149185Y10593591D01*
X25141969Y10564783D01*
X25131964Y10536820D01*
X25119266Y10509972D01*
X25103997Y10484499D01*
X25086306Y10460644D01*
X25066361Y10438639D01*
X25044356Y10418694D01*
X25020501Y10401003D01*
X24995028Y10385734D01*
X24968180Y10373036D01*
X24940217Y10363031D01*
X24911409Y10355815D01*
X24882031Y10351457D01*
X24852368Y10350000D01*
X23407632Y10350000D01*
X23377969Y10351457D01*
X23348591Y10355815D01*
X23319783Y10363031D01*
X23291820Y10373036D01*
X23264972Y10385734D01*
X23239499Y10401003D01*
X23215644Y10418694D01*
X23193639Y10438639D01*
X23173694Y10460644D01*
X23156003Y10484499D01*
X23140734Y10509972D01*
X23128036Y10536820D01*
X23118031Y10564783D01*
X23110815Y10593591D01*
X23106457Y10622969D01*
X23105000Y10652632D01*
X23105000Y11772368D01*
X23106457Y11802031D01*
X23110815Y11831409D01*
X23118031Y11860217D01*
X23128036Y11888180D01*
X23140734Y11915028D01*
X23156003Y11940501D01*
X23173694Y11964356D01*
X23193639Y11986361D01*
X23215644Y12006306D01*
X23239499Y12023997D01*
X23264972Y12039266D01*
X23291820Y12051964D01*
X23319783Y12061969D01*
X23348591Y12069185D01*
X23377969Y12073543D01*
X23407632Y12075000D01*
X24852368Y12075000D01*
X24882031Y12073543D01*
X24882031Y12073543D01*
G37*
D32*
X24130000Y11212500D03*
D10*
G36*
X24882031Y15048543D02*
X24911409Y15044185D01*
X24940217Y15036969D01*
X24968180Y15026964D01*
X24995028Y15014266D01*
X25020501Y14998997D01*
X25044356Y14981306D01*
X25066361Y14961361D01*
X25086306Y14939356D01*
X25103997Y14915501D01*
X25119266Y14890028D01*
X25131964Y14863180D01*
X25141969Y14835217D01*
X25149185Y14806409D01*
X25153543Y14777031D01*
X25155000Y14747368D01*
X25155000Y13627632D01*
X25153543Y13597969D01*
X25149185Y13568591D01*
X25141969Y13539783D01*
X25131964Y13511820D01*
X25119266Y13484972D01*
X25103997Y13459499D01*
X25086306Y13435644D01*
X25066361Y13413639D01*
X25044356Y13393694D01*
X25020501Y13376003D01*
X24995028Y13360734D01*
X24968180Y13348036D01*
X24940217Y13338031D01*
X24911409Y13330815D01*
X24882031Y13326457D01*
X24852368Y13325000D01*
X23407632Y13325000D01*
X23377969Y13326457D01*
X23348591Y13330815D01*
X23319783Y13338031D01*
X23291820Y13348036D01*
X23264972Y13360734D01*
X23239499Y13376003D01*
X23215644Y13393694D01*
X23193639Y13413639D01*
X23173694Y13435644D01*
X23156003Y13459499D01*
X23140734Y13484972D01*
X23128036Y13511820D01*
X23118031Y13539783D01*
X23110815Y13568591D01*
X23106457Y13597969D01*
X23105000Y13627632D01*
X23105000Y14747368D01*
X23106457Y14777031D01*
X23110815Y14806409D01*
X23118031Y14835217D01*
X23128036Y14863180D01*
X23140734Y14890028D01*
X23156003Y14915501D01*
X23173694Y14939356D01*
X23193639Y14961361D01*
X23215644Y14981306D01*
X23239499Y14998997D01*
X23264972Y15014266D01*
X23291820Y15026964D01*
X23319783Y15036969D01*
X23348591Y15044185D01*
X23377969Y15048543D01*
X23407632Y15050000D01*
X24852368Y15050000D01*
X24882031Y15048543D01*
X24882031Y15048543D01*
G37*
D32*
X24130000Y14187500D03*
G04 #@! TD*
D10*
G04 #@! TO.C,C4*
G36*
X16882031Y-6596457D02*
X16911409Y-6600815D01*
X16940217Y-6608031D01*
X16968180Y-6618036D01*
X16995028Y-6630734D01*
X17020501Y-6646003D01*
X17044356Y-6663694D01*
X17066361Y-6683639D01*
X17086306Y-6705644D01*
X17103997Y-6729499D01*
X17119266Y-6754972D01*
X17131964Y-6781820D01*
X17141969Y-6809783D01*
X17149185Y-6838591D01*
X17153543Y-6867969D01*
X17155000Y-6897632D01*
X17155000Y-8342368D01*
X17153543Y-8372031D01*
X17149185Y-8401409D01*
X17141969Y-8430217D01*
X17131964Y-8458180D01*
X17119266Y-8485028D01*
X17103997Y-8510501D01*
X17086306Y-8534356D01*
X17066361Y-8556361D01*
X17044356Y-8576306D01*
X17020501Y-8593997D01*
X16995028Y-8609266D01*
X16968180Y-8621964D01*
X16940217Y-8631969D01*
X16911409Y-8639185D01*
X16882031Y-8643543D01*
X16852368Y-8645000D01*
X15732632Y-8645000D01*
X15702969Y-8643543D01*
X15673591Y-8639185D01*
X15644783Y-8631969D01*
X15616820Y-8621964D01*
X15589972Y-8609266D01*
X15564499Y-8593997D01*
X15540644Y-8576306D01*
X15518639Y-8556361D01*
X15498694Y-8534356D01*
X15481003Y-8510501D01*
X15465734Y-8485028D01*
X15453036Y-8458180D01*
X15443031Y-8430217D01*
X15435815Y-8401409D01*
X15431457Y-8372031D01*
X15430000Y-8342368D01*
X15430000Y-6897632D01*
X15431457Y-6867969D01*
X15435815Y-6838591D01*
X15443031Y-6809783D01*
X15453036Y-6781820D01*
X15465734Y-6754972D01*
X15481003Y-6729499D01*
X15498694Y-6705644D01*
X15518639Y-6683639D01*
X15540644Y-6663694D01*
X15564499Y-6646003D01*
X15589972Y-6630734D01*
X15616820Y-6618036D01*
X15644783Y-6608031D01*
X15673591Y-6600815D01*
X15702969Y-6596457D01*
X15732632Y-6595000D01*
X16852368Y-6595000D01*
X16882031Y-6596457D01*
X16882031Y-6596457D01*
G37*
D32*
X16292500Y-7620000D03*
D10*
G36*
X19857031Y-6596457D02*
X19886409Y-6600815D01*
X19915217Y-6608031D01*
X19943180Y-6618036D01*
X19970028Y-6630734D01*
X19995501Y-6646003D01*
X20019356Y-6663694D01*
X20041361Y-6683639D01*
X20061306Y-6705644D01*
X20078997Y-6729499D01*
X20094266Y-6754972D01*
X20106964Y-6781820D01*
X20116969Y-6809783D01*
X20124185Y-6838591D01*
X20128543Y-6867969D01*
X20130000Y-6897632D01*
X20130000Y-8342368D01*
X20128543Y-8372031D01*
X20124185Y-8401409D01*
X20116969Y-8430217D01*
X20106964Y-8458180D01*
X20094266Y-8485028D01*
X20078997Y-8510501D01*
X20061306Y-8534356D01*
X20041361Y-8556361D01*
X20019356Y-8576306D01*
X19995501Y-8593997D01*
X19970028Y-8609266D01*
X19943180Y-8621964D01*
X19915217Y-8631969D01*
X19886409Y-8639185D01*
X19857031Y-8643543D01*
X19827368Y-8645000D01*
X18707632Y-8645000D01*
X18677969Y-8643543D01*
X18648591Y-8639185D01*
X18619783Y-8631969D01*
X18591820Y-8621964D01*
X18564972Y-8609266D01*
X18539499Y-8593997D01*
X18515644Y-8576306D01*
X18493639Y-8556361D01*
X18473694Y-8534356D01*
X18456003Y-8510501D01*
X18440734Y-8485028D01*
X18428036Y-8458180D01*
X18418031Y-8430217D01*
X18410815Y-8401409D01*
X18406457Y-8372031D01*
X18405000Y-8342368D01*
X18405000Y-6897632D01*
X18406457Y-6867969D01*
X18410815Y-6838591D01*
X18418031Y-6809783D01*
X18428036Y-6781820D01*
X18440734Y-6754972D01*
X18456003Y-6729499D01*
X18473694Y-6705644D01*
X18493639Y-6683639D01*
X18515644Y-6663694D01*
X18539499Y-6646003D01*
X18564972Y-6630734D01*
X18591820Y-6618036D01*
X18619783Y-6608031D01*
X18648591Y-6600815D01*
X18677969Y-6596457D01*
X18707632Y-6595000D01*
X19827368Y-6595000D01*
X19857031Y-6596457D01*
X19857031Y-6596457D01*
G37*
D32*
X19267500Y-7620000D03*
G04 #@! TD*
D34*
G04 #@! TO.C,D1*
X-40900000Y-34290000D03*
X-32100000Y-34290000D03*
G04 #@! TD*
D18*
G04 #@! TO.C,J2*
X-33782000Y5715000D03*
X-33782000Y-5715000D03*
D17*
X-40132000Y-4445000D03*
D16*
X-42672000Y-3175000D03*
X-40132000Y-1905000D03*
X-42672000Y-635000D03*
X-40132000Y635000D03*
X-42672000Y1905000D03*
X-40132000Y3175000D03*
X-42672000Y4445000D03*
G04 #@! TD*
D18*
G04 #@! TO.C,J3*
X-34925000Y22860000D03*
X-34925000Y11430000D03*
D17*
X-41275000Y12700000D03*
D16*
X-43815000Y13970000D03*
X-41275000Y15240000D03*
X-43815000Y16510000D03*
X-41275000Y17780000D03*
X-43815000Y19050000D03*
X-41275000Y20320000D03*
X-43815000Y21590000D03*
G04 #@! TD*
D13*
G04 #@! TO.C,J6*
X48260000Y9398000D03*
D14*
X48260000Y11938000D03*
X48260000Y14478000D03*
X48260000Y17018000D03*
X48260000Y19558000D03*
X48260000Y22098000D03*
G04 #@! TD*
D35*
G04 #@! TO.C,Q1*
X-30480000Y-40870000D03*
X-29530000Y-37870000D03*
X-31430000Y-37870000D03*
G04 #@! TD*
D36*
G04 #@! TO.C,Q2*
X-27305000Y-39845000D03*
X-26035000Y-39845000D03*
X-24765000Y-39845000D03*
X-23495000Y-39845000D03*
X-23495000Y-45245000D03*
X-24765000Y-45245000D03*
X-26035000Y-45245000D03*
X-27305000Y-45245000D03*
G04 #@! TD*
G04 #@! TO.C,Q3*
X33020000Y4920000D03*
X34290000Y4920000D03*
X35560000Y4920000D03*
X36830000Y4920000D03*
X36830000Y10320000D03*
X35560000Y10320000D03*
X34290000Y10320000D03*
X33020000Y10320000D03*
G04 #@! TD*
D10*
G04 #@! TO.C,R1*
G36*
X32306850Y-10206553D02*
X32336228Y-10210911D01*
X32365036Y-10218127D01*
X32392999Y-10228132D01*
X32419847Y-10240830D01*
X32445320Y-10256099D01*
X32469175Y-10273790D01*
X32491180Y-10293735D01*
X32511125Y-10315740D01*
X32528816Y-10339595D01*
X32544085Y-10365068D01*
X32556783Y-10391916D01*
X32566788Y-10419879D01*
X32574004Y-10448687D01*
X32578362Y-10478065D01*
X32579819Y-10507728D01*
X32579819Y-11952464D01*
X32578362Y-11982127D01*
X32574004Y-12011505D01*
X32566788Y-12040313D01*
X32556783Y-12068276D01*
X32544085Y-12095124D01*
X32528816Y-12120597D01*
X32511125Y-12144452D01*
X32491180Y-12166457D01*
X32469175Y-12186402D01*
X32445320Y-12204093D01*
X32419847Y-12219362D01*
X32392999Y-12232060D01*
X32365036Y-12242065D01*
X32336228Y-12249281D01*
X32306850Y-12253639D01*
X32277187Y-12255096D01*
X31157451Y-12255096D01*
X31127788Y-12253639D01*
X31098410Y-12249281D01*
X31069602Y-12242065D01*
X31041639Y-12232060D01*
X31014791Y-12219362D01*
X30989318Y-12204093D01*
X30965463Y-12186402D01*
X30943458Y-12166457D01*
X30923513Y-12144452D01*
X30905822Y-12120597D01*
X30890553Y-12095124D01*
X30877855Y-12068276D01*
X30867850Y-12040313D01*
X30860634Y-12011505D01*
X30856276Y-11982127D01*
X30854819Y-11952464D01*
X30854819Y-10507728D01*
X30856276Y-10478065D01*
X30860634Y-10448687D01*
X30867850Y-10419879D01*
X30877855Y-10391916D01*
X30890553Y-10365068D01*
X30905822Y-10339595D01*
X30923513Y-10315740D01*
X30943458Y-10293735D01*
X30965463Y-10273790D01*
X30989318Y-10256099D01*
X31014791Y-10240830D01*
X31041639Y-10228132D01*
X31069602Y-10218127D01*
X31098410Y-10210911D01*
X31127788Y-10206553D01*
X31157451Y-10205096D01*
X32277187Y-10205096D01*
X32306850Y-10206553D01*
X32306850Y-10206553D01*
G37*
D32*
X31717319Y-11230096D03*
D10*
G36*
X35281850Y-10206553D02*
X35311228Y-10210911D01*
X35340036Y-10218127D01*
X35367999Y-10228132D01*
X35394847Y-10240830D01*
X35420320Y-10256099D01*
X35444175Y-10273790D01*
X35466180Y-10293735D01*
X35486125Y-10315740D01*
X35503816Y-10339595D01*
X35519085Y-10365068D01*
X35531783Y-10391916D01*
X35541788Y-10419879D01*
X35549004Y-10448687D01*
X35553362Y-10478065D01*
X35554819Y-10507728D01*
X35554819Y-11952464D01*
X35553362Y-11982127D01*
X35549004Y-12011505D01*
X35541788Y-12040313D01*
X35531783Y-12068276D01*
X35519085Y-12095124D01*
X35503816Y-12120597D01*
X35486125Y-12144452D01*
X35466180Y-12166457D01*
X35444175Y-12186402D01*
X35420320Y-12204093D01*
X35394847Y-12219362D01*
X35367999Y-12232060D01*
X35340036Y-12242065D01*
X35311228Y-12249281D01*
X35281850Y-12253639D01*
X35252187Y-12255096D01*
X34132451Y-12255096D01*
X34102788Y-12253639D01*
X34073410Y-12249281D01*
X34044602Y-12242065D01*
X34016639Y-12232060D01*
X33989791Y-12219362D01*
X33964318Y-12204093D01*
X33940463Y-12186402D01*
X33918458Y-12166457D01*
X33898513Y-12144452D01*
X33880822Y-12120597D01*
X33865553Y-12095124D01*
X33852855Y-12068276D01*
X33842850Y-12040313D01*
X33835634Y-12011505D01*
X33831276Y-11982127D01*
X33829819Y-11952464D01*
X33829819Y-10507728D01*
X33831276Y-10478065D01*
X33835634Y-10448687D01*
X33842850Y-10419879D01*
X33852855Y-10391916D01*
X33865553Y-10365068D01*
X33880822Y-10339595D01*
X33898513Y-10315740D01*
X33918458Y-10293735D01*
X33940463Y-10273790D01*
X33964318Y-10256099D01*
X33989791Y-10240830D01*
X34016639Y-10228132D01*
X34044602Y-10218127D01*
X34073410Y-10210911D01*
X34102788Y-10206553D01*
X34132451Y-10205096D01*
X35252187Y-10205096D01*
X35281850Y-10206553D01*
X35281850Y-10206553D01*
G37*
D32*
X34692319Y-11230096D03*
G04 #@! TD*
D10*
G04 #@! TO.C,R2*
G36*
X40361850Y-10206553D02*
X40391228Y-10210911D01*
X40420036Y-10218127D01*
X40447999Y-10228132D01*
X40474847Y-10240830D01*
X40500320Y-10256099D01*
X40524175Y-10273790D01*
X40546180Y-10293735D01*
X40566125Y-10315740D01*
X40583816Y-10339595D01*
X40599085Y-10365068D01*
X40611783Y-10391916D01*
X40621788Y-10419879D01*
X40629004Y-10448687D01*
X40633362Y-10478065D01*
X40634819Y-10507728D01*
X40634819Y-11952464D01*
X40633362Y-11982127D01*
X40629004Y-12011505D01*
X40621788Y-12040313D01*
X40611783Y-12068276D01*
X40599085Y-12095124D01*
X40583816Y-12120597D01*
X40566125Y-12144452D01*
X40546180Y-12166457D01*
X40524175Y-12186402D01*
X40500320Y-12204093D01*
X40474847Y-12219362D01*
X40447999Y-12232060D01*
X40420036Y-12242065D01*
X40391228Y-12249281D01*
X40361850Y-12253639D01*
X40332187Y-12255096D01*
X39212451Y-12255096D01*
X39182788Y-12253639D01*
X39153410Y-12249281D01*
X39124602Y-12242065D01*
X39096639Y-12232060D01*
X39069791Y-12219362D01*
X39044318Y-12204093D01*
X39020463Y-12186402D01*
X38998458Y-12166457D01*
X38978513Y-12144452D01*
X38960822Y-12120597D01*
X38945553Y-12095124D01*
X38932855Y-12068276D01*
X38922850Y-12040313D01*
X38915634Y-12011505D01*
X38911276Y-11982127D01*
X38909819Y-11952464D01*
X38909819Y-10507728D01*
X38911276Y-10478065D01*
X38915634Y-10448687D01*
X38922850Y-10419879D01*
X38932855Y-10391916D01*
X38945553Y-10365068D01*
X38960822Y-10339595D01*
X38978513Y-10315740D01*
X38998458Y-10293735D01*
X39020463Y-10273790D01*
X39044318Y-10256099D01*
X39069791Y-10240830D01*
X39096639Y-10228132D01*
X39124602Y-10218127D01*
X39153410Y-10210911D01*
X39182788Y-10206553D01*
X39212451Y-10205096D01*
X40332187Y-10205096D01*
X40361850Y-10206553D01*
X40361850Y-10206553D01*
G37*
D32*
X39772319Y-11230096D03*
D10*
G36*
X37386850Y-10206553D02*
X37416228Y-10210911D01*
X37445036Y-10218127D01*
X37472999Y-10228132D01*
X37499847Y-10240830D01*
X37525320Y-10256099D01*
X37549175Y-10273790D01*
X37571180Y-10293735D01*
X37591125Y-10315740D01*
X37608816Y-10339595D01*
X37624085Y-10365068D01*
X37636783Y-10391916D01*
X37646788Y-10419879D01*
X37654004Y-10448687D01*
X37658362Y-10478065D01*
X37659819Y-10507728D01*
X37659819Y-11952464D01*
X37658362Y-11982127D01*
X37654004Y-12011505D01*
X37646788Y-12040313D01*
X37636783Y-12068276D01*
X37624085Y-12095124D01*
X37608816Y-12120597D01*
X37591125Y-12144452D01*
X37571180Y-12166457D01*
X37549175Y-12186402D01*
X37525320Y-12204093D01*
X37499847Y-12219362D01*
X37472999Y-12232060D01*
X37445036Y-12242065D01*
X37416228Y-12249281D01*
X37386850Y-12253639D01*
X37357187Y-12255096D01*
X36237451Y-12255096D01*
X36207788Y-12253639D01*
X36178410Y-12249281D01*
X36149602Y-12242065D01*
X36121639Y-12232060D01*
X36094791Y-12219362D01*
X36069318Y-12204093D01*
X36045463Y-12186402D01*
X36023458Y-12166457D01*
X36003513Y-12144452D01*
X35985822Y-12120597D01*
X35970553Y-12095124D01*
X35957855Y-12068276D01*
X35947850Y-12040313D01*
X35940634Y-12011505D01*
X35936276Y-11982127D01*
X35934819Y-11952464D01*
X35934819Y-10507728D01*
X35936276Y-10478065D01*
X35940634Y-10448687D01*
X35947850Y-10419879D01*
X35957855Y-10391916D01*
X35970553Y-10365068D01*
X35985822Y-10339595D01*
X36003513Y-10315740D01*
X36023458Y-10293735D01*
X36045463Y-10273790D01*
X36069318Y-10256099D01*
X36094791Y-10240830D01*
X36121639Y-10228132D01*
X36149602Y-10218127D01*
X36178410Y-10210911D01*
X36207788Y-10206553D01*
X36237451Y-10205096D01*
X37357187Y-10205096D01*
X37386850Y-10206553D01*
X37386850Y-10206553D01*
G37*
D32*
X36797319Y-11230096D03*
G04 #@! TD*
D10*
G04 #@! TO.C,R3*
G36*
X45333031Y-10206553D02*
X45362409Y-10210911D01*
X45391217Y-10218127D01*
X45419180Y-10228132D01*
X45446028Y-10240830D01*
X45471501Y-10256099D01*
X45495356Y-10273790D01*
X45517361Y-10293735D01*
X45537306Y-10315740D01*
X45554997Y-10339595D01*
X45570266Y-10365068D01*
X45582964Y-10391916D01*
X45592969Y-10419879D01*
X45600185Y-10448687D01*
X45604543Y-10478065D01*
X45606000Y-10507728D01*
X45606000Y-11952464D01*
X45604543Y-11982127D01*
X45600185Y-12011505D01*
X45592969Y-12040313D01*
X45582964Y-12068276D01*
X45570266Y-12095124D01*
X45554997Y-12120597D01*
X45537306Y-12144452D01*
X45517361Y-12166457D01*
X45495356Y-12186402D01*
X45471501Y-12204093D01*
X45446028Y-12219362D01*
X45419180Y-12232060D01*
X45391217Y-12242065D01*
X45362409Y-12249281D01*
X45333031Y-12253639D01*
X45303368Y-12255096D01*
X44183632Y-12255096D01*
X44153969Y-12253639D01*
X44124591Y-12249281D01*
X44095783Y-12242065D01*
X44067820Y-12232060D01*
X44040972Y-12219362D01*
X44015499Y-12204093D01*
X43991644Y-12186402D01*
X43969639Y-12166457D01*
X43949694Y-12144452D01*
X43932003Y-12120597D01*
X43916734Y-12095124D01*
X43904036Y-12068276D01*
X43894031Y-12040313D01*
X43886815Y-12011505D01*
X43882457Y-11982127D01*
X43881000Y-11952464D01*
X43881000Y-10507728D01*
X43882457Y-10478065D01*
X43886815Y-10448687D01*
X43894031Y-10419879D01*
X43904036Y-10391916D01*
X43916734Y-10365068D01*
X43932003Y-10339595D01*
X43949694Y-10315740D01*
X43969639Y-10293735D01*
X43991644Y-10273790D01*
X44015499Y-10256099D01*
X44040972Y-10240830D01*
X44067820Y-10228132D01*
X44095783Y-10218127D01*
X44124591Y-10210911D01*
X44153969Y-10206553D01*
X44183632Y-10205096D01*
X45303368Y-10205096D01*
X45333031Y-10206553D01*
X45333031Y-10206553D01*
G37*
D32*
X44743500Y-11230096D03*
D10*
G36*
X42358031Y-10206553D02*
X42387409Y-10210911D01*
X42416217Y-10218127D01*
X42444180Y-10228132D01*
X42471028Y-10240830D01*
X42496501Y-10256099D01*
X42520356Y-10273790D01*
X42542361Y-10293735D01*
X42562306Y-10315740D01*
X42579997Y-10339595D01*
X42595266Y-10365068D01*
X42607964Y-10391916D01*
X42617969Y-10419879D01*
X42625185Y-10448687D01*
X42629543Y-10478065D01*
X42631000Y-10507728D01*
X42631000Y-11952464D01*
X42629543Y-11982127D01*
X42625185Y-12011505D01*
X42617969Y-12040313D01*
X42607964Y-12068276D01*
X42595266Y-12095124D01*
X42579997Y-12120597D01*
X42562306Y-12144452D01*
X42542361Y-12166457D01*
X42520356Y-12186402D01*
X42496501Y-12204093D01*
X42471028Y-12219362D01*
X42444180Y-12232060D01*
X42416217Y-12242065D01*
X42387409Y-12249281D01*
X42358031Y-12253639D01*
X42328368Y-12255096D01*
X41208632Y-12255096D01*
X41178969Y-12253639D01*
X41149591Y-12249281D01*
X41120783Y-12242065D01*
X41092820Y-12232060D01*
X41065972Y-12219362D01*
X41040499Y-12204093D01*
X41016644Y-12186402D01*
X40994639Y-12166457D01*
X40974694Y-12144452D01*
X40957003Y-12120597D01*
X40941734Y-12095124D01*
X40929036Y-12068276D01*
X40919031Y-12040313D01*
X40911815Y-12011505D01*
X40907457Y-11982127D01*
X40906000Y-11952464D01*
X40906000Y-10507728D01*
X40907457Y-10478065D01*
X40911815Y-10448687D01*
X40919031Y-10419879D01*
X40929036Y-10391916D01*
X40941734Y-10365068D01*
X40957003Y-10339595D01*
X40974694Y-10315740D01*
X40994639Y-10293735D01*
X41016644Y-10273790D01*
X41040499Y-10256099D01*
X41065972Y-10240830D01*
X41092820Y-10228132D01*
X41120783Y-10218127D01*
X41149591Y-10210911D01*
X41178969Y-10206553D01*
X41208632Y-10205096D01*
X42328368Y-10205096D01*
X42358031Y-10206553D01*
X42358031Y-10206553D01*
G37*
D32*
X41768500Y-11230096D03*
G04 #@! TD*
D10*
G04 #@! TO.C,R4*
G36*
X-26297969Y-35806457D02*
X-26268591Y-35810815D01*
X-26239783Y-35818031D01*
X-26211820Y-35828036D01*
X-26184972Y-35840734D01*
X-26159499Y-35856003D01*
X-26135644Y-35873694D01*
X-26113639Y-35893639D01*
X-26093694Y-35915644D01*
X-26076003Y-35939499D01*
X-26060734Y-35964972D01*
X-26048036Y-35991820D01*
X-26038031Y-36019783D01*
X-26030815Y-36048591D01*
X-26026457Y-36077969D01*
X-26025000Y-36107632D01*
X-26025000Y-37552368D01*
X-26026457Y-37582031D01*
X-26030815Y-37611409D01*
X-26038031Y-37640217D01*
X-26048036Y-37668180D01*
X-26060734Y-37695028D01*
X-26076003Y-37720501D01*
X-26093694Y-37744356D01*
X-26113639Y-37766361D01*
X-26135644Y-37786306D01*
X-26159499Y-37803997D01*
X-26184972Y-37819266D01*
X-26211820Y-37831964D01*
X-26239783Y-37841969D01*
X-26268591Y-37849185D01*
X-26297969Y-37853543D01*
X-26327632Y-37855000D01*
X-27447368Y-37855000D01*
X-27477031Y-37853543D01*
X-27506409Y-37849185D01*
X-27535217Y-37841969D01*
X-27563180Y-37831964D01*
X-27590028Y-37819266D01*
X-27615501Y-37803997D01*
X-27639356Y-37786306D01*
X-27661361Y-37766361D01*
X-27681306Y-37744356D01*
X-27698997Y-37720501D01*
X-27714266Y-37695028D01*
X-27726964Y-37668180D01*
X-27736969Y-37640217D01*
X-27744185Y-37611409D01*
X-27748543Y-37582031D01*
X-27750000Y-37552368D01*
X-27750000Y-36107632D01*
X-27748543Y-36077969D01*
X-27744185Y-36048591D01*
X-27736969Y-36019783D01*
X-27726964Y-35991820D01*
X-27714266Y-35964972D01*
X-27698997Y-35939499D01*
X-27681306Y-35915644D01*
X-27661361Y-35893639D01*
X-27639356Y-35873694D01*
X-27615501Y-35856003D01*
X-27590028Y-35840734D01*
X-27563180Y-35828036D01*
X-27535217Y-35818031D01*
X-27506409Y-35810815D01*
X-27477031Y-35806457D01*
X-27447368Y-35805000D01*
X-26327632Y-35805000D01*
X-26297969Y-35806457D01*
X-26297969Y-35806457D01*
G37*
D32*
X-26887500Y-36830000D03*
D10*
G36*
X-23322969Y-35806457D02*
X-23293591Y-35810815D01*
X-23264783Y-35818031D01*
X-23236820Y-35828036D01*
X-23209972Y-35840734D01*
X-23184499Y-35856003D01*
X-23160644Y-35873694D01*
X-23138639Y-35893639D01*
X-23118694Y-35915644D01*
X-23101003Y-35939499D01*
X-23085734Y-35964972D01*
X-23073036Y-35991820D01*
X-23063031Y-36019783D01*
X-23055815Y-36048591D01*
X-23051457Y-36077969D01*
X-23050000Y-36107632D01*
X-23050000Y-37552368D01*
X-23051457Y-37582031D01*
X-23055815Y-37611409D01*
X-23063031Y-37640217D01*
X-23073036Y-37668180D01*
X-23085734Y-37695028D01*
X-23101003Y-37720501D01*
X-23118694Y-37744356D01*
X-23138639Y-37766361D01*
X-23160644Y-37786306D01*
X-23184499Y-37803997D01*
X-23209972Y-37819266D01*
X-23236820Y-37831964D01*
X-23264783Y-37841969D01*
X-23293591Y-37849185D01*
X-23322969Y-37853543D01*
X-23352632Y-37855000D01*
X-24472368Y-37855000D01*
X-24502031Y-37853543D01*
X-24531409Y-37849185D01*
X-24560217Y-37841969D01*
X-24588180Y-37831964D01*
X-24615028Y-37819266D01*
X-24640501Y-37803997D01*
X-24664356Y-37786306D01*
X-24686361Y-37766361D01*
X-24706306Y-37744356D01*
X-24723997Y-37720501D01*
X-24739266Y-37695028D01*
X-24751964Y-37668180D01*
X-24761969Y-37640217D01*
X-24769185Y-37611409D01*
X-24773543Y-37582031D01*
X-24775000Y-37552368D01*
X-24775000Y-36107632D01*
X-24773543Y-36077969D01*
X-24769185Y-36048591D01*
X-24761969Y-36019783D01*
X-24751964Y-35991820D01*
X-24739266Y-35964972D01*
X-24723997Y-35939499D01*
X-24706306Y-35915644D01*
X-24686361Y-35893639D01*
X-24664356Y-35873694D01*
X-24640501Y-35856003D01*
X-24615028Y-35840734D01*
X-24588180Y-35828036D01*
X-24560217Y-35818031D01*
X-24531409Y-35810815D01*
X-24502031Y-35806457D01*
X-24472368Y-35805000D01*
X-23352632Y-35805000D01*
X-23322969Y-35806457D01*
X-23322969Y-35806457D01*
G37*
D32*
X-23912500Y-36830000D03*
G04 #@! TD*
D10*
G04 #@! TO.C,R6*
G36*
X31232031Y9968543D02*
X31261409Y9964185D01*
X31290217Y9956969D01*
X31318180Y9946964D01*
X31345028Y9934266D01*
X31370501Y9918997D01*
X31394356Y9901306D01*
X31416361Y9881361D01*
X31436306Y9859356D01*
X31453997Y9835501D01*
X31469266Y9810028D01*
X31481964Y9783180D01*
X31491969Y9755217D01*
X31499185Y9726409D01*
X31503543Y9697031D01*
X31505000Y9667368D01*
X31505000Y8547632D01*
X31503543Y8517969D01*
X31499185Y8488591D01*
X31491969Y8459783D01*
X31481964Y8431820D01*
X31469266Y8404972D01*
X31453997Y8379499D01*
X31436306Y8355644D01*
X31416361Y8333639D01*
X31394356Y8313694D01*
X31370501Y8296003D01*
X31345028Y8280734D01*
X31318180Y8268036D01*
X31290217Y8258031D01*
X31261409Y8250815D01*
X31232031Y8246457D01*
X31202368Y8245000D01*
X29757632Y8245000D01*
X29727969Y8246457D01*
X29698591Y8250815D01*
X29669783Y8258031D01*
X29641820Y8268036D01*
X29614972Y8280734D01*
X29589499Y8296003D01*
X29565644Y8313694D01*
X29543639Y8333639D01*
X29523694Y8355644D01*
X29506003Y8379499D01*
X29490734Y8404972D01*
X29478036Y8431820D01*
X29468031Y8459783D01*
X29460815Y8488591D01*
X29456457Y8517969D01*
X29455000Y8547632D01*
X29455000Y9667368D01*
X29456457Y9697031D01*
X29460815Y9726409D01*
X29468031Y9755217D01*
X29478036Y9783180D01*
X29490734Y9810028D01*
X29506003Y9835501D01*
X29523694Y9859356D01*
X29543639Y9881361D01*
X29565644Y9901306D01*
X29589499Y9918997D01*
X29614972Y9934266D01*
X29641820Y9946964D01*
X29669783Y9956969D01*
X29698591Y9964185D01*
X29727969Y9968543D01*
X29757632Y9970000D01*
X31202368Y9970000D01*
X31232031Y9968543D01*
X31232031Y9968543D01*
G37*
D32*
X30480000Y9107500D03*
D10*
G36*
X31232031Y6993543D02*
X31261409Y6989185D01*
X31290217Y6981969D01*
X31318180Y6971964D01*
X31345028Y6959266D01*
X31370501Y6943997D01*
X31394356Y6926306D01*
X31416361Y6906361D01*
X31436306Y6884356D01*
X31453997Y6860501D01*
X31469266Y6835028D01*
X31481964Y6808180D01*
X31491969Y6780217D01*
X31499185Y6751409D01*
X31503543Y6722031D01*
X31505000Y6692368D01*
X31505000Y5572632D01*
X31503543Y5542969D01*
X31499185Y5513591D01*
X31491969Y5484783D01*
X31481964Y5456820D01*
X31469266Y5429972D01*
X31453997Y5404499D01*
X31436306Y5380644D01*
X31416361Y5358639D01*
X31394356Y5338694D01*
X31370501Y5321003D01*
X31345028Y5305734D01*
X31318180Y5293036D01*
X31290217Y5283031D01*
X31261409Y5275815D01*
X31232031Y5271457D01*
X31202368Y5270000D01*
X29757632Y5270000D01*
X29727969Y5271457D01*
X29698591Y5275815D01*
X29669783Y5283031D01*
X29641820Y5293036D01*
X29614972Y5305734D01*
X29589499Y5321003D01*
X29565644Y5338694D01*
X29543639Y5358639D01*
X29523694Y5380644D01*
X29506003Y5404499D01*
X29490734Y5429972D01*
X29478036Y5456820D01*
X29468031Y5484783D01*
X29460815Y5513591D01*
X29456457Y5542969D01*
X29455000Y5572632D01*
X29455000Y6692368D01*
X29456457Y6722031D01*
X29460815Y6751409D01*
X29468031Y6780217D01*
X29478036Y6808180D01*
X29490734Y6835028D01*
X29506003Y6860501D01*
X29523694Y6884356D01*
X29543639Y6906361D01*
X29565644Y6926306D01*
X29589499Y6943997D01*
X29614972Y6959266D01*
X29641820Y6971964D01*
X29669783Y6981969D01*
X29698591Y6989185D01*
X29727969Y6993543D01*
X29757632Y6995000D01*
X31202368Y6995000D01*
X31232031Y6993543D01*
X31232031Y6993543D01*
G37*
D32*
X30480000Y6132500D03*
G04 #@! TD*
D37*
G04 #@! TO.C,U2*
X26355000Y13800000D03*
X27305000Y13800000D03*
X28255000Y13800000D03*
X28255000Y11600000D03*
X26355000Y11600000D03*
G04 #@! TD*
D26*
G04 #@! TO.C,F1*
X-20320000Y-25400000D03*
X-20320000Y-47900000D03*
X-20320000Y-36650000D03*
G04 #@! TD*
D29*
G04 #@! TO.C,SW1*
X-40005000Y-42600000D03*
X-40005000Y-38100000D03*
X-33505000Y-42600000D03*
X-33505000Y-38100000D03*
G04 #@! TD*
G04 #@! TO.C,REF\002A\002A*
X-2540000Y16510000D03*
G04 #@! TD*
D10*
G04 #@! TO.C,R7*
G36*
X22343031Y17533543D02*
X22372409Y17529185D01*
X22401217Y17521969D01*
X22429180Y17511964D01*
X22456028Y17499266D01*
X22481501Y17483997D01*
X22505356Y17466306D01*
X22527361Y17446361D01*
X22547306Y17424356D01*
X22564997Y17400501D01*
X22580266Y17375028D01*
X22592964Y17348180D01*
X22602969Y17320217D01*
X22610185Y17291409D01*
X22614543Y17262031D01*
X22616000Y17232368D01*
X22616000Y15787632D01*
X22614543Y15757969D01*
X22610185Y15728591D01*
X22602969Y15699783D01*
X22592964Y15671820D01*
X22580266Y15644972D01*
X22564997Y15619499D01*
X22547306Y15595644D01*
X22527361Y15573639D01*
X22505356Y15553694D01*
X22481501Y15536003D01*
X22456028Y15520734D01*
X22429180Y15508036D01*
X22401217Y15498031D01*
X22372409Y15490815D01*
X22343031Y15486457D01*
X22313368Y15485000D01*
X21193632Y15485000D01*
X21163969Y15486457D01*
X21134591Y15490815D01*
X21105783Y15498031D01*
X21077820Y15508036D01*
X21050972Y15520734D01*
X21025499Y15536003D01*
X21001644Y15553694D01*
X20979639Y15573639D01*
X20959694Y15595644D01*
X20942003Y15619499D01*
X20926734Y15644972D01*
X20914036Y15671820D01*
X20904031Y15699783D01*
X20896815Y15728591D01*
X20892457Y15757969D01*
X20891000Y15787632D01*
X20891000Y17232368D01*
X20892457Y17262031D01*
X20896815Y17291409D01*
X20904031Y17320217D01*
X20914036Y17348180D01*
X20926734Y17375028D01*
X20942003Y17400501D01*
X20959694Y17424356D01*
X20979639Y17446361D01*
X21001644Y17466306D01*
X21025499Y17483997D01*
X21050972Y17499266D01*
X21077820Y17511964D01*
X21105783Y17521969D01*
X21134591Y17529185D01*
X21163969Y17533543D01*
X21193632Y17535000D01*
X22313368Y17535000D01*
X22343031Y17533543D01*
X22343031Y17533543D01*
G37*
D32*
X21753500Y16510000D03*
D10*
G36*
X25318031Y17533543D02*
X25347409Y17529185D01*
X25376217Y17521969D01*
X25404180Y17511964D01*
X25431028Y17499266D01*
X25456501Y17483997D01*
X25480356Y17466306D01*
X25502361Y17446361D01*
X25522306Y17424356D01*
X25539997Y17400501D01*
X25555266Y17375028D01*
X25567964Y17348180D01*
X25577969Y17320217D01*
X25585185Y17291409D01*
X25589543Y17262031D01*
X25591000Y17232368D01*
X25591000Y15787632D01*
X25589543Y15757969D01*
X25585185Y15728591D01*
X25577969Y15699783D01*
X25567964Y15671820D01*
X25555266Y15644972D01*
X25539997Y15619499D01*
X25522306Y15595644D01*
X25502361Y15573639D01*
X25480356Y15553694D01*
X25456501Y15536003D01*
X25431028Y15520734D01*
X25404180Y15508036D01*
X25376217Y15498031D01*
X25347409Y15490815D01*
X25318031Y15486457D01*
X25288368Y15485000D01*
X24168632Y15485000D01*
X24138969Y15486457D01*
X24109591Y15490815D01*
X24080783Y15498031D01*
X24052820Y15508036D01*
X24025972Y15520734D01*
X24000499Y15536003D01*
X23976644Y15553694D01*
X23954639Y15573639D01*
X23934694Y15595644D01*
X23917003Y15619499D01*
X23901734Y15644972D01*
X23889036Y15671820D01*
X23879031Y15699783D01*
X23871815Y15728591D01*
X23867457Y15757969D01*
X23866000Y15787632D01*
X23866000Y17232368D01*
X23867457Y17262031D01*
X23871815Y17291409D01*
X23879031Y17320217D01*
X23889036Y17348180D01*
X23901734Y17375028D01*
X23917003Y17400501D01*
X23934694Y17424356D01*
X23954639Y17446361D01*
X23976644Y17466306D01*
X24000499Y17483997D01*
X24025972Y17499266D01*
X24052820Y17511964D01*
X24080783Y17521969D01*
X24109591Y17529185D01*
X24138969Y17533543D01*
X24168632Y17535000D01*
X25288368Y17535000D01*
X25318031Y17533543D01*
X25318031Y17533543D01*
G37*
D32*
X24728500Y16510000D03*
G04 #@! TD*
D10*
G04 #@! TO.C,R8*
G36*
X21036531Y14231543D02*
X21065909Y14227185D01*
X21094717Y14219969D01*
X21122680Y14209964D01*
X21149528Y14197266D01*
X21175001Y14181997D01*
X21198856Y14164306D01*
X21220861Y14144361D01*
X21240806Y14122356D01*
X21258497Y14098501D01*
X21273766Y14073028D01*
X21286464Y14046180D01*
X21296469Y14018217D01*
X21303685Y13989409D01*
X21308043Y13960031D01*
X21309500Y13930368D01*
X21309500Y12485632D01*
X21308043Y12455969D01*
X21303685Y12426591D01*
X21296469Y12397783D01*
X21286464Y12369820D01*
X21273766Y12342972D01*
X21258497Y12317499D01*
X21240806Y12293644D01*
X21220861Y12271639D01*
X21198856Y12251694D01*
X21175001Y12234003D01*
X21149528Y12218734D01*
X21122680Y12206036D01*
X21094717Y12196031D01*
X21065909Y12188815D01*
X21036531Y12184457D01*
X21006868Y12183000D01*
X19887132Y12183000D01*
X19857469Y12184457D01*
X19828091Y12188815D01*
X19799283Y12196031D01*
X19771320Y12206036D01*
X19744472Y12218734D01*
X19718999Y12234003D01*
X19695144Y12251694D01*
X19673139Y12271639D01*
X19653194Y12293644D01*
X19635503Y12317499D01*
X19620234Y12342972D01*
X19607536Y12369820D01*
X19597531Y12397783D01*
X19590315Y12426591D01*
X19585957Y12455969D01*
X19584500Y12485632D01*
X19584500Y13930368D01*
X19585957Y13960031D01*
X19590315Y13989409D01*
X19597531Y14018217D01*
X19607536Y14046180D01*
X19620234Y14073028D01*
X19635503Y14098501D01*
X19653194Y14122356D01*
X19673139Y14144361D01*
X19695144Y14164306D01*
X19718999Y14181997D01*
X19744472Y14197266D01*
X19771320Y14209964D01*
X19799283Y14219969D01*
X19828091Y14227185D01*
X19857469Y14231543D01*
X19887132Y14233000D01*
X21006868Y14233000D01*
X21036531Y14231543D01*
X21036531Y14231543D01*
G37*
D32*
X20447000Y13208000D03*
D10*
G36*
X18061531Y14231543D02*
X18090909Y14227185D01*
X18119717Y14219969D01*
X18147680Y14209964D01*
X18174528Y14197266D01*
X18200001Y14181997D01*
X18223856Y14164306D01*
X18245861Y14144361D01*
X18265806Y14122356D01*
X18283497Y14098501D01*
X18298766Y14073028D01*
X18311464Y14046180D01*
X18321469Y14018217D01*
X18328685Y13989409D01*
X18333043Y13960031D01*
X18334500Y13930368D01*
X18334500Y12485632D01*
X18333043Y12455969D01*
X18328685Y12426591D01*
X18321469Y12397783D01*
X18311464Y12369820D01*
X18298766Y12342972D01*
X18283497Y12317499D01*
X18265806Y12293644D01*
X18245861Y12271639D01*
X18223856Y12251694D01*
X18200001Y12234003D01*
X18174528Y12218734D01*
X18147680Y12206036D01*
X18119717Y12196031D01*
X18090909Y12188815D01*
X18061531Y12184457D01*
X18031868Y12183000D01*
X16912132Y12183000D01*
X16882469Y12184457D01*
X16853091Y12188815D01*
X16824283Y12196031D01*
X16796320Y12206036D01*
X16769472Y12218734D01*
X16743999Y12234003D01*
X16720144Y12251694D01*
X16698139Y12271639D01*
X16678194Y12293644D01*
X16660503Y12317499D01*
X16645234Y12342972D01*
X16632536Y12369820D01*
X16622531Y12397783D01*
X16615315Y12426591D01*
X16610957Y12455969D01*
X16609500Y12485632D01*
X16609500Y13930368D01*
X16610957Y13960031D01*
X16615315Y13989409D01*
X16622531Y14018217D01*
X16632536Y14046180D01*
X16645234Y14073028D01*
X16660503Y14098501D01*
X16678194Y14122356D01*
X16698139Y14144361D01*
X16720144Y14164306D01*
X16743999Y14181997D01*
X16769472Y14197266D01*
X16796320Y14209964D01*
X16824283Y14219969D01*
X16853091Y14227185D01*
X16882469Y14231543D01*
X16912132Y14233000D01*
X18031868Y14233000D01*
X18061531Y14231543D01*
X18061531Y14231543D01*
G37*
D32*
X17472000Y13208000D03*
G04 #@! TD*
D10*
G04 #@! TO.C,C5*
G36*
X22143031Y-15740457D02*
X22172409Y-15744815D01*
X22201217Y-15752031D01*
X22229180Y-15762036D01*
X22256028Y-15774734D01*
X22281501Y-15790003D01*
X22305356Y-15807694D01*
X22327361Y-15827639D01*
X22347306Y-15849644D01*
X22364997Y-15873499D01*
X22380266Y-15898972D01*
X22392964Y-15925820D01*
X22402969Y-15953783D01*
X22410185Y-15982591D01*
X22414543Y-16011969D01*
X22416000Y-16041632D01*
X22416000Y-17486368D01*
X22414543Y-17516031D01*
X22410185Y-17545409D01*
X22402969Y-17574217D01*
X22392964Y-17602180D01*
X22380266Y-17629028D01*
X22364997Y-17654501D01*
X22347306Y-17678356D01*
X22327361Y-17700361D01*
X22305356Y-17720306D01*
X22281501Y-17737997D01*
X22256028Y-17753266D01*
X22229180Y-17765964D01*
X22201217Y-17775969D01*
X22172409Y-17783185D01*
X22143031Y-17787543D01*
X22113368Y-17789000D01*
X20993632Y-17789000D01*
X20963969Y-17787543D01*
X20934591Y-17783185D01*
X20905783Y-17775969D01*
X20877820Y-17765964D01*
X20850972Y-17753266D01*
X20825499Y-17737997D01*
X20801644Y-17720306D01*
X20779639Y-17700361D01*
X20759694Y-17678356D01*
X20742003Y-17654501D01*
X20726734Y-17629028D01*
X20714036Y-17602180D01*
X20704031Y-17574217D01*
X20696815Y-17545409D01*
X20692457Y-17516031D01*
X20691000Y-17486368D01*
X20691000Y-16041632D01*
X20692457Y-16011969D01*
X20696815Y-15982591D01*
X20704031Y-15953783D01*
X20714036Y-15925820D01*
X20726734Y-15898972D01*
X20742003Y-15873499D01*
X20759694Y-15849644D01*
X20779639Y-15827639D01*
X20801644Y-15807694D01*
X20825499Y-15790003D01*
X20850972Y-15774734D01*
X20877820Y-15762036D01*
X20905783Y-15752031D01*
X20934591Y-15744815D01*
X20963969Y-15740457D01*
X20993632Y-15739000D01*
X22113368Y-15739000D01*
X22143031Y-15740457D01*
X22143031Y-15740457D01*
G37*
D32*
X21553500Y-16764000D03*
D10*
G36*
X19168031Y-15740457D02*
X19197409Y-15744815D01*
X19226217Y-15752031D01*
X19254180Y-15762036D01*
X19281028Y-15774734D01*
X19306501Y-15790003D01*
X19330356Y-15807694D01*
X19352361Y-15827639D01*
X19372306Y-15849644D01*
X19389997Y-15873499D01*
X19405266Y-15898972D01*
X19417964Y-15925820D01*
X19427969Y-15953783D01*
X19435185Y-15982591D01*
X19439543Y-16011969D01*
X19441000Y-16041632D01*
X19441000Y-17486368D01*
X19439543Y-17516031D01*
X19435185Y-17545409D01*
X19427969Y-17574217D01*
X19417964Y-17602180D01*
X19405266Y-17629028D01*
X19389997Y-17654501D01*
X19372306Y-17678356D01*
X19352361Y-17700361D01*
X19330356Y-17720306D01*
X19306501Y-17737997D01*
X19281028Y-17753266D01*
X19254180Y-17765964D01*
X19226217Y-17775969D01*
X19197409Y-17783185D01*
X19168031Y-17787543D01*
X19138368Y-17789000D01*
X18018632Y-17789000D01*
X17988969Y-17787543D01*
X17959591Y-17783185D01*
X17930783Y-17775969D01*
X17902820Y-17765964D01*
X17875972Y-17753266D01*
X17850499Y-17737997D01*
X17826644Y-17720306D01*
X17804639Y-17700361D01*
X17784694Y-17678356D01*
X17767003Y-17654501D01*
X17751734Y-17629028D01*
X17739036Y-17602180D01*
X17729031Y-17574217D01*
X17721815Y-17545409D01*
X17717457Y-17516031D01*
X17716000Y-17486368D01*
X17716000Y-16041632D01*
X17717457Y-16011969D01*
X17721815Y-15982591D01*
X17729031Y-15953783D01*
X17739036Y-15925820D01*
X17751734Y-15898972D01*
X17767003Y-15873499D01*
X17784694Y-15849644D01*
X17804639Y-15827639D01*
X17826644Y-15807694D01*
X17850499Y-15790003D01*
X17875972Y-15774734D01*
X17902820Y-15762036D01*
X17930783Y-15752031D01*
X17959591Y-15744815D01*
X17988969Y-15740457D01*
X18018632Y-15739000D01*
X19138368Y-15739000D01*
X19168031Y-15740457D01*
X19168031Y-15740457D01*
G37*
D32*
X18578500Y-16764000D03*
G04 #@! TD*
D10*
G04 #@! TO.C,R9*
G36*
X44567031Y-27951457D02*
X44596409Y-27955815D01*
X44625217Y-27963031D01*
X44653180Y-27973036D01*
X44680028Y-27985734D01*
X44705501Y-28001003D01*
X44729356Y-28018694D01*
X44751361Y-28038639D01*
X44771306Y-28060644D01*
X44788997Y-28084499D01*
X44804266Y-28109972D01*
X44816964Y-28136820D01*
X44826969Y-28164783D01*
X44834185Y-28193591D01*
X44838543Y-28222969D01*
X44840000Y-28252632D01*
X44840000Y-29372368D01*
X44838543Y-29402031D01*
X44834185Y-29431409D01*
X44826969Y-29460217D01*
X44816964Y-29488180D01*
X44804266Y-29515028D01*
X44788997Y-29540501D01*
X44771306Y-29564356D01*
X44751361Y-29586361D01*
X44729356Y-29606306D01*
X44705501Y-29623997D01*
X44680028Y-29639266D01*
X44653180Y-29651964D01*
X44625217Y-29661969D01*
X44596409Y-29669185D01*
X44567031Y-29673543D01*
X44537368Y-29675000D01*
X43092632Y-29675000D01*
X43062969Y-29673543D01*
X43033591Y-29669185D01*
X43004783Y-29661969D01*
X42976820Y-29651964D01*
X42949972Y-29639266D01*
X42924499Y-29623997D01*
X42900644Y-29606306D01*
X42878639Y-29586361D01*
X42858694Y-29564356D01*
X42841003Y-29540501D01*
X42825734Y-29515028D01*
X42813036Y-29488180D01*
X42803031Y-29460217D01*
X42795815Y-29431409D01*
X42791457Y-29402031D01*
X42790000Y-29372368D01*
X42790000Y-28252632D01*
X42791457Y-28222969D01*
X42795815Y-28193591D01*
X42803031Y-28164783D01*
X42813036Y-28136820D01*
X42825734Y-28109972D01*
X42841003Y-28084499D01*
X42858694Y-28060644D01*
X42878639Y-28038639D01*
X42900644Y-28018694D01*
X42924499Y-28001003D01*
X42949972Y-27985734D01*
X42976820Y-27973036D01*
X43004783Y-27963031D01*
X43033591Y-27955815D01*
X43062969Y-27951457D01*
X43092632Y-27950000D01*
X44537368Y-27950000D01*
X44567031Y-27951457D01*
X44567031Y-27951457D01*
G37*
D32*
X43815000Y-28812500D03*
D10*
G36*
X44567031Y-30926457D02*
X44596409Y-30930815D01*
X44625217Y-30938031D01*
X44653180Y-30948036D01*
X44680028Y-30960734D01*
X44705501Y-30976003D01*
X44729356Y-30993694D01*
X44751361Y-31013639D01*
X44771306Y-31035644D01*
X44788997Y-31059499D01*
X44804266Y-31084972D01*
X44816964Y-31111820D01*
X44826969Y-31139783D01*
X44834185Y-31168591D01*
X44838543Y-31197969D01*
X44840000Y-31227632D01*
X44840000Y-32347368D01*
X44838543Y-32377031D01*
X44834185Y-32406409D01*
X44826969Y-32435217D01*
X44816964Y-32463180D01*
X44804266Y-32490028D01*
X44788997Y-32515501D01*
X44771306Y-32539356D01*
X44751361Y-32561361D01*
X44729356Y-32581306D01*
X44705501Y-32598997D01*
X44680028Y-32614266D01*
X44653180Y-32626964D01*
X44625217Y-32636969D01*
X44596409Y-32644185D01*
X44567031Y-32648543D01*
X44537368Y-32650000D01*
X43092632Y-32650000D01*
X43062969Y-32648543D01*
X43033591Y-32644185D01*
X43004783Y-32636969D01*
X42976820Y-32626964D01*
X42949972Y-32614266D01*
X42924499Y-32598997D01*
X42900644Y-32581306D01*
X42878639Y-32561361D01*
X42858694Y-32539356D01*
X42841003Y-32515501D01*
X42825734Y-32490028D01*
X42813036Y-32463180D01*
X42803031Y-32435217D01*
X42795815Y-32406409D01*
X42791457Y-32377031D01*
X42790000Y-32347368D01*
X42790000Y-31227632D01*
X42791457Y-31197969D01*
X42795815Y-31168591D01*
X42803031Y-31139783D01*
X42813036Y-31111820D01*
X42825734Y-31084972D01*
X42841003Y-31059499D01*
X42858694Y-31035644D01*
X42878639Y-31013639D01*
X42900644Y-30993694D01*
X42924499Y-30976003D01*
X42949972Y-30960734D01*
X42976820Y-30948036D01*
X43004783Y-30938031D01*
X43033591Y-30930815D01*
X43062969Y-30926457D01*
X43092632Y-30925000D01*
X44537368Y-30925000D01*
X44567031Y-30926457D01*
X44567031Y-30926457D01*
G37*
D32*
X43815000Y-31787500D03*
G04 #@! TD*
D26*
G04 #@! TO.C,REF\002A\002A*
X7442000Y-6375200D03*
G04 #@! TD*
M02*
