feat: TLS credentials from Core API with Auth0 JWT

2 jobs for master in 1 minute and 42 seconds (queued for 14 minutes and 18 seconds)
Status Job ID Name Coverage
  Test
failed #207223839
test:current

00:01:42

failed #207223840
test:lts-10

00:01:32

 
Name Stage Failure
failed
test:current Test
npm ERR! Exit status 1
npm ERR!
npm ERR! Failed at the @commonshost/server@6.9.0 proof script.
npm ERR! This is probably not a problem with npm. There is likely additional logging output above.

npm ERR! A complete log of this run can be found in:
npm ERR! /root/.npm/_logs/2019-05-05T03_48_40_923Z-debug.log
npm ERR! Test failed. See above for more details.
ERROR: Job failed: exit code 1
failed
test:lts-10 Test
npm ERR! Exit status 1
npm ERR!
npm ERR! Failed at the @commonshost/server@6.9.0 proof script.
npm ERR! This is probably not a problem with npm. There is likely additional logging output above.

npm ERR! A complete log of this run can be found in:
npm ERR! /root/.npm/_logs/2019-05-05T03_48_28_809Z-debug.log
npm ERR! Test failed. See above for more details.
ERROR: Job failed: exit code 1