bump: deps

2 jobs for master in 1 minute and 47 seconds (queued for 1 second)
Status Job ID Name Coverage
  Test
failed #206002584
test:current

00:01:47

failed #206002585
test:lts-10

00:01:31

 
Name Stage Failure
failed
test:current Test
npm ERR! Exit status 1
npm ERR!
npm ERR! Failed at the @commonshost/server@6.9.0 proof script.
npm ERR! This is probably not a problem with npm. There is likely additional logging output above.

npm ERR! A complete log of this run can be found in:
npm ERR! /root/.npm/_logs/2019-05-02T11_34_12_546Z-debug.log
npm ERR! Test failed. See above for more details.
ERROR: Job failed: exit code 1
failed
test:lts-10 Test
npm ERR! Exit status 1
npm ERR!
npm ERR! Failed at the @commonshost/server@6.9.0 proof script.
npm ERR! This is probably not a problem with npm. There is likely additional logging output above.

npm ERR! A complete log of this run can be found in:
npm ERR! /root/.npm/_logs/2019-05-02T11_34_10_870Z-debug.log
npm ERR! Test failed. See above for more details.
ERROR: Job failed: exit code 1