bump: configuration

3 jobs for master in 4 minutes and 13 seconds (queued for 29 seconds)
Status Job ID Name Coverage
  Test
canceled #203166843
test:current

00:02:45

failed #203154597
test:lts-10

00:01:27

canceled #203154592
test:current

00:15:15

 
Name Stage Failure
failed
test:lts-10 Test
npm ERR! Exit status 1
npm ERR!
npm ERR! Failed at the @commonshost/server@6.9.0 proof script.
npm ERR! This is probably not a problem with npm. There is likely additional logging output above.

npm ERR! A complete log of this run can be found in:
npm ERR! /root/.npm/_logs/2019-04-26T13_10_37_406Z-debug.log
npm ERR! Test failed. See above for more details.
ERROR: Job failed: exit code 1