refactor: tls/https/acme options redesigned

refactor: modular TLS SNI loading mechanisms (file, api WIP)
deprecate: segfault-handler
feat: run workers with --heapsnapshot-signal SIGSEGV
feat: TLSv1.3 and TLSv1.2 session resumption
2 jobs for master in 2 minutes and 28 seconds (queued for 1 minute and 58 seconds)
Status Job ID Name Coverage
  Test
failed #203147967
test:current

00:01:13

failed #203147969
test:lts-10

00:01:14

 
Name Stage Failure
failed
test:lts-10 Test
npm ERR! Exit status 1
npm ERR!
npm ERR! Failed at the @commonshost/server@6.9.0 proof script.
npm ERR! This is probably not a problem with npm. There is likely additional logging output above.

npm ERR! A complete log of this run can be found in:
npm ERR! /root/.npm/_logs/2019-04-26T13_04_00_148Z-debug.log
npm ERR! Test failed. See above for more details.
ERROR: Job failed: exit code 1
failed
test:current Test
npm ERR! Exit status 1
npm ERR!
npm ERR! Failed at the @commonshost/server@6.9.0 proof script.
npm ERR! This is probably not a problem with npm. There is likely additional logging output above.

npm ERR! A complete log of this run can be found in:
npm ERR! /root/.npm/_logs/2019-04-26T13_02_41_502Z-debug.log
npm ERR! Test failed. See above for more details.
ERROR: Job failed: exit code 1