3.8.2

1 job for v3.8.2 in 2 minutes and 48 seconds (queued for 32 seconds)
latest
Status Job ID Name Coverage
  Test
failed #203753770
node.js

00:02:48

 
Name Stage Failure
failed
node.js Test
npm ERR! Exit status 1
npm ERR!
npm ERR! Failed at the @commonshost/core@3.8.2 proof script.
npm ERR! This is probably not a problem with npm. There is likely additional logging output above.

npm ERR! A complete log of this run can be found in:
npm ERR! /root/.npm/_logs/2019-04-28T04_40_08_495Z-debug.log
npm ERR! Test failed. See above for more details.
ERROR: Job failed: exit code 1