<?xml version="1.0" encoding="UTF-8" standalone="no"?>
<!DOCTYPE svg PUBLIC "-//W3C//DTD SVG 1.1//EN"
 "http://www.w3.org/Graphics/SVG/1.1/DTD/svg11.dtd">
<!-- Generated by graphviz version 2.43.0 (0)
 -->
<!-- Title: %3 Pages: 1 -->
<svg width="1512pt" height="332pt"
 viewBox="0.00 0.00 1511.82 332.00" xmlns="http://www.w3.org/2000/svg" xmlns:xlink="http://www.w3.org/1999/xlink">
<g id="graph0" class="graph" transform="scale(1 1) rotate(0) translate(4 328)">
<title>%3</title>
<polygon fill="white" stroke="transparent" points="-4,4 -4,-328 1507.82,-328 1507.82,4 -4,4"/>
<!-- [root] aws_acm_certificate.cert (expand) -->
<g id="node1" class="node">
<title>[root] aws_acm_certificate.cert (expand)</title>
<polygon fill="none" stroke="black" points="883,-108 691,-108 691,-72 883,-72 883,-108"/>
<text text-anchor="middle" x="787" y="-86.3" font-family="Times,serif" font-size="14.00">aws_acm_certificate.cert</text>
</g>
<!-- [root] provider[&quot;registry.terraform.io/hashicorp/aws&quot;] -->
<g id="node7" class="node">
<title>[root] provider[&quot;registry.terraform.io/hashicorp/aws&quot;]</title>
<polygon fill="none" stroke="black" points="592,-36 266.74,-18 592,0 917.26,-18 592,-36"/>
<text text-anchor="middle" x="592" y="-14.3" font-family="Times,serif" font-size="14.00">provider[&quot;registry.terraform.io/hashicorp/aws&quot;]</text>
</g>
<!-- [root] aws_acm_certificate.cert (expand)&#45;&gt;[root] provider[&quot;registry.terraform.io/hashicorp/aws&quot;] -->
<g id="edge1" class="edge">
<title>[root] aws_acm_certificate.cert (expand)&#45;&gt;[root] provider[&quot;registry.terraform.io/hashicorp/aws&quot;]</title>
<path fill="none" stroke="black" d="M739.3,-71.88C710.12,-61.4 672.82,-48.01 643.05,-37.33"/>
<polygon fill="black" stroke="black" points="643.86,-33.9 633.27,-33.81 641.49,-40.49 643.86,-33.9"/>
</g>
<!-- [root] var.domain -->
<g id="node8" class="node">
<title>[root] var.domain</title>
<polygon fill="none" stroke="black" points="1024.5,-36 935.5,-36 935.5,0 1030.5,0 1030.5,-30 1024.5,-36"/>
<polyline fill="none" stroke="black" points="1024.5,-36 1024.5,-30 "/>
<polyline fill="none" stroke="black" points="1030.5,-30 1024.5,-30 "/>
<text text-anchor="middle" x="983" y="-14.3" font-family="Times,serif" font-size="14.00">var.domain</text>
</g>
<!-- [root] aws_acm_certificate.cert (expand)&#45;&gt;[root] var.domain -->
<g id="edge2" class="edge">
<title>[root] aws_acm_certificate.cert (expand)&#45;&gt;[root] var.domain</title>
<path fill="none" stroke="black" d="M834.7,-71.97C862.18,-62.15 896.91,-49.74 925.86,-39.41"/>
<polygon fill="black" stroke="black" points="927.19,-42.65 935.43,-35.99 924.84,-36.06 927.19,-42.65"/>
</g>
<!-- [root] output.acm_resource_record_name -->
<g id="node2" class="node">
<title>[root] output.acm_resource_record_name</title>
<polygon fill="none" stroke="black" points="260,-180 0,-180 0,-144 266,-144 266,-174 260,-180"/>
<polyline fill="none" stroke="black" points="260,-180 260,-174 "/>
<polyline fill="none" stroke="black" points="266,-174 260,-174 "/>
<text text-anchor="middle" x="133" y="-158.3" font-family="Times,serif" font-size="14.00">output.acm_resource_record_name</text>
</g>
<!-- [root] output.acm_resource_record_name&#45;&gt;[root] aws_acm_certificate.cert (expand) -->
<g id="edge8" class="edge">
<title>[root] output.acm_resource_record_name&#45;&gt;[root] aws_acm_certificate.cert (expand)</title>
<path fill="none" stroke="black" d="M266.02,-145.01C269.04,-144.67 272.04,-144.33 275,-144 415.1,-128.36 576.95,-111.87 680.55,-101.52"/>
<polygon fill="black" stroke="black" points="681.1,-104.98 690.7,-100.5 680.4,-98.02 681.1,-104.98"/>
</g>
<!-- [root] output.api_resource_record_type -->
<g id="node3" class="node">
<title>[root] output.api_resource_record_type</title>
<polygon fill="none" stroke="black" points="529.5,-180 284.5,-180 284.5,-144 535.5,-144 535.5,-174 529.5,-180"/>
<polyline fill="none" stroke="black" points="529.5,-180 529.5,-174 "/>
<polyline fill="none" stroke="black" points="535.5,-174 529.5,-174 "/>
<text text-anchor="middle" x="410" y="-158.3" font-family="Times,serif" font-size="14.00">output.api_resource_record_type</text>
</g>
<!-- [root] output.api_resource_record_type&#45;&gt;[root] aws_acm_certificate.cert (expand) -->
<g id="edge9" class="edge">
<title>[root] output.api_resource_record_type&#45;&gt;[root] aws_acm_certificate.cert (expand)</title>
<path fill="none" stroke="black" d="M501.74,-143.97C557.15,-133.68 627.87,-120.55 685.03,-109.93"/>
<polygon fill="black" stroke="black" points="685.98,-113.32 695.17,-108.05 684.7,-106.43 685.98,-113.32"/>
</g>
<!-- [root] output.api_resource_record_value -->
<g id="node4" class="node">
<title>[root] output.api_resource_record_value</title>
<polygon fill="none" stroke="black" points="804.5,-180 553.5,-180 553.5,-144 810.5,-144 810.5,-174 804.5,-180"/>
<polyline fill="none" stroke="black" points="804.5,-180 804.5,-174 "/>
<polyline fill="none" stroke="black" points="810.5,-174 804.5,-174 "/>
<text text-anchor="middle" x="682" y="-158.3" font-family="Times,serif" font-size="14.00">output.api_resource_record_value</text>
</g>
<!-- [root] output.api_resource_record_value&#45;&gt;[root] aws_acm_certificate.cert (expand) -->
<g id="edge10" class="edge">
<title>[root] output.api_resource_record_value&#45;&gt;[root] aws_acm_certificate.cert (expand)</title>
<path fill="none" stroke="black" d="M707.69,-143.88C721.29,-134.81 738.17,-123.55 752.86,-113.76"/>
<polygon fill="black" stroke="black" points="754.84,-116.65 761.22,-108.19 750.95,-110.82 754.84,-116.65"/>
</g>
<!-- [root] output.cert_arn -->
<g id="node5" class="node">
<title>[root] output.cert_arn</title>
<polygon fill="none" stroke="black" points="951,-180 829,-180 829,-144 957,-144 957,-174 951,-180"/>
<polyline fill="none" stroke="black" points="951,-180 951,-174 "/>
<polyline fill="none" stroke="black" points="957,-174 951,-174 "/>
<text text-anchor="middle" x="893" y="-158.3" font-family="Times,serif" font-size="14.00">output.cert_arn</text>
</g>
<!-- [root] output.cert_arn&#45;&gt;[root] aws_acm_certificate.cert (expand) -->
<g id="edge11" class="edge">
<title>[root] output.cert_arn&#45;&gt;[root] aws_acm_certificate.cert (expand)</title>
<path fill="none" stroke="black" d="M867.07,-143.88C853.34,-134.81 836.29,-123.55 821.46,-113.76"/>
<polygon fill="black" stroke="black" points="823.3,-110.78 813.03,-108.19 819.45,-116.62 823.3,-110.78"/>
</g>
<!-- [root] output.cert_domain_name -->
<g id="node6" class="node">
<title>[root] output.cert_domain_name</title>
<polygon fill="none" stroke="black" points="1171,-180 975,-180 975,-144 1177,-144 1177,-174 1171,-180"/>
<polyline fill="none" stroke="black" points="1171,-180 1171,-174 "/>
<polyline fill="none" stroke="black" points="1177,-174 1171,-174 "/>
<text text-anchor="middle" x="1076" y="-158.3" font-family="Times,serif" font-size="14.00">output.cert_domain_name</text>
</g>
<!-- [root] output.cert_domain_name&#45;&gt;[root] aws_acm_certificate.cert (expand) -->
<g id="edge12" class="edge">
<title>[root] output.cert_domain_name&#45;&gt;[root] aws_acm_certificate.cert (expand)</title>
<path fill="none" stroke="black" d="M1005.67,-143.97C963.9,-133.85 910.78,-120.98 867.35,-110.46"/>
<polygon fill="black" stroke="black" points="867.94,-107 857.39,-108.05 866.29,-113.81 867.94,-107"/>
</g>
<!-- [root] meta.count&#45;boundary (EachMode fixup) -->
<g id="node9" class="node">
<title>[root] meta.count&#45;boundary (EachMode fixup)</title>
<ellipse fill="none" stroke="black" cx="679" cy="-234" rx="222.86" ry="18"/>
<text text-anchor="middle" x="679" y="-230.3" font-family="Times,serif" font-size="14.00">[root] meta.count&#45;boundary (EachMode fixup)</text>
</g>
<!-- [root] meta.count&#45;boundary (EachMode fixup)&#45;&gt;[root] output.acm_resource_record_name -->
<g id="edge3" class="edge">
<title>[root] meta.count&#45;boundary (EachMode fixup)&#45;&gt;[root] output.acm_resource_record_name</title>
<path fill="none" stroke="black" d="M565.54,-218.45C481.51,-207.68 366.43,-192.93 276.09,-181.35"/>
<polygon fill="black" stroke="black" points="276.41,-177.86 266.04,-180.06 275.52,-184.8 276.41,-177.86"/>
</g>
<!-- [root] meta.count&#45;boundary (EachMode fixup)&#45;&gt;[root] output.api_resource_record_type -->
<g id="edge4" class="edge">
<title>[root] meta.count&#45;boundary (EachMode fixup)&#45;&gt;[root] output.api_resource_record_type</title>
<path fill="none" stroke="black" d="M616.27,-216.68C577.18,-206.5 526.64,-193.35 485.38,-182.62"/>
<polygon fill="black" stroke="black" points="486.2,-179.21 475.64,-180.08 484.44,-185.99 486.2,-179.21"/>
</g>
<!-- [root] meta.count&#45;boundary (EachMode fixup)&#45;&gt;[root] output.api_resource_record_value -->
<g id="edge5" class="edge">
<title>[root] meta.count&#45;boundary (EachMode fixup)&#45;&gt;[root] output.api_resource_record_value</title>
<path fill="none" stroke="black" d="M679.74,-215.7C680.07,-207.98 680.47,-198.71 680.84,-190.11"/>
<polygon fill="black" stroke="black" points="684.34,-190.25 681.27,-180.1 677.34,-189.95 684.34,-190.25"/>
</g>
<!-- [root] meta.count&#45;boundary (EachMode fixup)&#45;&gt;[root] output.cert_arn -->
<g id="edge6" class="edge">
<title>[root] meta.count&#45;boundary (EachMode fixup)&#45;&gt;[root] output.cert_arn</title>
<path fill="none" stroke="black" d="M729.72,-216.41C760.07,-206.48 798.87,-193.79 831.04,-183.27"/>
<polygon fill="black" stroke="black" points="832.37,-186.51 840.79,-180.08 830.2,-179.86 832.37,-186.51"/>
</g>
<!-- [root] meta.count&#45;boundary (EachMode fixup)&#45;&gt;[root] output.cert_domain_name -->
<g id="edge7" class="edge">
<title>[root] meta.count&#45;boundary (EachMode fixup)&#45;&gt;[root] output.cert_domain_name</title>
<path fill="none" stroke="black" d="M767.11,-217.46C826.85,-206.93 906.14,-192.95 969.43,-181.79"/>
<polygon fill="black" stroke="black" points="970.21,-185.21 979.45,-180.02 968.99,-178.31 970.21,-185.21"/>
</g>
<!-- [root] provider[&quot;registry.terraform.io/hashicorp/aws&quot;] (close) -->
<g id="node10" class="node">
<title>[root] provider[&quot;registry.terraform.io/hashicorp/aws&quot;] (close)</title>
<ellipse fill="none" stroke="black" cx="1212" cy="-234" rx="291.65" ry="18"/>
<text text-anchor="middle" x="1212" y="-230.3" font-family="Times,serif" font-size="14.00">[root] provider[&quot;registry.terraform.io/hashicorp/aws&quot;] (close)</text>
</g>
<!-- [root] provider[&quot;registry.terraform.io/hashicorp/aws&quot;] (close)&#45;&gt;[root] aws_acm_certificate.cert (expand) -->
<g id="edge13" class="edge">
<title>[root] provider[&quot;registry.terraform.io/hashicorp/aws&quot;] (close)&#45;&gt;[root] aws_acm_certificate.cert (expand)</title>
<path fill="none" stroke="black" d="M1212.2,-215.65C1211.42,-195.22 1206.77,-161.82 1186,-144 1143.28,-107.33 996.26,-95.83 893.17,-92.33"/>
<polygon fill="black" stroke="black" points="893.13,-88.83 883.02,-92.01 892.9,-95.83 893.13,-88.83"/>
</g>
<!-- [root] root -->
<g id="node11" class="node">
<title>[root] root</title>
<ellipse fill="none" stroke="black" cx="945" cy="-306" rx="58.49" ry="18"/>
<text text-anchor="middle" x="945" y="-302.3" font-family="Times,serif" font-size="14.00">[root] root</text>
</g>
<!-- [root] root&#45;&gt;[root] meta.count&#45;boundary (EachMode fixup) -->
<g id="edge14" class="edge">
<title>[root] root&#45;&gt;[root] meta.count&#45;boundary (EachMode fixup)</title>
<path fill="none" stroke="black" d="M901.97,-293.68C861.25,-282.96 799.35,-266.67 751.1,-253.97"/>
<polygon fill="black" stroke="black" points="751.89,-250.56 741.33,-251.4 750.11,-257.33 751.89,-250.56"/>
</g>
<!-- [root] root&#45;&gt;[root] provider[&quot;registry.terraform.io/hashicorp/aws&quot;] (close) -->
<g id="edge15" class="edge">
<title>[root] root&#45;&gt;[root] provider[&quot;registry.terraform.io/hashicorp/aws&quot;] (close)</title>
<path fill="none" stroke="black" d="M987.9,-293.75C1028.51,-283.11 1090.31,-266.9 1138.73,-254.21"/>
<polygon fill="black" stroke="black" points="1139.75,-257.56 1148.54,-251.64 1137.98,-250.79 1139.75,-257.56"/>
</g>
</g>
</svg>
