<mxfile>
    <diagram name="Pagina 42" id="I1Q1i3UWQoyKdwNlozBs">
        <mxGraphModel dx="670" dy="1813" grid="1" gridSize="10" guides="1" tooltips="1" connect="1" arrows="1" fold="1" page="1" pageScale="1" pageWidth="850" pageHeight="1100" background="#8F8F8F" math="0" shadow="0">
            <root>
                <mxCell id="XIOKOJQC87tbH__g2uHu-0"/>
                <mxCell id="XIOKOJQC87tbH__g2uHu-1" parent="XIOKOJQC87tbH__g2uHu-0"/>
                <mxCell id="4" value="" style="rounded=0;whiteSpace=wrap;html=1;strokeWidth=1;fillColor=#707070;strokeColor=#050505;dashed=1;" parent="XIOKOJQC87tbH__g2uHu-1" vertex="1">
                    <mxGeometry x="70" y="-350" width="230" height="210" as="geometry"/>
                </mxCell>
                <mxCell id="1" value="" style="rounded=0;whiteSpace=wrap;html=1;strokeWidth=1;fillColor=#707070;strokeColor=#050505;dashed=1;" parent="XIOKOJQC87tbH__g2uHu-1" vertex="1">
                    <mxGeometry x="350" y="-100" width="450" height="350" as="geometry"/>
                </mxCell>
                <mxCell id="qpghUpTgDb6sctYHf8Mc-0" value="" style="rounded=0;whiteSpace=wrap;html=1;strokeWidth=1;fillColor=#707070;strokeColor=#050505;dashed=1;" parent="XIOKOJQC87tbH__g2uHu-1" vertex="1">
                    <mxGeometry x="1130" y="250" width="400" height="930" as="geometry"/>
                </mxCell>
                <mxCell id="XIOKOJQC87tbH__g2uHu-2" value="" style="rounded=0;whiteSpace=wrap;html=1;strokeWidth=1;fillColor=#707070;strokeColor=#050505;dashed=1;" parent="XIOKOJQC87tbH__g2uHu-1" vertex="1">
                    <mxGeometry x="740" y="250" width="390" height="930" as="geometry"/>
                </mxCell>
                <mxCell id="XIOKOJQC87tbH__g2uHu-3" value="" style="rounded=0;whiteSpace=wrap;html=1;strokeWidth=1;fillColor=#707070;strokeColor=#050505;dashed=1;" parent="XIOKOJQC87tbH__g2uHu-1" vertex="1">
                    <mxGeometry x="45" y="250" width="700" height="930" as="geometry"/>
                </mxCell>
                <mxCell id="qpghUpTgDb6sctYHf8Mc-14" style="edgeStyle=orthogonalEdgeStyle;rounded=0;jumpStyle=arc;orthogonalLoop=1;jettySize=auto;html=1;exitX=0.5;exitY=1;exitDx=0;exitDy=0;entryX=0.5;entryY=0;entryDx=0;entryDy=0;strokeWidth=2;strokeColor=#3700CC;" parent="XIOKOJQC87tbH__g2uHu-1" source="XIOKOJQC87tbH__g2uHu-37" target="qpghUpTgDb6sctYHf8Mc-10" edge="1">
                    <mxGeometry relative="1" as="geometry">
                        <Array as="points">
                            <mxPoint x="600" y="820"/>
                            <mxPoint x="1418" y="820"/>
                        </Array>
                    </mxGeometry>
                </mxCell>
                <mxCell id="XIOKOJQC87tbH__g2uHu-34" style="edgeStyle=orthogonalEdgeStyle;rounded=0;orthogonalLoop=1;jettySize=auto;html=1;entryX=0.5;entryY=0;entryDx=0;entryDy=0;strokeWidth=2;fillColor=#6a00ff;strokeColor=#3700CC;exitX=0.5;exitY=1;exitDx=0;exitDy=0;" parent="XIOKOJQC87tbH__g2uHu-1" source="XIOKOJQC87tbH__g2uHu-37" target="XIOKOJQC87tbH__g2uHu-48" edge="1">
                    <mxGeometry relative="1" as="geometry"/>
                </mxCell>
                <mxCell id="qpghUpTgDb6sctYHf8Mc-16" style="edgeStyle=orthogonalEdgeStyle;rounded=0;jumpStyle=arc;orthogonalLoop=1;jettySize=auto;html=1;exitX=1;exitY=0.5;exitDx=0;exitDy=0;entryX=0;entryY=0.5;entryDx=0;entryDy=0;strokeWidth=2;strokeColor=#4DCC00;" parent="XIOKOJQC87tbH__g2uHu-1" source="XIOKOJQC87tbH__g2uHu-25" target="qpghUpTgDb6sctYHf8Mc-6" edge="1">
                    <mxGeometry relative="1" as="geometry">
                        <Array as="points">
                            <mxPoint x="1160" y="410"/>
                            <mxPoint x="1160" y="470"/>
                        </Array>
                    </mxGeometry>
                </mxCell>
                <mxCell id="XIOKOJQC87tbH__g2uHu-4" value="r/w" style="edgeStyle=orthogonalEdgeStyle;rounded=0;orthogonalLoop=1;jettySize=auto;html=1;strokeWidth=2;" parent="XIOKOJQC87tbH__g2uHu-1" source="XIOKOJQC87tbH__g2uHu-7" target="XIOKOJQC87tbH__g2uHu-41" edge="1">
                    <mxGeometry relative="1" as="geometry"/>
                </mxCell>
                <mxCell id="XIOKOJQC87tbH__g2uHu-5" value="get latest BSN&lt;br&gt;(after bsn update notification&lt;br&gt;from journal-worker)" style="edgeStyle=orthogonalEdgeStyle;rounded=0;orthogonalLoop=1;jettySize=auto;html=1;entryX=0.75;entryY=0;entryDx=0;entryDy=0;strokeWidth=2;fillColor=#a20025;strokeColor=#6F0000;exitX=0;exitY=0.5;exitDx=0;exitDy=0;" parent="XIOKOJQC87tbH__g2uHu-1" source="XIOKOJQC87tbH__g2uHu-7" target="XIOKOJQC87tbH__g2uHu-25" edge="1">
                    <mxGeometry x="-0.5914" relative="1" as="geometry">
                        <mxPoint x="430" y="180" as="sourcePoint"/>
                        <Array as="points">
                            <mxPoint x="250" y="190"/>
                        </Array>
                        <mxPoint x="-1" as="offset"/>
                    </mxGeometry>
                </mxCell>
                <mxCell id="XIOKOJQC87tbH__g2uHu-7" value="catalog-update-api" style="whiteSpace=wrap;html=1;aspect=fixed;strokeWidth=2;fillColor=#6d8764;strokeColor=#3A5431;fontColor=#ffffff;" parent="XIOKOJQC87tbH__g2uHu-1" vertex="1">
                    <mxGeometry x="535" y="150" width="80" height="80" as="geometry"/>
                </mxCell>
                <mxCell id="XIOKOJQC87tbH__g2uHu-10" value="read" style="edgeStyle=orthogonalEdgeStyle;rounded=0;orthogonalLoop=1;jettySize=auto;html=1;strokeWidth=2;strokeColor=#F0F0F0;" parent="XIOKOJQC87tbH__g2uHu-1" source="XIOKOJQC87tbH__g2uHu-11" target="XIOKOJQC87tbH__g2uHu-14" edge="1">
                    <mxGeometry relative="1" as="geometry"/>
                </mxCell>
                <mxCell id="XIOKOJQC87tbH__g2uHu-11" value="event-disclose-api" style="whiteSpace=wrap;html=1;aspect=fixed;strokeWidth=2;strokeColor=#BD7000;fillColor=#f0a30a;fontColor=#ffffff;" parent="XIOKOJQC87tbH__g2uHu-1" vertex="1">
                    <mxGeometry x="832.5" y="430" width="80" height="80" as="geometry"/>
                </mxCell>
                <mxCell id="XIOKOJQC87tbH__g2uHu-14" value="event-db" style="shape=cylinder3;whiteSpace=wrap;html=1;boundedLbl=1;backgroundOutline=1;size=15;strokeWidth=2;strokeColor=#C73500;fillColor=#fa6800;fontColor=#ffffff;" parent="XIOKOJQC87tbH__g2uHu-1" vertex="1">
                    <mxGeometry x="837.5" y="585" width="70" height="105" as="geometry"/>
                </mxCell>
                <mxCell id="XIOKOJQC87tbH__g2uHu-15" value="read" style="edgeStyle=orthogonalEdgeStyle;rounded=0;orthogonalLoop=1;jettySize=auto;html=1;strokeWidth=2;" parent="XIOKOJQC87tbH__g2uHu-1" source="XIOKOJQC87tbH__g2uHu-16" target="XIOKOJQC87tbH__g2uHu-20" edge="1">
                    <mxGeometry relative="1" as="geometry"/>
                </mxCell>
                <mxCell id="XIOKOJQC87tbH__g2uHu-16" value="event-disclose-api" style="whiteSpace=wrap;html=1;aspect=fixed;strokeWidth=2;strokeColor=#BD7000;fillColor=#f0a30a;fontColor=#ffffff;" parent="XIOKOJQC87tbH__g2uHu-1" vertex="1">
                    <mxGeometry x="385" y="430" width="80" height="80" as="geometry"/>
                </mxCell>
                <mxCell id="XIOKOJQC87tbH__g2uHu-17" value="write event" style="edgeStyle=orthogonalEdgeStyle;rounded=0;orthogonalLoop=1;jettySize=auto;html=1;strokeWidth=2;" parent="XIOKOJQC87tbH__g2uHu-1" source="XIOKOJQC87tbH__g2uHu-19" target="XIOKOJQC87tbH__g2uHu-20" edge="1">
                    <mxGeometry relative="1" as="geometry">
                        <mxPoint as="offset"/>
                    </mxGeometry>
                </mxCell>
                <mxCell id="XIOKOJQC87tbH__g2uHu-19" value="command-api" style="rounded=0;whiteSpace=wrap;html=1;strokeWidth=2;fillColor=#a0522d;strokeColor=#6D1F00;fontColor=#ffffff;" parent="XIOKOJQC87tbH__g2uHu-1" vertex="1">
                    <mxGeometry x="170" y="607.5" width="120" height="60" as="geometry"/>
                </mxCell>
                <mxCell id="XIOKOJQC87tbH__g2uHu-20" value="event-db" style="shape=cylinder3;whiteSpace=wrap;html=1;boundedLbl=1;backgroundOutline=1;size=15;strokeWidth=2;strokeColor=#C73500;fillColor=#fa6800;fontColor=#ffffff;" parent="XIOKOJQC87tbH__g2uHu-1" vertex="1">
                    <mxGeometry x="390" y="585" width="70" height="105" as="geometry"/>
                </mxCell>
                <mxCell id="XIOKOJQC87tbH__g2uHu-21" style="edgeStyle=orthogonalEdgeStyle;rounded=0;orthogonalLoop=1;jettySize=auto;html=1;entryX=0;entryY=0.5;entryDx=0;entryDy=0;strokeWidth=2;fillColor=#60a917;strokeColor=#4DCC00;" parent="XIOKOJQC87tbH__g2uHu-1" source="XIOKOJQC87tbH__g2uHu-25" target="XIOKOJQC87tbH__g2uHu-16" edge="1">
                    <mxGeometry relative="1" as="geometry"/>
                </mxCell>
                <mxCell id="XIOKOJQC87tbH__g2uHu-22" style="edgeStyle=orthogonalEdgeStyle;rounded=0;orthogonalLoop=1;jettySize=auto;html=1;entryX=0;entryY=0.5;entryDx=0;entryDy=0;strokeWidth=2;fillColor=#60a917;exitX=1;exitY=0.5;exitDx=0;exitDy=0;strokeColor=#4DCC00;" parent="XIOKOJQC87tbH__g2uHu-1" source="XIOKOJQC87tbH__g2uHu-25" target="XIOKOJQC87tbH__g2uHu-11" edge="1">
                    <mxGeometry relative="1" as="geometry">
                        <Array as="points">
                            <mxPoint x="780" y="410"/>
                            <mxPoint x="780" y="470"/>
                        </Array>
                    </mxGeometry>
                </mxCell>
                <mxCell id="XIOKOJQC87tbH__g2uHu-23" value="fetch events" style="edgeLabel;html=1;align=center;verticalAlign=middle;resizable=0;points=[];" parent="XIOKOJQC87tbH__g2uHu-22" vertex="1" connectable="0">
                    <mxGeometry x="-0.794" relative="1" as="geometry">
                        <mxPoint x="-4.289999999999999" y="-0.01" as="offset"/>
                    </mxGeometry>
                </mxCell>
                <mxCell id="XIOKOJQC87tbH__g2uHu-24" value="get vastleggingsgemeenten&lt;br&gt;and eventID's" style="edgeStyle=orthogonalEdgeStyle;rounded=0;orthogonalLoop=1;jettySize=auto;html=1;entryX=0;entryY=0.5;entryDx=0;entryDy=0;entryPerimeter=0;strokeWidth=2;fillColor=#0050ef;exitX=0;exitY=0.5;exitDx=0;exitDy=0;jumpStyle=arc;strokeColor=#F0F0F0;" parent="XIOKOJQC87tbH__g2uHu-1" source="XIOKOJQC87tbH__g2uHu-25" target="XIOKOJQC87tbH__g2uHu-42" edge="1">
                    <mxGeometry x="-0.6914" relative="1" as="geometry">
                        <Array as="points">
                            <mxPoint x="140" y="410"/>
                            <mxPoint x="140" y="897"/>
                        </Array>
                        <mxPoint as="offset"/>
                    </mxGeometry>
                </mxCell>
                <mxCell id="XIOKOJQC87tbH__g2uHu-25" value="query-api" style="whiteSpace=wrap;html=1;aspect=fixed;strokeWidth=2;fontColor=#ffffff;fillColor=#60a917;strokeColor=#2D7600;" parent="XIOKOJQC87tbH__g2uHu-1" vertex="1">
                    <mxGeometry x="190" y="370" width="80" height="80" as="geometry"/>
                </mxCell>
                <mxCell id="XIOKOJQC87tbH__g2uHu-26" value="write command" style="edgeStyle=orthogonalEdgeStyle;rounded=0;orthogonalLoop=1;jettySize=auto;html=1;entryX=0.5;entryY=1;entryDx=0;entryDy=0;strokeWidth=2;jumpStyle=arc;exitX=1;exitY=0.5;exitDx=0;exitDy=0;strokeColor=#E5CCFF;" parent="XIOKOJQC87tbH__g2uHu-1" source="XIOKOJQC87tbH__g2uHu-27" target="XIOKOJQC87tbH__g2uHu-19" edge="1">
                    <mxGeometry x="-0.7154" relative="1" as="geometry">
                        <mxPoint as="offset"/>
                    </mxGeometry>
                </mxCell>
                <mxCell id="XIOKOJQC87tbH__g2uHu-27" value="BZM&lt;br&gt;voert command uit" style="rounded=0;whiteSpace=wrap;html=1;strokeWidth=2;fillColor=#76608a;strokeColor=#432D57;fontColor=#ffffff;" parent="XIOKOJQC87tbH__g2uHu-1" vertex="1">
                    <mxGeometry x="50" y="1230" width="120" height="60" as="geometry"/>
                </mxCell>
                <mxCell id="XIOKOJQC87tbH__g2uHu-30" value="execute query to&lt;br&gt;bijhoudingsverantwoordelijke" style="edgeStyle=orthogonalEdgeStyle;rounded=0;orthogonalLoop=1;jettySize=auto;html=1;entryX=0.5;entryY=0;entryDx=0;entryDy=0;strokeWidth=2;exitX=1;exitY=0.75;exitDx=0;exitDy=0;strokeColor=#E5CCFF;" parent="XIOKOJQC87tbH__g2uHu-1" source="XIOKOJQC87tbH__g2uHu-32" target="XIOKOJQC87tbH__g2uHu-25" edge="1">
                    <mxGeometry x="-0.3333" relative="1" as="geometry">
                        <mxPoint as="offset"/>
                        <Array as="points">
                            <mxPoint x="230" y="45"/>
                        </Array>
                    </mxGeometry>
                </mxCell>
                <mxCell id="XIOKOJQC87tbH__g2uHu-31" value="find bijhoudingsverantwoordelijke" style="edgeStyle=orthogonalEdgeStyle;rounded=0;orthogonalLoop=1;jettySize=auto;html=1;strokeWidth=2;entryX=0;entryY=0.5;entryDx=0;entryDy=0;entryPerimeter=0;jumpStyle=arc;exitX=1;exitY=0.25;exitDx=0;exitDy=0;" parent="XIOKOJQC87tbH__g2uHu-1" source="XIOKOJQC87tbH__g2uHu-32" target="XIOKOJQC87tbH__g2uHu-41" edge="1">
                    <mxGeometry x="-0.4545" relative="1" as="geometry">
                        <mxPoint x="290" y="60" as="targetPoint"/>
                        <Array as="points">
                            <mxPoint x="150" y="20"/>
                        </Array>
                        <mxPoint x="-1" as="offset"/>
                        <mxPoint x="270" y="20" as="sourcePoint"/>
                    </mxGeometry>
                </mxCell>
                <mxCell id="XIOKOJQC87tbH__g2uHu-32" value="BZM&lt;br&gt;stelt een vraag" style="rounded=0;whiteSpace=wrap;html=1;strokeWidth=2;fillColor=#76608a;strokeColor=#432D57;fontColor=#ffffff;" parent="XIOKOJQC87tbH__g2uHu-1" vertex="1">
                    <mxGeometry x="30" width="120" height="60" as="geometry"/>
                </mxCell>
                <mxCell id="XIOKOJQC87tbH__g2uHu-33" value="watch" style="edgeStyle=orthogonalEdgeStyle;rounded=0;orthogonalLoop=1;jettySize=auto;html=1;strokeWidth=2;" parent="XIOKOJQC87tbH__g2uHu-1" source="XIOKOJQC87tbH__g2uHu-37" target="XIOKOJQC87tbH__g2uHu-20" edge="1">
                    <mxGeometry relative="1" as="geometry">
                        <mxPoint as="offset"/>
                    </mxGeometry>
                </mxCell>
                <mxCell id="XIOKOJQC87tbH__g2uHu-36" value="find bijhoudingsverantwoordleijke&lt;br&gt;for non-genesis event with pID x" style="edgeStyle=orthogonalEdgeStyle;rounded=0;orthogonalLoop=1;jettySize=auto;html=1;strokeWidth=2;exitX=0.5;exitY=0;exitDx=0;exitDy=0;entryX=1;entryY=0.5;entryDx=0;entryDy=0;jumpStyle=arc;entryPerimeter=0;" parent="XIOKOJQC87tbH__g2uHu-1" source="XIOKOJQC87tbH__g2uHu-37" target="XIOKOJQC87tbH__g2uHu-41" edge="1">
                    <mxGeometry x="-0.8265" relative="1" as="geometry">
                        <mxPoint x="600" y="380" as="targetPoint"/>
                        <mxPoint as="offset"/>
                        <Array as="points">
                            <mxPoint x="600" y="500"/>
                            <mxPoint x="660" y="500"/>
                            <mxPoint x="660" y="20"/>
                        </Array>
                    </mxGeometry>
                </mxCell>
                <mxCell id="XIOKOJQC87tbH__g2uHu-37" value="event-worker" style="rounded=0;whiteSpace=wrap;html=1;strokeWidth=3;fontColor=#ffffff;fillColor=#f0a30a;strokeColor=#050300;" parent="XIOKOJQC87tbH__g2uHu-1" vertex="1">
                    <mxGeometry x="540" y="607.5" width="120" height="60" as="geometry"/>
                </mxCell>
                <mxCell id="XIOKOJQC87tbH__g2uHu-38" value="zone-lijst" style="shape=internalStorage;whiteSpace=wrap;html=1;backgroundOutline=1;fontFamily=Helvetica;fontSize=12;fontColor=#f0f0f0;align=center;strokeColor=#f0f0f0;strokeWidth=2;fillColor=#2a2a2a;" parent="XIOKOJQC87tbH__g2uHu-1" vertex="1">
                    <mxGeometry x="127.5" y="-290" width="115" height="100" as="geometry"/>
                </mxCell>
                <mxCell id="XIOKOJQC87tbH__g2uHu-41" value="catalog&lt;br&gt;(private&lt;br&gt;shared ledger)" style="shape=cylinder3;whiteSpace=wrap;html=1;boundedLbl=1;backgroundOutline=1;size=15;strokeColor=#3A5431;strokeWidth=2;fillColor=#6d8764;fontColor=#ffffff;" parent="XIOKOJQC87tbH__g2uHu-1" vertex="1">
                    <mxGeometry x="530" y="-40" width="90" height="120" as="geometry"/>
                </mxCell>
                <mxCell id="XIOKOJQC87tbH__g2uHu-42" value="journal-db" style="shape=cylinder3;whiteSpace=wrap;html=1;boundedLbl=1;backgroundOutline=1;size=15;strokeColor=#3700CC;strokeWidth=2;fillColor=#6a00ff;fontColor=#ffffff;" parent="XIOKOJQC87tbH__g2uHu-1" vertex="1">
                    <mxGeometry x="320" y="850" width="70" height="95" as="geometry"/>
                </mxCell>
                <mxCell id="XIOKOJQC87tbH__g2uHu-43" value="journal-db" style="shape=cylinder3;whiteSpace=wrap;html=1;boundedLbl=1;backgroundOutline=1;size=15;strokeWidth=2;strokeColor=#3700CC;fillColor=#6a00ff;fontColor=#ffffff;" parent="XIOKOJQC87tbH__g2uHu-1" vertex="1">
                    <mxGeometry x="762.5" y="850" width="75" height="95" as="geometry"/>
                </mxCell>
                <mxCell id="XIOKOJQC87tbH__g2uHu-44" value="write" style="edgeStyle=orthogonalEdgeStyle;rounded=0;orthogonalLoop=1;jettySize=auto;html=1;strokeWidth=2;" parent="XIOKOJQC87tbH__g2uHu-1" source="XIOKOJQC87tbH__g2uHu-48" target="XIOKOJQC87tbH__g2uHu-42" edge="1">
                    <mxGeometry x="-0.1111" relative="1" as="geometry">
                        <mxPoint as="offset"/>
                    </mxGeometry>
                </mxCell>
                <mxCell id="XIOKOJQC87tbH__g2uHu-45" style="edgeStyle=orthogonalEdgeStyle;rounded=0;orthogonalLoop=1;jettySize=auto;html=1;exitX=1;exitY=0.5;exitDx=0;exitDy=0;entryX=1;entryY=0.5;entryDx=0;entryDy=0;strokeWidth=2;jumpStyle=arc;" parent="XIOKOJQC87tbH__g2uHu-1" source="XIOKOJQC87tbH__g2uHu-55" target="XIOKOJQC87tbH__g2uHu-7" edge="1">
                    <mxGeometry relative="1" as="geometry">
                        <Array as="points">
                            <mxPoint x="690" y="1040"/>
                            <mxPoint x="690" y="190"/>
                        </Array>
                    </mxGeometry>
                </mxCell>
                <mxCell id="XIOKOJQC87tbH__g2uHu-46" value="&lt;span style=&quot;color: rgba(0 , 0 , 0 , 0) ; font-family: monospace ; font-size: 0px&quot;&gt;%3CmxGraphModel%3E%3Croot%3E%3CmxCell%20id%3D%220%22%2F%3E%3CmxCell%20id%3D%221%22%20parent%3D%220%22%2F%3E%3CmxCell%20id%3D%222%22%20value%3D%22publish%20index3%20hash%22%20style%3D%22edgeLabel%3Bhtml%3D1%3Balign%3Dcenter%3BverticalAlign%3Dmiddle%3Bresizable%3D0%3Bpoints%3D%5B%5D%3B%22%20vertex%3D%221%22%20connectable%3D%220%22%20parent%3D%221%22%3E%3CmxGeometry%20x%3D%221250%22%20y%3D%22826%22%20as%3D%22geometry%22%2F%3E%3C%2FmxCell%3E%3C%2Froot%3E%3C%2FmxGraphModel%publich&lt;/span&gt;" style="edgeLabel;html=1;align=center;verticalAlign=middle;resizable=0;points=[];" parent="XIOKOJQC87tbH__g2uHu-45" vertex="1" connectable="0">
                    <mxGeometry x="-0.7613" y="-1" relative="1" as="geometry">
                        <mxPoint as="offset"/>
                    </mxGeometry>
                </mxCell>
                <mxCell id="XIOKOJQC87tbH__g2uHu-47" value="- announce new journals&lt;br&gt;- publish journal updates (hash)&lt;br&gt;- announce transfer completed&lt;br&gt;- BSN found notification (zonder inhoud)" style="edgeLabel;html=1;align=center;verticalAlign=middle;resizable=0;points=[];" parent="XIOKOJQC87tbH__g2uHu-45" vertex="1" connectable="0">
                    <mxGeometry x="-0.7724" y="3" relative="1" as="geometry">
                        <mxPoint x="-11.469999999999992" y="-1.9999999999999964" as="offset"/>
                    </mxGeometry>
                </mxCell>
                <mxCell id="XIOKOJQC87tbH__g2uHu-48" value="journal-update-api" style="rounded=0;whiteSpace=wrap;html=1;strokeColor=#006EAF;strokeWidth=2;fillColor=#1ba1e2;fontColor=#ffffff;" parent="XIOKOJQC87tbH__g2uHu-1" vertex="1">
                    <mxGeometry x="540" y="867.5" width="120" height="60" as="geometry"/>
                </mxCell>
                <mxCell id="XIOKOJQC87tbH__g2uHu-49" value="write" style="edgeStyle=orthogonalEdgeStyle;rounded=0;orthogonalLoop=1;jettySize=auto;html=1;strokeWidth=2;strokeColor=#F0F0F0;" parent="XIOKOJQC87tbH__g2uHu-1" source="XIOKOJQC87tbH__g2uHu-50" target="XIOKOJQC87tbH__g2uHu-43" edge="1">
                    <mxGeometry relative="1" as="geometry"/>
                </mxCell>
                <mxCell id="XIOKOJQC87tbH__g2uHu-50" value="journal-update-api" style="rounded=0;whiteSpace=wrap;html=1;strokeWidth=2;strokeColor=#006EAF;fillColor=#1ba1e2;fontColor=#ffffff;" parent="XIOKOJQC87tbH__g2uHu-1" vertex="1">
                    <mxGeometry x="967.5" y="867.5" width="120" height="60" as="geometry"/>
                </mxCell>
                <mxCell id="XIOKOJQC87tbH__g2uHu-53" value="lock journal when transfering" style="edgeStyle=orthogonalEdgeStyle;rounded=0;orthogonalLoop=1;jettySize=auto;html=1;strokeWidth=2;exitX=0.75;exitY=0;exitDx=0;exitDy=0;entryX=0.855;entryY=1;entryDx=0;entryDy=-4.35;entryPerimeter=0;" parent="XIOKOJQC87tbH__g2uHu-1" source="XIOKOJQC87tbH__g2uHu-55" target="XIOKOJQC87tbH__g2uHu-42" edge="1">
                    <mxGeometry x="0.211" y="-30" relative="1" as="geometry">
                        <mxPoint as="offset"/>
                        <Array as="points">
                            <mxPoint x="380" y="1010"/>
                        </Array>
                    </mxGeometry>
                </mxCell>
                <mxCell id="XIOKOJQC87tbH__g2uHu-54" value="assert whether we are we still&lt;br&gt;bijhoudingsverantwoordelijke&lt;br&gt;(checked after verhuis event)" style="edgeStyle=orthogonalEdgeStyle;rounded=0;orthogonalLoop=1;jettySize=auto;html=1;exitX=0;exitY=0.5;exitDx=0;exitDy=0;entryX=0;entryY=0.25;entryDx=0;entryDy=0;strokeWidth=2;jumpStyle=arc;" parent="XIOKOJQC87tbH__g2uHu-1" source="XIOKOJQC87tbH__g2uHu-55" target="XIOKOJQC87tbH__g2uHu-25" edge="1">
                    <mxGeometry x="-0.6946" relative="1" as="geometry">
                        <Array as="points">
                            <mxPoint x="60" y="1040"/>
                            <mxPoint x="60" y="390"/>
                        </Array>
                        <mxPoint x="-1" as="offset"/>
                    </mxGeometry>
                </mxCell>
                <mxCell id="qpghUpTgDb6sctYHf8Mc-13" style="edgeStyle=orthogonalEdgeStyle;rounded=0;jumpStyle=arc;orthogonalLoop=1;jettySize=auto;html=1;exitX=0.5;exitY=1;exitDx=0;exitDy=0;entryX=0.5;entryY=1;entryDx=0;entryDy=0;strokeWidth=2;strokeColor=#00CCCC;" parent="XIOKOJQC87tbH__g2uHu-1" source="XIOKOJQC87tbH__g2uHu-55" target="qpghUpTgDb6sctYHf8Mc-10" edge="1">
                    <mxGeometry relative="1" as="geometry">
                        <Array as="points">
                            <mxPoint x="355" y="1100"/>
                            <mxPoint x="1418" y="1100"/>
                        </Array>
                    </mxGeometry>
                </mxCell>
                <mxCell id="7" value="&lt;meta charset=&quot;utf-8&quot;&gt;&lt;span style=&quot;color: rgb(240, 240, 240); font-family: helvetica; font-size: 11px; font-style: normal; font-weight: 400; letter-spacing: normal; text-align: center; text-indent: 0px; text-transform: none; word-spacing: 0px; background-color: rgb(42, 42, 42); display: inline; float: none;&quot;&gt;watch verhuis events&lt;/span&gt;" style="edgeStyle=orthogonalEdgeStyle;rounded=0;orthogonalLoop=1;jettySize=auto;html=1;exitX=0.25;exitY=0;exitDx=0;exitDy=0;entryX=0.145;entryY=1;entryDx=0;entryDy=-4.35;entryPerimeter=0;strokeColor=#F0F0F0;strokeWidth=2;" parent="XIOKOJQC87tbH__g2uHu-1" source="XIOKOJQC87tbH__g2uHu-55" target="XIOKOJQC87tbH__g2uHu-42" edge="1">
                    <mxGeometry x="-0.3243" y="10" relative="1" as="geometry">
                        <Array as="points">
                            <mxPoint x="330" y="1010"/>
                        </Array>
                        <mxPoint as="offset"/>
                    </mxGeometry>
                </mxCell>
                <mxCell id="XIOKOJQC87tbH__g2uHu-55" value="journal-worker" style="rounded=0;whiteSpace=wrap;html=1;strokeWidth=3;fillColor=#1ba1e2;fontColor=#ffffff;strokeColor=#00060A;" parent="XIOKOJQC87tbH__g2uHu-1" vertex="1">
                    <mxGeometry x="295" y="1010" width="120" height="60" as="geometry"/>
                </mxCell>
                <mxCell id="XIOKOJQC87tbH__g2uHu-56" value="Transfer of journal" style="edgeStyle=orthogonalEdgeStyle;rounded=0;orthogonalLoop=1;jettySize=auto;html=1;exitX=0.5;exitY=1;exitDx=0;exitDy=0;strokeWidth=2;entryX=0.5;entryY=1;entryDx=0;entryDy=0;strokeColor=#00CCCC;" parent="XIOKOJQC87tbH__g2uHu-1" source="XIOKOJQC87tbH__g2uHu-55" target="XIOKOJQC87tbH__g2uHu-50" edge="1">
                    <mxGeometry x="-0.6915" relative="1" as="geometry">
                        <Array as="points">
                            <mxPoint x="355" y="1100"/>
                            <mxPoint x="1028" y="1100"/>
                        </Array>
                        <mxPoint x="1" as="offset"/>
                    </mxGeometry>
                </mxCell>
                <mxCell id="XIOKOJQC87tbH__g2uHu-68" value="&lt;font style=&quot;font-size: 17px&quot;&gt;desq-zone B (Gemeente)&lt;/font&gt;" style="text;html=1;align=center;verticalAlign=middle;resizable=0;points=[];autosize=1;" parent="XIOKOJQC87tbH__g2uHu-1" vertex="1">
                    <mxGeometry x="757.5" y="270" width="210" height="20" as="geometry"/>
                </mxCell>
                <mxCell id="XIOKOJQC87tbH__g2uHu-69" value="&lt;font style=&quot;font-size: 16px&quot;&gt;desq-zone A (Gemeente)&lt;/font&gt;" style="text;html=1;align=center;verticalAlign=middle;resizable=0;points=[];autosize=1;" parent="XIOKOJQC87tbH__g2uHu-1" vertex="1">
                    <mxGeometry x="52.5" y="270" width="190" height="20" as="geometry"/>
                </mxCell>
                <mxCell id="XIOKOJQC87tbH__g2uHu-71" value="&lt;font style=&quot;font-size: 22px&quot;&gt;Kunnen we het technisch opdelen?&lt;br&gt;&lt;br&gt;- Kijken hoe zaken los van elkaar opgepakt kunnen worden&lt;br&gt;&lt;br&gt;Kunnen we het functioneel splitsen?&lt;br style=&quot;font-size: 22px&quot;&gt;&lt;br style=&quot;font-size: 22px&quot;&gt;- Vastleggen van events&lt;br style=&quot;font-size: 22px&quot;&gt;- Raadplegen/afspelen van events&lt;br style=&quot;font-size: 22px&quot;&gt;&lt;br style=&quot;font-size: 22px&quot;&gt;&lt;br style=&quot;font-size: 22px&quot;&gt;Manieren om scope/slice kleiner te maken:&lt;br&gt;&lt;br style=&quot;font-size: 22px&quot;&gt;- Nog geen lokale index2, maar nog centraal&lt;br style=&quot;font-size: 22px&quot;&gt;- Weglaten van iedere vorm van cryptografie/signing&lt;/font&gt;" style="rounded=0;whiteSpace=wrap;html=1;strokeColor=#FFFF00;strokeWidth=11;align=left;verticalAlign=top;spacingTop=6;spacingLeft=6;fontSize=22;" parent="XIOKOJQC87tbH__g2uHu-1" vertex="1">
                    <mxGeometry x="1640" y="370" width="560" height="660" as="geometry"/>
                </mxCell>
                <mxCell id="qpghUpTgDb6sctYHf8Mc-1" value="&lt;font style=&quot;font-size: 17px&quot;&gt;desq-zone N (Gemeente)&lt;/font&gt;" style="text;html=1;align=center;verticalAlign=middle;resizable=0;points=[];autosize=1;" parent="XIOKOJQC87tbH__g2uHu-1" vertex="1">
                    <mxGeometry x="1140" y="270" width="210" height="20" as="geometry"/>
                </mxCell>
                <mxCell id="qpghUpTgDb6sctYHf8Mc-5" value="read" style="edgeStyle=orthogonalEdgeStyle;rounded=0;orthogonalLoop=1;jettySize=auto;html=1;strokeWidth=2;strokeColor=#F0F0F0;" parent="XIOKOJQC87tbH__g2uHu-1" source="qpghUpTgDb6sctYHf8Mc-6" target="qpghUpTgDb6sctYHf8Mc-7" edge="1">
                    <mxGeometry relative="1" as="geometry"/>
                </mxCell>
                <mxCell id="qpghUpTgDb6sctYHf8Mc-6" value="event-disclose-api" style="whiteSpace=wrap;html=1;aspect=fixed;strokeWidth=2;strokeColor=#BD7000;fillColor=#f0a30a;fontColor=#ffffff;" parent="XIOKOJQC87tbH__g2uHu-1" vertex="1">
                    <mxGeometry x="1222.5" y="430" width="80" height="80" as="geometry"/>
                </mxCell>
                <mxCell id="qpghUpTgDb6sctYHf8Mc-7" value="event-db" style="shape=cylinder3;whiteSpace=wrap;html=1;boundedLbl=1;backgroundOutline=1;size=15;strokeWidth=2;strokeColor=#C73500;fillColor=#fa6800;fontColor=#ffffff;" parent="XIOKOJQC87tbH__g2uHu-1" vertex="1">
                    <mxGeometry x="1227.5" y="585" width="70" height="105" as="geometry"/>
                </mxCell>
                <mxCell id="qpghUpTgDb6sctYHf8Mc-8" value="journal-db" style="shape=cylinder3;whiteSpace=wrap;html=1;boundedLbl=1;backgroundOutline=1;size=15;strokeWidth=2;strokeColor=#3700CC;fillColor=#6a00ff;fontColor=#ffffff;" parent="XIOKOJQC87tbH__g2uHu-1" vertex="1">
                    <mxGeometry x="1160" y="850" width="75" height="95" as="geometry"/>
                </mxCell>
                <mxCell id="qpghUpTgDb6sctYHf8Mc-9" value="write" style="edgeStyle=orthogonalEdgeStyle;rounded=0;orthogonalLoop=1;jettySize=auto;html=1;strokeWidth=2;strokeColor=#F0F0F0;" parent="XIOKOJQC87tbH__g2uHu-1" source="qpghUpTgDb6sctYHf8Mc-10" target="qpghUpTgDb6sctYHf8Mc-8" edge="1">
                    <mxGeometry relative="1" as="geometry"/>
                </mxCell>
                <mxCell id="qpghUpTgDb6sctYHf8Mc-10" value="journal-update-api" style="rounded=0;whiteSpace=wrap;html=1;strokeWidth=2;strokeColor=#006EAF;fillColor=#1ba1e2;fontColor=#ffffff;" parent="XIOKOJQC87tbH__g2uHu-1" vertex="1">
                    <mxGeometry x="1357.5" y="867.5" width="120" height="60" as="geometry"/>
                </mxCell>
                <mxCell id="XIOKOJQC87tbH__g2uHu-35" value="announce to tracker and &lt;br&gt;receive index3 hash" style="edgeStyle=orthogonalEdgeStyle;rounded=0;orthogonalLoop=1;jettySize=auto;html=1;entryX=0.5;entryY=0;entryDx=0;entryDy=0;strokeWidth=2;fillColor=#6a00ff;strokeColor=#3700CC;exitX=0.5;exitY=1;exitDx=0;exitDy=0;" parent="XIOKOJQC87tbH__g2uHu-1" source="XIOKOJQC87tbH__g2uHu-37" target="XIOKOJQC87tbH__g2uHu-50" edge="1">
                    <mxGeometry x="-0.8964" relative="1" as="geometry">
                        <Array as="points">
                            <mxPoint x="600" y="820"/>
                            <mxPoint x="1028" y="820"/>
                        </Array>
                        <mxPoint as="offset"/>
                    </mxGeometry>
                </mxCell>
                <mxCell id="3" value="&lt;font style=&quot;font-size: 17px&quot;&gt;desq-catalog&lt;/font&gt;" style="text;html=1;align=center;verticalAlign=middle;resizable=0;points=[];autosize=1;" parent="XIOKOJQC87tbH__g2uHu-1" vertex="1">
                    <mxGeometry x="360" y="-80" width="110" height="20" as="geometry"/>
                </mxCell>
                <mxCell id="5" value="&lt;font style=&quot;font-size: 17px&quot;&gt;Shared/hardcoded state&lt;/font&gt;" style="text;html=1;align=center;verticalAlign=middle;resizable=0;points=[];autosize=1;" parent="XIOKOJQC87tbH__g2uHu-1" vertex="1">
                    <mxGeometry x="85" y="-330" width="200" height="20" as="geometry"/>
                </mxCell>
            </root>
        </mxGraphModel>
    </diagram>
</mxfile>
