{
	"$schema": "http://json-schema.org/draft-04/schema#",
	"type": "object",
	"properties": {
		"_links": {
			"type": "object",
			"properties": {
				"curies": {
					"type": "object",
					"properties": {
						"href": {
							"type": "string"
						},
						"name": {
							"type": "string"
						}
					},
					"required": [
						"href",
						"name"
					]
				},
				"self": {
					"type": "object",
					"properties": {
						"href": {
							"type": "string"
						}
					},
					"required": [
						"href"
					]
				},
				"archives": {
					"type": "object",
					"properties": {
						"href": {
							"type": "string"
						}
					},
					"required": [
						"href"
					]
				},
				"sia:attachments": {
					"type": "object",
					"properties": {
						"href": {
							"type": "string"
						}
					},
					"required": [
						"href"
					]
				},
				"sia:parent": {
					"type": "object",
					"properties": {
						"href": {
							"type": "string"
						}
					},
					"required": [
						"href"
					]
				},
				"sia:children": {
					"type": "array",
					"items":[
						{
							"type": "object",
							"properties": {
								"href": {
									"type": "string"
								}
							},
							"required": [
								"href"
							]
						}
					]
				}
			},
			"required": [
				"self",
				"archives",
				"sia:attachments"
			]
		},
		"_display": {
			"type": "string"
		},
		"category": {
			"type": "object",
			"properties": {
				"sub": {
					"type": "string"
				},
				"sub_slug": {
					"type": "string"
				},
				"main": {
					"type": "string"
				},
				"main_slug": {
					"type": "string"
				},
				"departments": {
					"type": "string"
				},
				"created_by": {
					"anyOf": [
                        {
                            "type": "string"
                        },
                        {
                            "type": "null"
                        }
                    ]
				}
			},
			"required": [
				"sub",
				"sub_slug",
				"main",
				"main_slug",
				"departments",
				"created_by"
			]
		},
		"id": {
			"type": "integer"
		},
		"has_attachments":
		{
			"type": "boolean"
		},
		"location": {
			"type": "object",
			"properties": {
				"id": {
					"type": "integer"
				},
				"stadsdeel": {
					"type": "string"
				},
				"buurt_code": {
					"type": "string"
				},
				"address": {
                    "anyOf": [
                        {
                            "type": "object",
                            "properties": {
                                "postcode": {
                                    "type": "string"
                                },
                                "huisletter": {
                                    "type": "string"
                                },
                                "huisnummer": {
                                    "type": "integer"
                                },
                                "woonplaats": {
                                    "type": "string"
                                },
                                "openbare_ruimte": {
                                    "type": "string"
                                },
                                "huisnummer_toevoeging": {
                                    "type": "string"
                                }
                            },
                            "required": [
                                "postcode",
                                "huisletter",
                                "huisnummer",
                                "woonplaats",
                                "openbare_ruimte",
                                "huisnummer_toevoeging"
                            ]
                        },
                        {
                            "type": "null"
                        }
                    ]
				},
				"address_text": {
					"type": "string"
				},
				"geometrie": {
					"type": "object",
					"properties": {
						"type": {
							"type": "string"
						},
						"coordinates": {
							"type": "array",
							"items": [
								{
									"type": "number"
								},
								{
									"type": "number"
								}
							]
						}
					},
					"required": [
						"type",
						"coordinates"
					]
				},
				"extra_properties": {
					"anyOf": [
                        {
                            "type": "object"
                        },
                        {
                            "type": "null"
                        }
                    ]
				},
				"created_by": {
					"anyOf": [
                        {
                            "type": "string"
                        },
                        {
                            "type": "null"
                        }
                    ]
				},
				"bag_validated": {
					"type": "boolean"
				}
			},
			"required": [
				"id",
				"stadsdeel",
				"buurt_code",
				"address",
				"address_text",
				"geometrie",
				"extra_properties",
				"created_by",
				"bag_validated"
			]
		},
		"status": {
			"type": "object",
			"properties": {
				"text": {
					"anyOf": [
                        {
                            "type": "string"
                        },
                        {
                            "type": "null"
                        }
                    ]
				},
				"user": {
					"anyOf": [
                        {
                            "type": "string"
                        },
                        {
                            "type": "null"
                        }
                    ]
				},
				"state": {
					"type": "string"
				},
				"state_display": {
					"type": "string"
				},
				"extra_properties": {
					"type": "null"
				},
				"created_at": {
					"type": "string"
				}
			},
			"required": [
				"text",
				"user",
				"state",
				"state_display",
				"extra_properties",
				"created_at"
			]
		},
		"reporter": {
			"type": "object",
			"properties": {
				"email": {
					"type": "string"
				},
				"phone": {
					"type": "string"
				}
			},
			"required": [
				"email",
				"phone"
			]
		},
		"priority": {
			"type": "object",
			"properties": {
				"priority": {
					"type": "string"
				},
				"created_by": {
					"anyOf": [
                        {
                            "type": "string"
                        },
                        {
                            "type": "null"
                        }
                    ]
				}
			},
			"required": [
				"priority",
				"created_by"
			]
		},
		"notes": {
			"type": "array",
			"items": [
				{
					"type": "object",
					"properties": {
						"text": {
							"type": "string"
						},
						"created_by": {
							"anyOf": [
								{
									"type": "string"
								},
								{
									"type": "null"
								}
							]
						}
					},
					"required": [
						"text",
						"created_by"
					]
				}
			]
		},
		"type": {
			"type": "object",
			"properties": {
				"code": {
					"type": "string"
				},
				"created_at": {
					"type": "string"
				},
				"created_by": {
					"anyOf": [
						{
							"type": "string"
						},
						{
							"type": "null"
						}
					]
				}
			},
			"required": [
				"code"
			]
		}
	},
	"required": [
		"_links",
		"_display",
		"category",
		"id",
		"has_attachments",
		"location",
		"status",
		"reporter",
		"priority",
		"notes",
		"type"
	]
}
