<?xml version="1.0" encoding="UTF-8"?>
<svg width="170.89" height="67.009" color-interpolation-filters="sRGB" data-v-0dd9719b="" preserveAspectRatio="xMidYMid" version="1.0" viewBox="0 0 170.89 67.009" xmlns="http://www.w3.org/2000/svg">
 <g class="iconsvg-imagesvg" transform="translate(55.445)" fill="#333">
  <rect class="image-rect" width="60" height="39.589" fill="#333" fill-opacity="0" stroke-width="2"/>
  <svg class="image-svg-svg primary" width="60" height="39.589" overflow="visible" filtersec="colorsb8542802806" version="1.1">
   <svg version="1.1" viewBox="0 0 232.17001 153.19"/>
  </svg>
 </g>
 <path d="m0 47.759v2.27h2.15v14.48h-2.15v2.27h7.04v-2.27h-2.16v-6.16h6.3v-2.07h-6.3v-6.25h8.35l0.25 3.52h2.05v-5.79zm17.12 4.65v1.96h2.21v10.45h-2.21v1.96h6.95v-1.96h-2.21v-12.41zm1.08-4.11c0 1.22 0.88 1.73 2.21 1.73s2.19-0.51 2.19-1.73c0-1.14-0.86-1.71-2.19-1.71s-2.21 0.57-2.21 1.71zm14.25 3.94c-4.09 0-7.1 2.76-7.1 7.3 0 4.6 2.95 7.38 7.07 7.38 2.53 0 4.57-0.99 5.96-2.44l-0.65-2.1c-1.14 1.16-2.78 2.24-5.03 2.24-2.69 0-4.71-1.96-4.71-5.11 0-3.06 2.07-5.02 4.77-5.02 0.99 0 1.79 0.14 2.55 0.37l0.29 3.83h2.33v-5.25c-1.22-0.6-3.24-1.2-5.48-1.2zm7.41 0.17v1.96h2.41v6.36c0 4.43 1.28 6.28 3.92 6.28 0.99 0 2.18-0.26 3.6-0.74l-0.34-2.3c-1.05 0.34-1.9 0.57-2.58 0.57-1.45 0-2.04-0.94-2.04-3.75v-6.42h4.62v-1.96h-4.62v-4.37h-2.56v4.37zm11.69 0v1.96h2.22v10.45h-2.22v1.96h6.96v-1.96h-2.22v-12.41zm1.08-4.11c0 1.22 0.88 1.73 2.22 1.73 1.33 0 2.18-0.51 2.18-1.73 0-1.14-0.85-1.71-2.18-1.71-1.34 0-2.22 0.57-2.22 1.71zm7.16 11.24c0 4.6 2.95 7.38 7.07 7.38 2.81 0 4.57-0.99 5.96-2.44l-0.66-2.07c-1.13 1.22-2.58 2.3-4.82 2.3-2.58 0-4.32-1.51-4.8-3.89h10.9c0-0.31 0.06-1.31 0.06-1.59 0-3.95-2.22-6.99-6.7-6.99-3.98 0-7.01 2.76-7.01 7.3zm2.64-0.71c0.25-2.7 1.98-4.48 4.45-4.48 2.99 0 4.43 2.21 4.43 4.48zm14.5-4.46 4.69 12.41h3.29l4.69-12.41h2.35v-1.96h-6.95v1.96h1.96l-3.69 10.28-3.7-10.28h1.99v-1.96h-6.98v1.96zm16.1 5.17c0 4.6 2.95 7.38 7.07 7.38 2.81 0 4.57-0.99 5.96-2.44l-0.65-2.07c-1.14 1.22-2.58 2.3-4.83 2.3-2.58 0-4.31-1.51-4.79-3.89h10.9c0-0.31 0.05-1.31 0.05-1.59 0-3.95-2.21-6.99-6.7-6.99-3.97 0-7.01 2.76-7.01 7.3zm2.64-0.71c0.26-2.7 1.99-4.48 4.46-4.48 2.98 0 4.43 2.21 4.43 4.48z" fill="#393c48"/>
 <path d="m118.79 66.779c5.57 0 9.66-3.09 9.66-9.54 0-6.44-4.09-9.48-9.66-9.48h-9.05v3.89h1.67v11.07h-1.67v4.06zm0.03-15.13c2.67 0 4.8 1.59 4.8 5.59 0 3.98-2.13 5.65-4.8 5.65h-2.64v-11.24zm10.93-3.89v6.64h3.61l0.22-2.75h3.3v11.24h-1.68v3.89h8.15v-3.89h-1.7v-11.24h3.32l0.2 2.75h3.63v-6.64zm20.3 0v3.89h1.93l5.31 15.13h6.27l5.34-15.13h1.99v-3.89h-8.55v3.89h1.54l-3.44 10.33-3.43-10.33h1.56v-3.89z" fill="#393c48"/>
 <g transform="matrix(.25843 0 0 .25843 55.445 2.8604e-6)">
  <path d="m0 78.79c0.53-0.06 0.79 0.36 1.11 0.66a113 113 0 0 0 50.09 26.69 107.54 107.54 0 0 0 37.42 2.17c21.29-2.43 40.45-10.45 58.2-22.17 2.58-1.71 5.07-3.55 7.6-5.33a1 1 0 0 0 0.51-0.68 16.37 16.37 0 0 0-4 1.3 177.44 177.44 0 0 1-51.04 11.57 183.26 183.26 0 0 1-53.66-4c-2.77-0.62-5.51-1.34-8.28-2a1 1 0 0 1-0.95-1.16v-32.69c0-0.28-0.18-0.69 0.2-0.84s0.64 0.24 0.91 0.44c10.7 7.95 21.89 15.07 34.1 20.36 12.91 5.56 26.3 8.63 40.44 7.83 10.4-0.6 20.3-3.31 29.93-7.14 8.42-3.32 16.42-7.39 24.52-11.25 8.5-4 17.1-7.83 26.32-10a58.71 58.71 0 0 1 38.11 3.81c0.24 0.1 0.52 0.16 0.64 0.62-2.59 0.22-5.16 0.5-7.71 0.87a116.59 116.59 0 0 0-29.07 8.43c-1.84 0.79-2.35 1.72-2.34 3.66 0.07 27.24 0 54.48 0.08 81.72 0 1.32-0.45 1.53-1.63 1.53h-153c-1.25 0-1.47-0.42-1.46-1.55v-31.61a2.71 2.71 0 0 0-1.4-2.6 105.33 105.33 0 0 1-35.64-38.67z" fill="#324ca0"/>
  <path d="m37 25.91v-24.17c0-1.36 0.31-1.74 1.7-1.74q46.93 0.06 93.87 0h58.61c1.82 0 1.82 0 1.82 1.88v32c0 1.19-0.29 1.54-1.52 1.43-9.25-0.85-17.92 1.43-26.35 5-7.13 3-14 6.65-20.89 10.1-11.57 5.78-23.4 10.91-36.22 13.31a95.43 95.43 0 0 1-27.67 1c-13.24-1.4-25.74-5.38-37.89-10.64-1.48-0.64-2.89-1.41-4.36-2a1.7 1.7 0 0 1-1.1-1.86z" fill="#38c1ef"/>
  <path d="m0 78.76v-0.04l0.01 0.07z" fill="#324ca0"/>
 </g>
</svg>
