{
    "signing": {
      "default": {
        "expiry": "26280h"
      },
      "profiles": {
        "intermediate": {
          "expiry": "131376h",
          "ca_constraint": {
            "is_ca": true,
            "max_path_len": 0,
            "max_path_len_zero": true
          },
          "usages": [
            "digital signature",
            "cert sign",
            "crl sign",
            "signing"
          ]
        },
        "peer": {
          "expiry": "26280h",
          "usages": [
            "signing",
            "key encipherment",
            "server auth",
            "client auth"
          ]
        }
      }
    }
  }
  