{
  "CN": "Organization-B Root CA 1",
  "key": {
    "algo": "rsa",
    "size": 4096
  },
  "names": [
    {
      "O": "Organization-B",
      "C": "NL"
    }
  ],
  "ca": {
    "expiry": "131400h"
  }
}
