{
    "title": "Chart Values",
    "type": "object",
    "properties": {
        "image": {
            "type": "object",
            "properties": {
                "registry": {
                    "type": "string",
                    "description": "Image registry (ignored if 'global.imageRegistry' is set)",
                    "default": "registry.gitlab.com"
                },
                "repository": {
                    "type": "string",
                    "description": "Image repository of the docs API.",
                    "default": "commonground/nlx/images/keycloak"
                },
                "tag": {
                    "type": "string",
                    "description": "Image tag (ignored if 'global.imageTag' is set). When set to null, the AppVersion from the chart is used",
                    "default": "76a9edf3"
                },
                "pullPolicy": {
                    "type": "string",
                    "description": "Image pull policy",
                    "default": "Always"
                },
                "pullSecrets": {
                    "type": "array",
                    "description": "Secrets for the image repository",
                    "default": [],
                    "items": {}
                }
            }
        },
        "replicaCount": {
            "type": "number",
            "description": "Number of controller replicas",
            "default": 1
        },
        "serviceAccount": {
            "type": "object",
            "properties": {
                "create": {
                    "type": "boolean",
                    "description": "Specifies whether a service account should be created",
                    "default": true
                },
                "annotations": {
                    "type": "object",
                    "description": "Annotations to add to the service account",
                    "default": {}
                },
                "name": {
                    "type": "string",
                    "description": "The name of the service account to use. If not set and create is true, a name is generated using the fullname template",
                    "default": ""
                }
            }
        },
        "podSecurityContext": {
            "type": "object",
            "description": "Security context for the pod",
            "default": {}
        },
        "securityContext": {
            "type": "object",
            "description": "Optional security context. The YAML block should adhere to the [SecurityContext spec](https://kubernetes.io/docs/reference/generated/kubernetes-api/v1.16/#securitycontext-v1-core) | `{}`",
            "default": {}
        },
        "resources": {
            "type": "object",
            "description": "Pod resource requests & limits",
            "default": {}
        },
        "nodeSelector": {
            "type": "object",
            "description": "Node labels for pod assignment",
            "default": {}
        },
        "affinity": {
            "type": "object",
            "description": "Node affinity for pod assignment",
            "default": {}
        },
        "tolerations": {
            "type": "array",
            "description": "Node tolerations for pod assignment",
            "default": [],
            "items": {}
        },
        "extraEnv": {
            "type": "array",
            "description": "Extra env items for pod assignment",
            "default": [],
            "items": {}
        },
        "nameOverride": {
            "type": "string",
            "description": "Override deployment name",
            "default": ""
        },
        "fullnameOverride": {
            "type": "string",
            "description": "Override full deployment name",
            "default": ""
        },
        "config": {
            "type": "object",
            "properties": {
                "adminUsername": {
                    "type": "string",
                    "description": "username of the admin user",
                    "default": "keycloak-admin"
                },
                "adminPassword": {
                    "type": "string",
                    "description": "password of the admin user",
                    "default": "keycloak"
                },
                "keycloakHostURL": {
                    "type": "string",
                    "description": "URL of the client login/logout portals",
                    "default": ""
                },
                "keycloakHostAdminURL": {
                    "type": "string",
                    "description": "URL of the admin portal",
                    "default": ""
                },
                "javaOptsHeap": {
                    "type": "string",
                    "description": "Java Heap memory configuration",
                    "default": "-XX:MaxHeapFreeRatio=30 -XX:MaxRAMPercentage=65"
                }
            }
        },
        "service": {
            "type": "object",
            "properties": {
                "type": {
                    "type": "string",
                    "description": "Service Type (ClusterIP, NodePort, LoadBalancer)",
                    "default": "LoadBalancer"
                },
                "annotations": {
                    "type": "object",
                    "description": "Annotations to be included in the",
                    "default": {}
                },
                "port": {
                    "type": "number",
                    "description": "Port exposed by the service",
                    "default": 8080
                },
                "nodePort": {
                    "type": "number",
                    "description": "Port exposed for Inway traffic if 'service.type' is 'NodePort'",
                    "default": 8080
                },
                "loadBalancerIP": {
                    "type": "string",
                    "description": "Only applies when using 'service.type' 'LoadBalancer'. A loadBalancer will get created with the IP specified in this field. This feature depends on whether the underlying cloud-provider supports specifying the loadbalancerIP when a load balancer is created. This field will be ignored if the cloud-provider does not support the feature.",
                    "default": ""
                }
            }
        },
        "ingress": {
            "type": "object",
            "properties": {
                "enabled": {
                    "type": "boolean",
                    "description": "Enable ingress",
                    "default": false
                },
                "class": {
                    "type": "string",
                    "description": "Ingress class",
                    "default": ""
                },
                "annotations": {
                    "type": "object",
                    "description": "Ingress annotations",
                    "default": {}
                },
                "host": {
                    "type": "string",
                    "description": "Ingress accepted hostname",
                    "default": ""
                },
                "tls": {
                    "type": "array",
                    "description": "Ingress TLS configuration",
                    "default": [],
                    "items": {}
                }
            }
        }
    }
}