{
  "extends": [
    "config:base",
    ":semanticCommits",
    ":semanticCommitTypeAll(build)",
    ":semanticCommitScopeDisabled",
    "schedule:nonOfficeHours"
  ],
  "automerge": true,
  "automergeType": "branch"
}
