<mxfile host="www.draw.io" modified="2019-11-05T15:56:59.478Z" agent="Mozilla/5.0 (Macintosh; Intel Mac OS X 10_15_0) AppleWebKit/537.36 (KHTML, like Gecko) Chrome/78.0.3904.87 Safari/537.36" etag="sXhwcIFz9BYB89ElK36H" version="12.2.0" type="gitlab" pages="1">
  <diagram id="8cKxDH3Awxc1Bp-NBM3B" name="Page-1">
    <mxGraphModel dx="1141" dy="740" grid="1" gridSize="10" guides="1" tooltips="1" connect="1" arrows="1" fold="1" page="1" pageScale="1" pageWidth="827" pageHeight="1169" math="0" shadow="0">
      <root>
        <mxCell id="0"/>
        <mxCell id="1" parent="0"/>
        <mxCell id="kB6zX4PSbDHaBFvbIMGD-1" value="&lt;font style=&quot;vertical-align: inherit&quot;&gt;&lt;font style=&quot;vertical-align: inherit&quot;&gt;&lt;font style=&quot;vertical-align: inherit&quot;&gt;&lt;font style=&quot;vertical-align: inherit&quot;&gt;user&lt;br&gt;&lt;/font&gt;&lt;/font&gt;&lt;/font&gt;&lt;/font&gt;" style="rounded=1;whiteSpace=wrap;html=1;fillColor=none;verticalAlign=top;fontFamily=source sans pro;fontColor=#474E57;strokeColor=#38AEDA;fontStyle=1;strokeWidth=1;arcSize=8;" vertex="1" parent="1">
          <mxGeometry x="20" y="20" width="320" height="350" as="geometry"/>
        </mxCell>
        <mxCell id="kB6zX4PSbDHaBFvbIMGD-2" value="&lt;font style=&quot;vertical-align: inherit&quot;&gt;&lt;font style=&quot;vertical-align: inherit&quot;&gt;&lt;font style=&quot;vertical-align: inherit&quot;&gt;&lt;font style=&quot;vertical-align: inherit&quot;&gt;organization&lt;br&gt;&lt;/font&gt;&lt;/font&gt;&lt;/font&gt;&lt;/font&gt;" style="rounded=1;whiteSpace=wrap;html=1;fillColor=none;verticalAlign=top;fontFamily=source sans pro;fontColor=#474E57;strokeColor=#38AEDA;fontStyle=1;strokeWidth=1;arcSize=8;" vertex="1" parent="1">
          <mxGeometry x="420" y="20" width="320" height="350" as="geometry"/>
        </mxCell>
        <mxCell id="kB6zX4PSbDHaBFvbIMGD-3" value="" style="shape=umlActor;verticalLabelPosition=bottom;labelBackgroundColor=#ffffff;verticalAlign=top;html=1;outlineConnect=0;" vertex="1" parent="1">
          <mxGeometry x="60" y="100" width="30" height="60" as="geometry"/>
        </mxCell>
        <mxCell id="kB6zX4PSbDHaBFvbIMGD-4" value="mobile IRMA&lt;br&gt;app" style="rounded=1;whiteSpace=wrap;html=1;" vertex="1" parent="1">
          <mxGeometry x="170" y="200" width="60" height="110" as="geometry"/>
        </mxCell>
        <mxCell id="kB6zX4PSbDHaBFvbIMGD-5" value="Insight website" style="shape=process;whiteSpace=wrap;html=1;backgroundOutline=1;" vertex="1" parent="1">
          <mxGeometry x="150" y="100" width="100" height="60" as="geometry"/>
        </mxCell>
        <mxCell id="kB6zX4PSbDHaBFvbIMGD-6" value="tx log database" style="rounded=1;whiteSpace=wrap;html=1;fontFamily=source sans pro;fontColor=#FFFFFF;fillColor=#38AEDA;strokeColor=#38AEDA;" vertex="1" parent="1">
          <mxGeometry x="600" y="100" width="100" height="60" as="geometry"/>
        </mxCell>
        <mxCell id="kB6zX4PSbDHaBFvbIMGD-7" value="Insight API" style="rounded=1;whiteSpace=wrap;html=1;fontFamily=source sans pro;fontColor=#FFFFFF;fillColor=#38AEDA;strokeColor=#38AEDA;" vertex="1" parent="1">
          <mxGeometry x="460" y="100" width="100" height="60" as="geometry"/>
        </mxCell>
        <mxCell id="kB6zX4PSbDHaBFvbIMGD-8" value="IRMA Server" style="rounded=1;whiteSpace=wrap;html=1;fontFamily=source sans pro;fontColor=#FFFFFF;fillColor=#38AEDA;strokeColor=#38AEDA;" vertex="1" parent="1">
          <mxGeometry x="460" y="225" width="100" height="60" as="geometry"/>
        </mxCell>
        <mxCell id="kB6zX4PSbDHaBFvbIMGD-9" value="" style="endArrow=none;dashed=1;html=1;exitX=0;exitY=0.5;exitDx=0;exitDy=0;" edge="1" parent="1" source="kB6zX4PSbDHaBFvbIMGD-4" target="kB6zX4PSbDHaBFvbIMGD-3">
          <mxGeometry width="50" height="50" relative="1" as="geometry">
            <mxPoint x="20" y="440" as="sourcePoint"/>
            <mxPoint x="70" y="390" as="targetPoint"/>
            <Array as="points">
              <mxPoint x="88" y="240"/>
            </Array>
          </mxGeometry>
        </mxCell>
        <mxCell id="kB6zX4PSbDHaBFvbIMGD-10" value="reveal &lt;br&gt;attributes" style="text;html=1;resizable=0;points=[];align=center;verticalAlign=middle;labelBackgroundColor=#ffffff;" vertex="1" connectable="0" parent="kB6zX4PSbDHaBFvbIMGD-9">
          <mxGeometry x="-0.2873" y="-21" relative="1" as="geometry">
            <mxPoint x="-24" y="-18" as="offset"/>
          </mxGeometry>
        </mxCell>
        <mxCell id="kB6zX4PSbDHaBFvbIMGD-11" value="" style="endArrow=classic;html=1;entryX=0;entryY=0.5;entryDx=0;entryDy=0;exitX=1;exitY=0.5;exitDx=0;exitDy=0;" edge="1" parent="1" source="kB6zX4PSbDHaBFvbIMGD-4" target="kB6zX4PSbDHaBFvbIMGD-8">
          <mxGeometry width="50" height="50" relative="1" as="geometry">
            <mxPoint x="20" y="440" as="sourcePoint"/>
            <mxPoint x="70" y="390" as="targetPoint"/>
          </mxGeometry>
        </mxCell>
        <mxCell id="kB6zX4PSbDHaBFvbIMGD-12" value="attributes" style="text;html=1;resizable=0;points=[];align=center;verticalAlign=middle;labelBackgroundColor=#ffffff;" vertex="1" connectable="0" parent="kB6zX4PSbDHaBFvbIMGD-11">
          <mxGeometry x="0.3997" relative="1" as="geometry">
            <mxPoint x="-11" y="-15" as="offset"/>
          </mxGeometry>
        </mxCell>
        <mxCell id="kB6zX4PSbDHaBFvbIMGD-13" value="" style="endArrow=classic;html=1;exitX=0.5;exitY=0.5;exitDx=0;exitDy=0;exitPerimeter=0;entryX=0;entryY=0.5;entryDx=0;entryDy=0;" edge="1" parent="1" source="kB6zX4PSbDHaBFvbIMGD-3" target="kB6zX4PSbDHaBFvbIMGD-5">
          <mxGeometry width="50" height="50" relative="1" as="geometry">
            <mxPoint x="20" y="440" as="sourcePoint"/>
            <mxPoint x="70" y="390" as="targetPoint"/>
          </mxGeometry>
        </mxCell>
        <mxCell id="kB6zX4PSbDHaBFvbIMGD-14" value="" style="endArrow=classic;startArrow=classic;html=1;entryX=0;entryY=0.5;entryDx=0;entryDy=0;" edge="1" parent="1" source="kB6zX4PSbDHaBFvbIMGD-5" target="kB6zX4PSbDHaBFvbIMGD-7">
          <mxGeometry width="50" height="50" relative="1" as="geometry">
            <mxPoint x="20" y="440" as="sourcePoint"/>
            <mxPoint x="70" y="390" as="targetPoint"/>
          </mxGeometry>
        </mxCell>
        <mxCell id="kB6zX4PSbDHaBFvbIMGD-15" value="" style="endArrow=none;html=1;entryX=0.5;entryY=1;entryDx=0;entryDy=0;endFill=0;dashed=1;" edge="1" parent="1" source="kB6zX4PSbDHaBFvbIMGD-8" target="kB6zX4PSbDHaBFvbIMGD-7">
          <mxGeometry width="50" height="50" relative="1" as="geometry">
            <mxPoint x="20" y="440" as="sourcePoint"/>
            <mxPoint x="70" y="390" as="targetPoint"/>
          </mxGeometry>
        </mxCell>
        <mxCell id="kB6zX4PSbDHaBFvbIMGD-16" value="" style="endArrow=classic;html=1;entryX=0;entryY=0.25;entryDx=0;entryDy=0;exitX=1;exitY=0.25;exitDx=0;exitDy=0;" edge="1" parent="1" source="kB6zX4PSbDHaBFvbIMGD-7" target="kB6zX4PSbDHaBFvbIMGD-6">
          <mxGeometry width="50" height="50" relative="1" as="geometry">
            <mxPoint x="20" y="440" as="sourcePoint"/>
            <mxPoint x="70" y="390" as="targetPoint"/>
          </mxGeometry>
        </mxCell>
        <mxCell id="kB6zX4PSbDHaBFvbIMGD-17" value="" style="endArrow=classic;html=1;exitX=0;exitY=0.75;exitDx=0;exitDy=0;entryX=1;entryY=0.75;entryDx=0;entryDy=0;" edge="1" parent="1" source="kB6zX4PSbDHaBFvbIMGD-6" target="kB6zX4PSbDHaBFvbIMGD-7">
          <mxGeometry width="50" height="50" relative="1" as="geometry">
            <mxPoint x="20" y="440" as="sourcePoint"/>
            <mxPoint x="70" y="390" as="targetPoint"/>
          </mxGeometry>
        </mxCell>
        <mxCell id="kB6zX4PSbDHaBFvbIMGD-18" value="1" style="text;html=1;strokeColor=none;fillColor=none;align=center;verticalAlign=middle;whiteSpace=wrap;rounded=0;" vertex="1" parent="1">
          <mxGeometry x="95" y="100" width="40" height="20" as="geometry"/>
        </mxCell>
        <mxCell id="kB6zX4PSbDHaBFvbIMGD-19" value="&lt;h1&gt;Sequence&lt;/h1&gt;&lt;div&gt;1. The user visits the insight website and selects the organization,&lt;/div&gt;&lt;div&gt;2. The website shows a QR code generated by the IRMA Server,&lt;/div&gt;&lt;div&gt;3. The user scans the QR code and approves to share attributes with the organization,&lt;/div&gt;&lt;div&gt;4. The IRMA server shares the attributes with the Insight API. the Insight API queries the TX log database,&lt;/div&gt;&lt;div&gt;5. The Insight API shares the log result of the query with the user.&lt;/div&gt;" style="text;html=1;strokeColor=#38AEDA;fillColor=none;spacing=5;spacingTop=-20;whiteSpace=wrap;overflow=hidden;rounded=1;" vertex="1" parent="1">
          <mxGeometry x="20" y="390" width="720" height="140" as="geometry"/>
        </mxCell>
        <mxCell id="kB6zX4PSbDHaBFvbIMGD-20" value="" style="endArrow=classic;startArrow=classic;html=1;entryX=1;entryY=0.75;entryDx=0;entryDy=0;exitX=0;exitY=0.25;exitDx=0;exitDy=0;" edge="1" parent="1" source="kB6zX4PSbDHaBFvbIMGD-8" target="kB6zX4PSbDHaBFvbIMGD-5">
          <mxGeometry width="50" height="50" relative="1" as="geometry">
            <mxPoint x="20" y="580" as="sourcePoint"/>
            <mxPoint x="70" y="530" as="targetPoint"/>
            <Array as="points">
              <mxPoint x="430" y="145"/>
            </Array>
          </mxGeometry>
        </mxCell>
        <mxCell id="kB6zX4PSbDHaBFvbIMGD-21" value="2" style="text;html=1;strokeColor=none;fillColor=none;align=center;verticalAlign=middle;whiteSpace=wrap;rounded=0;" vertex="1" parent="1">
          <mxGeometry x="290" y="150" width="40" height="20" as="geometry"/>
        </mxCell>
        <mxCell id="kB6zX4PSbDHaBFvbIMGD-22" value="3" style="text;html=1;strokeColor=none;fillColor=none;align=center;verticalAlign=middle;whiteSpace=wrap;rounded=0;" vertex="1" parent="1">
          <mxGeometry x="95" y="255" width="40" height="20" as="geometry"/>
        </mxCell>
        <mxCell id="kB6zX4PSbDHaBFvbIMGD-23" value="4" style="text;html=1;strokeColor=none;fillColor=none;align=center;verticalAlign=middle;whiteSpace=wrap;rounded=0;" vertex="1" parent="1">
          <mxGeometry x="500" y="182.5" width="40" height="20" as="geometry"/>
        </mxCell>
        <mxCell id="kB6zX4PSbDHaBFvbIMGD-24" value="5" style="text;html=1;strokeColor=none;fillColor=none;align=center;verticalAlign=middle;whiteSpace=wrap;rounded=0;" vertex="1" parent="1">
          <mxGeometry x="370" y="110" width="40" height="20" as="geometry"/>
        </mxCell>
      </root>
    </mxGraphModel>
  </diagram>
</mxfile>
