<mxfile host="www.draw.io" modified="2020-02-12T12:12:44.118Z" agent="Mozilla/5.0 (Macintosh; Intel Mac OS X 10.15; rv:72.0) Gecko/20100101 Firefox/72.0" etag="YW1awIbyrptd51h-1Ipv" version="12.6.8" type="gitlab">
  <diagram id="APquNzihnF5tON0A4XNI" name="Page-1">
    <mxGraphModel dx="1915" dy="2466" grid="1" gridSize="10" guides="1" tooltips="1" connect="1" arrows="1" fold="1" page="1" pageScale="1" pageWidth="827" pageHeight="1169" math="0" shadow="0">
      <root>
        <mxCell id="0"/>
        <mxCell id="1" parent="0"/>
        <mxCell id="_gCGdVEYh_d5aVmEuGKs-1" value="&lt;font style=&quot;vertical-align: inherit&quot;&gt;&lt;font style=&quot;vertical-align: inherit&quot;&gt;&lt;font style=&quot;vertical-align: inherit&quot;&gt;&lt;font style=&quot;vertical-align: inherit&quot;&gt;Data Plane&lt;/font&gt;&lt;/font&gt;&lt;/font&gt;&lt;/font&gt;" style="rounded=1;whiteSpace=wrap;html=1;fillColor=none;verticalAlign=top;fontFamily=source sans pro;dashed=1;fontColor=#474E57;strokeColor=#474e57;align=left;labelPosition=center;verticalLabelPosition=middle;arcSize=2;" vertex="1" parent="1">
          <mxGeometry x="180" y="-377" width="700" height="267" as="geometry"/>
        </mxCell>
        <mxCell id="_gCGdVEYh_d5aVmEuGKs-2" value="&lt;font style=&quot;vertical-align: inherit&quot;&gt;&lt;font style=&quot;vertical-align: inherit&quot;&gt;&lt;font style=&quot;vertical-align: inherit&quot;&gt;&lt;font style=&quot;vertical-align: inherit&quot;&gt;Legenda&lt;/font&gt;&lt;/font&gt;&lt;/font&gt;&lt;/font&gt;" style="rounded=1;whiteSpace=wrap;html=1;fillColor=none;verticalAlign=top;fontFamily=source sans pro;dashed=1;fontColor=#474E57;strokeColor=#474e57;arcSize=3;" vertex="1" parent="1">
          <mxGeometry x="929" y="-1117" width="460" height="276" as="geometry"/>
        </mxCell>
        <mxCell id="_gCGdVEYh_d5aVmEuGKs-3" value="&lt;font style=&quot;vertical-align: inherit&quot;&gt;&lt;font style=&quot;vertical-align: inherit&quot;&gt;&lt;font style=&quot;vertical-align: inherit&quot;&gt;&lt;font style=&quot;vertical-align: inherit&quot;&gt;Descriptions&lt;/font&gt;&lt;/font&gt;&lt;/font&gt;&lt;/font&gt;" style="rounded=1;whiteSpace=wrap;html=1;fillColor=none;verticalAlign=top;fontFamily=source sans pro;dashed=1;fontColor=#474E57;strokeColor=#474e57;arcSize=3;" vertex="1" parent="1">
          <mxGeometry x="929" y="-817" width="460" height="427" as="geometry"/>
        </mxCell>
        <mxCell id="_gCGdVEYh_d5aVmEuGKs-4" value="&lt;font style=&quot;vertical-align: inherit&quot;&gt;&lt;font style=&quot;vertical-align: inherit&quot;&gt;&lt;font style=&quot;vertical-align: inherit&quot;&gt;&lt;font style=&quot;vertical-align: inherit&quot;&gt;Control Plane&lt;/font&gt;&lt;/font&gt;&lt;/font&gt;&lt;/font&gt;" style="rounded=1;whiteSpace=wrap;html=1;fillColor=none;verticalAlign=top;fontFamily=source sans pro;dashed=1;fontColor=#474E57;strokeColor=#474e57;align=left;labelPosition=center;verticalLabelPosition=middle;arcSize=2;" vertex="1" parent="1">
          <mxGeometry x="180" y="-657" width="700" height="270" as="geometry"/>
        </mxCell>
        <mxCell id="_gCGdVEYh_d5aVmEuGKs-5" value="management-worker" style="rounded=1;whiteSpace=wrap;html=1;fillColor=#dae8fc;strokeColor=#6c8ebf;" vertex="1" parent="1">
          <mxGeometry x="372.5" y="-597" width="130" height="60" as="geometry"/>
        </mxCell>
        <mxCell id="_gCGdVEYh_d5aVmEuGKs-6" value="ORG Certificate Server" style="rounded=1;whiteSpace=wrap;html=1;fillColor=#dae8fc;strokeColor=#6c8ebf;" vertex="1" parent="1">
          <mxGeometry x="605.5" y="-516" width="190" height="60" as="geometry"/>
        </mxCell>
        <mxCell id="_gCGdVEYh_d5aVmEuGKs-7" value="&lt;font style=&quot;vertical-align: inherit&quot;&gt;&lt;font style=&quot;vertical-align: inherit&quot;&gt;&lt;font style=&quot;vertical-align: inherit&quot;&gt;&lt;font style=&quot;vertical-align: inherit&quot;&gt;UI&lt;/font&gt;&lt;/font&gt;&lt;/font&gt;&lt;/font&gt;" style="rounded=1;whiteSpace=wrap;html=1;fillColor=none;verticalAlign=top;fontFamily=source sans pro;dashed=1;fontColor=#474E57;strokeColor=#474e57;align=left;labelPosition=center;verticalLabelPosition=middle;arcSize=5;" vertex="1" parent="1">
          <mxGeometry x="180" y="-817" width="699" height="110" as="geometry"/>
        </mxCell>
        <mxCell id="_gCGdVEYh_d5aVmEuGKs-8" value="PKIO Personal certificate" style="pointerEvents=1;shadow=0;dashed=0;html=1;strokeColor=none;fillColor=#E75D66;labelPosition=right;verticalLabelPosition=middle;verticalAlign=middle;outlineConnect=0;align=left;shape=mxgraph.office.security.certificate;" vertex="1" parent="1">
          <mxGeometry x="972.5" y="-730.5" width="39" height="33" as="geometry"/>
        </mxCell>
        <mxCell id="_gCGdVEYh_d5aVmEuGKs-9" value="&lt;font style=&quot;vertical-align: inherit&quot;&gt;&lt;font style=&quot;vertical-align: inherit&quot;&gt;&lt;font style=&quot;vertical-align: inherit&quot;&gt;&lt;font style=&quot;vertical-align: inherit&quot;&gt;Centrale NLX componenten&lt;/font&gt;&lt;/font&gt;&lt;/font&gt;&lt;/font&gt;" style="rounded=1;whiteSpace=wrap;html=1;fillColor=none;verticalAlign=top;fontFamily=source sans pro;dashed=1;fontColor=#474E57;strokeColor=#474e57;align=left;labelPosition=center;verticalLabelPosition=middle;arcSize=5;" vertex="1" parent="1">
          <mxGeometry x="180" y="-1117" width="699" height="282" as="geometry"/>
        </mxCell>
        <mxCell id="_gCGdVEYh_d5aVmEuGKs-10" value="grpc" style="edgeStyle=orthogonalEdgeStyle;curved=1;rounded=0;orthogonalLoop=1;jettySize=auto;html=1;exitX=0.5;exitY=1;exitDx=0;exitDy=0;entryX=0.75;entryY=0;entryDx=0;entryDy=0;startArrow=classic;startFill=1;" edge="1" parent="1" source="_gCGdVEYh_d5aVmEuGKs-11" target="_gCGdVEYh_d5aVmEuGKs-13">
          <mxGeometry relative="1" as="geometry"/>
        </mxCell>
        <mxCell id="_gCGdVEYh_d5aVmEuGKs-11" value="management-dashboard&lt;br&gt;(ui)" style="rounded=1;whiteSpace=wrap;html=1;fillColor=#dae8fc;strokeColor=#6c8ebf;" vertex="1" parent="1">
          <mxGeometry x="579.5" y="-787" width="160" height="60" as="geometry"/>
        </mxCell>
        <mxCell id="_gCGdVEYh_d5aVmEuGKs-12" value="config-api" style="rounded=1;whiteSpace=wrap;html=1;fillColor=#dae8fc;strokeColor=#6c8ebf;" vertex="1" parent="1">
          <mxGeometry x="437.5" y="-467" width="190" height="60" as="geometry"/>
        </mxCell>
        <mxCell id="_gCGdVEYh_d5aVmEuGKs-13" value="management-api" style="rounded=1;whiteSpace=wrap;html=1;fillColor=#dae8fc;strokeColor=#6c8ebf;" vertex="1" parent="1">
          <mxGeometry x="434.5" y="-647" width="190" height="60" as="geometry"/>
        </mxCell>
        <mxCell id="_gCGdVEYh_d5aVmEuGKs-14" value="grpc: watch config" style="edgeStyle=orthogonalEdgeStyle;curved=1;rounded=0;orthogonalLoop=1;jettySize=auto;html=1;exitX=1;exitY=0.25;exitDx=0;exitDy=0;entryX=0.25;entryY=1;entryDx=0;entryDy=0;startArrow=none;startFill=0;" edge="1" parent="1" source="_gCGdVEYh_d5aVmEuGKs-16" target="_gCGdVEYh_d5aVmEuGKs-12">
          <mxGeometry x="-0.5862" y="25" relative="1" as="geometry">
            <mxPoint x="25" y="-25" as="offset"/>
            <mxPoint x="438.02941176470586" y="-376.8529411764707" as="targetPoint"/>
          </mxGeometry>
        </mxCell>
        <mxCell id="_gCGdVEYh_d5aVmEuGKs-15" value="https: API call" style="edgeStyle=orthogonalEdgeStyle;curved=1;rounded=0;orthogonalLoop=1;jettySize=auto;html=1;startArrow=none;startFill=0;endArrow=classic;endFill=1;" edge="1" parent="1" source="_gCGdVEYh_d5aVmEuGKs-16" target="_gCGdVEYh_d5aVmEuGKs-33">
          <mxGeometry x="-0.3333" relative="1" as="geometry">
            <mxPoint as="offset"/>
          </mxGeometry>
        </mxCell>
        <mxCell id="_gCGdVEYh_d5aVmEuGKs-16" value="inway" style="rounded=1;whiteSpace=wrap;html=1;fillColor=#dae8fc;strokeColor=#6c8ebf;" vertex="1" parent="1">
          <mxGeometry x="230.5" y="-211.5" width="120" height="60" as="geometry"/>
        </mxCell>
        <mxCell id="_gCGdVEYh_d5aVmEuGKs-17" value="grpc: watch config" style="edgeStyle=orthogonalEdgeStyle;curved=1;rounded=0;orthogonalLoop=1;jettySize=auto;html=1;exitX=0;exitY=0.25;exitDx=0;exitDy=0;entryX=0.75;entryY=1;entryDx=0;entryDy=0;startArrow=none;startFill=0;" edge="1" parent="1" source="_gCGdVEYh_d5aVmEuGKs-19" target="_gCGdVEYh_d5aVmEuGKs-12">
          <mxGeometry x="-0.5886" y="-25" relative="1" as="geometry">
            <mxPoint x="-25" y="-25" as="offset"/>
            <mxPoint x="628.6176470588234" y="-376.8529411764707" as="targetPoint"/>
          </mxGeometry>
        </mxCell>
        <mxCell id="_gCGdVEYh_d5aVmEuGKs-18" value="nhp" style="edgeStyle=orthogonalEdgeStyle;curved=1;rounded=0;orthogonalLoop=1;jettySize=auto;html=1;startArrow=none;startFill=0;" edge="1" parent="1" source="_gCGdVEYh_d5aVmEuGKs-19">
          <mxGeometry relative="1" as="geometry">
            <mxPoint x="905" y="-181.5" as="targetPoint"/>
          </mxGeometry>
        </mxCell>
        <mxCell id="_gCGdVEYh_d5aVmEuGKs-19" value="outway" style="rounded=1;whiteSpace=wrap;html=1;fillColor=#dae8fc;strokeColor=#6c8ebf;" vertex="1" parent="1">
          <mxGeometry x="710.5" y="-211.5" width="120" height="60" as="geometry"/>
        </mxCell>
        <mxCell id="_gCGdVEYh_d5aVmEuGKs-20" value="grpc" style="edgeStyle=orthogonalEdgeStyle;curved=1;rounded=0;orthogonalLoop=1;jettySize=auto;html=1;startArrow=classic;startFill=1;exitX=0.5;exitY=1;exitDx=0;exitDy=0;entryX=0.5;entryY=0;entryDx=0;entryDy=0;" edge="1" parent="1" source="_gCGdVEYh_d5aVmEuGKs-13" target="_gCGdVEYh_d5aVmEuGKs-12">
          <mxGeometry relative="1" as="geometry">
            <mxPoint x="413.5" y="-527" as="sourcePoint"/>
          </mxGeometry>
        </mxCell>
        <mxCell id="_gCGdVEYh_d5aVmEuGKs-21" value="grpc" style="edgeStyle=orthogonalEdgeStyle;curved=1;rounded=0;orthogonalLoop=1;jettySize=auto;html=1;exitX=0.5;exitY=1;exitDx=0;exitDy=0;entryX=0.5;entryY=0;entryDx=0;entryDy=0;startArrow=classic;startFill=1;" edge="1" parent="1" source="_gCGdVEYh_d5aVmEuGKs-22" target="_gCGdVEYh_d5aVmEuGKs-13">
          <mxGeometry relative="1" as="geometry"/>
        </mxCell>
        <mxCell id="_gCGdVEYh_d5aVmEuGKs-22" value="management-cli&lt;br&gt;" style="rounded=1;whiteSpace=wrap;html=1;fillColor=#dae8fc;strokeColor=#6c8ebf;" vertex="1" parent="1">
          <mxGeometry x="411.5" y="-783.5" width="135" height="60" as="geometry"/>
        </mxCell>
        <mxCell id="_gCGdVEYh_d5aVmEuGKs-24" value="nhp" style="edgeStyle=orthogonalEdgeStyle;curved=1;rounded=0;orthogonalLoop=1;jettySize=auto;html=1;startArrow=none;startFill=0;" edge="1" parent="1" target="_gCGdVEYh_d5aVmEuGKs-16">
          <mxGeometry relative="1" as="geometry">
            <mxPoint x="170.69232177734375" y="-181.5" as="sourcePoint"/>
          </mxGeometry>
        </mxCell>
        <mxCell id="_gCGdVEYh_d5aVmEuGKs-26" value="NLX components inside the organization" style="text;html=1;strokeColor=#6c8ebf;fillColor=#dae8fc;align=center;verticalAlign=middle;whiteSpace=wrap;rounded=1;" vertex="1" parent="1">
          <mxGeometry x="945" y="-1045" width="240" height="20" as="geometry"/>
        </mxCell>
        <mxCell id="_gCGdVEYh_d5aVmEuGKs-27" value="NLX components outside the organization" style="text;html=1;strokeColor=#666666;fillColor=#f5f5f5;align=center;verticalAlign=middle;whiteSpace=wrap;rounded=1;fontColor=#333333;" vertex="1" parent="1">
          <mxGeometry x="945" y="-985" width="240" height="20" as="geometry"/>
        </mxCell>
        <mxCell id="_gCGdVEYh_d5aVmEuGKs-28" value="Off-the-shelf O-S software inside the org" style="text;html=1;strokeColor=#d6b656;fillColor=#fff2cc;align=center;verticalAlign=middle;whiteSpace=wrap;rounded=1;" vertex="1" parent="1">
          <mxGeometry x="945" y="-1015" width="240" height="20" as="geometry"/>
        </mxCell>
        <mxCell id="_gCGdVEYh_d5aVmEuGKs-29" value="Component by related community" style="text;html=1;strokeColor=#82b366;fillColor=#d5e8d4;align=center;verticalAlign=middle;whiteSpace=wrap;rounded=1;" vertex="1" parent="1">
          <mxGeometry x="945" y="-953" width="240" height="20" as="geometry"/>
        </mxCell>
        <mxCell id="_gCGdVEYh_d5aVmEuGKs-30" value="Software created/owned by organization" style="text;html=1;strokeColor=#9673a6;fillColor=#e1d5e7;align=center;verticalAlign=middle;whiteSpace=wrap;rounded=1;" vertex="1" parent="1">
          <mxGeometry x="945" y="-923" width="240" height="20" as="geometry"/>
        </mxCell>
        <mxCell id="_gCGdVEYh_d5aVmEuGKs-31" value="https: API call" style="edgeStyle=orthogonalEdgeStyle;curved=1;rounded=0;orthogonalLoop=1;jettySize=auto;html=1;startArrow=none;startFill=0;endArrow=classic;endFill=1;" edge="1" parent="1" source="_gCGdVEYh_d5aVmEuGKs-32" target="_gCGdVEYh_d5aVmEuGKs-19">
          <mxGeometry x="-0.3333" relative="1" as="geometry">
            <mxPoint as="offset"/>
          </mxGeometry>
        </mxCell>
        <mxCell id="_gCGdVEYh_d5aVmEuGKs-32" value="application" style="rounded=1;whiteSpace=wrap;html=1;fillColor=#e1d5e7;strokeColor=#9673a6;" vertex="1" parent="1">
          <mxGeometry x="710.5" y="-331.5" width="120" height="60" as="geometry"/>
        </mxCell>
        <mxCell id="_gCGdVEYh_d5aVmEuGKs-33" value="API service" style="rounded=1;whiteSpace=wrap;html=1;fillColor=#e1d5e7;strokeColor=#9673a6;" vertex="1" parent="1">
          <mxGeometry x="230.5" y="-331.5" width="120" height="60" as="geometry"/>
        </mxCell>
        <mxCell id="_gCGdVEYh_d5aVmEuGKs-34" value="Public PKIO certificates" style="pointerEvents=1;shadow=0;dashed=0;html=1;strokeColor=none;fillColor=#E75D66;labelPosition=right;verticalLabelPosition=middle;verticalAlign=middle;outlineConnect=0;align=left;shape=mxgraph.office.security.certificate;" vertex="1" parent="1">
          <mxGeometry x="965" y="-889.5" width="39" height="33" as="geometry"/>
        </mxCell>
        <mxCell id="_gCGdVEYh_d5aVmEuGKs-35" value="Private ORG certificates" style="pointerEvents=1;shadow=0;dashed=0;html=1;strokeColor=none;fillColor=#FFBC2C;labelPosition=right;verticalLabelPosition=middle;verticalAlign=middle;outlineConnect=0;align=left;shape=mxgraph.office.security.certificate;" vertex="1" parent="1">
          <mxGeometry x="1146" y="-890" width="39" height="33" as="geometry"/>
        </mxCell>
        <mxCell id="_gCGdVEYh_d5aVmEuGKs-36" value="ORG-management-Cert" style="pointerEvents=1;shadow=0;dashed=0;html=1;strokeColor=none;fillColor=#FFBC2C;labelPosition=right;verticalLabelPosition=middle;verticalAlign=middle;outlineConnect=0;align=left;shape=mxgraph.office.security.certificate;" vertex="1" parent="1">
          <mxGeometry x="604" y="-603.5" width="39" height="33" as="geometry"/>
        </mxCell>
        <mxCell id="_gCGdVEYh_d5aVmEuGKs-37" value="ORG-Dashboard-Cert" style="pointerEvents=1;shadow=0;dashed=0;html=1;strokeColor=none;fillColor=#FFBC2C;labelPosition=right;verticalLabelPosition=middle;verticalAlign=middle;outlineConnect=0;align=left;shape=mxgraph.office.security.certificate;" vertex="1" parent="1">
          <mxGeometry x="720" y="-747" width="39" height="33" as="geometry"/>
        </mxCell>
        <mxCell id="_gCGdVEYh_d5aVmEuGKs-38" value="PKIO-Dashboard" style="pointerEvents=1;shadow=0;dashed=0;html=1;strokeColor=none;fillColor=#E75D66;labelPosition=right;verticalLabelPosition=middle;verticalAlign=middle;outlineConnect=0;align=left;shape=mxgraph.office.security.certificate;" vertex="1" parent="1">
          <mxGeometry x="720" y="-800" width="39" height="33" as="geometry"/>
        </mxCell>
        <mxCell id="_gCGdVEYh_d5aVmEuGKs-39" value="ORG-Inway-Cert" style="pointerEvents=1;shadow=0;dashed=0;html=1;strokeColor=none;fillColor=#FFBC2C;labelPosition=center;verticalLabelPosition=bottom;verticalAlign=top;outlineConnect=0;align=center;shape=mxgraph.office.security.certificate;" vertex="1" parent="1">
          <mxGeometry x="331" y="-168" width="39" height="33" as="geometry"/>
        </mxCell>
        <mxCell id="_gCGdVEYh_d5aVmEuGKs-40" value="ORG-Outway-Cert" style="pointerEvents=1;shadow=0;dashed=0;html=1;strokeColor=none;fillColor=#FFBC2C;labelPosition=center;verticalLabelPosition=bottom;verticalAlign=top;outlineConnect=0;align=center;shape=mxgraph.office.security.certificate;" vertex="1" parent="1">
          <mxGeometry x="691" y="-168" width="39" height="33" as="geometry"/>
        </mxCell>
        <mxCell id="_gCGdVEYh_d5aVmEuGKs-41" value="PKIO-Inway-Cert" style="pointerEvents=1;shadow=0;dashed=0;html=1;strokeColor=none;fillColor=#E75D66;labelPosition=center;verticalLabelPosition=bottom;verticalAlign=top;outlineConnect=0;align=center;shape=mxgraph.office.security.certificate;" vertex="1" parent="1">
          <mxGeometry x="211" y="-168" width="39" height="33" as="geometry"/>
        </mxCell>
        <mxCell id="_gCGdVEYh_d5aVmEuGKs-42" value="PKIO-Outway-Cert" style="pointerEvents=1;shadow=0;dashed=0;html=1;strokeColor=none;fillColor=#E75D66;labelPosition=center;verticalLabelPosition=bottom;verticalAlign=top;outlineConnect=0;align=center;shape=mxgraph.office.security.certificate;" vertex="1" parent="1">
          <mxGeometry x="811" y="-168" width="39" height="33" as="geometry"/>
        </mxCell>
        <mxCell id="_gCGdVEYh_d5aVmEuGKs-43" value="The Control plane component(s):&lt;br&gt;generate private keys, &lt;br&gt;generate CSR files, &lt;br&gt;maintains the truststore&lt;br&gt;discovers and announces to the directory" style="outlineConnect=0;fontColor=#232F3E;gradientColor=none;strokeColor=#232F3E;fillColor=#ffffff;dashed=0;verticalLabelPosition=middle;verticalAlign=middle;align=left;html=1;fontSize=12;fontStyle=0;aspect=fixed;shape=mxgraph.aws4.resourceIcon;resIcon=mxgraph.aws4.certificate_manager;labelPosition=right;" vertex="1" parent="1">
          <mxGeometry x="945" y="-663.5" width="60" height="60" as="geometry"/>
        </mxCell>
        <mxCell id="_gCGdVEYh_d5aVmEuGKs-44" value="The CLI/UI: serves the CSR to the user, &lt;br&gt;The User aquires a PKIO Cert, &lt;br&gt;the user uploads Signed PKIO certificates" style="shape=umlActor;verticalLabelPosition=middle;labelBackgroundColor=#ffffff;verticalAlign=middle;html=1;outlineConnect=0;fillColor=#FFBC2C;labelPosition=right;align=left;" vertex="1" parent="1">
          <mxGeometry x="975" y="-800" width="30" height="60" as="geometry"/>
        </mxCell>
        <mxCell id="_gCGdVEYh_d5aVmEuGKs-45" value="ORG-API-Service-Cert" style="pointerEvents=1;shadow=0;dashed=0;html=1;strokeColor=none;fillColor=#FFBC2C;labelPosition=center;verticalLabelPosition=top;verticalAlign=bottom;outlineConnect=0;align=center;shape=mxgraph.office.security.certificate;" vertex="1" parent="1">
          <mxGeometry x="331" y="-348" width="39" height="33" as="geometry"/>
        </mxCell>
        <mxCell id="_gCGdVEYh_d5aVmEuGKs-46" value="All components whitin the Organization are provisioned with&lt;br&gt;the persisted configuration,&lt;br&gt;the Private ORG certificates and &lt;br&gt;Public certificates if needed (manually, automation is a nice to have)" style="pointerEvents=1;shadow=0;dashed=0;html=1;strokeColor=none;fillColor=#505050;labelPosition=right;verticalLabelPosition=middle;verticalAlign=middle;outlineConnect=0;align=left;shape=mxgraph.office.security.certificate;" vertex="1" parent="1">
          <mxGeometry x="945" y="-492" width="58" height="50" as="geometry"/>
        </mxCell>
        <mxCell id="_gCGdVEYh_d5aVmEuGKs-47" value="NLX Central components" style="text;html=1;strokeColor=#990000;fillColor=#E75D66;align=center;verticalAlign=middle;whiteSpace=wrap;rounded=1;" vertex="1" parent="1">
          <mxGeometry x="945" y="-1075" width="240" height="20" as="geometry"/>
        </mxCell>
        <mxCell id="_gCGdVEYh_d5aVmEuGKs-48" value="NLX Directory" style="text;html=1;strokeColor=#990000;fillColor=#E75D66;align=center;verticalAlign=middle;whiteSpace=wrap;rounded=1;" vertex="1" parent="1">
          <mxGeometry x="258.5" y="-905.5" width="240" height="52" as="geometry"/>
        </mxCell>
        <mxCell id="_gCGdVEYh_d5aVmEuGKs-49" value="grpc: discover&lt;br&gt;grpc: announce" style="edgeStyle=orthogonalEdgeStyle;curved=1;rounded=0;orthogonalLoop=1;jettySize=auto;html=1;exitX=0.5;exitY=1;exitDx=0;exitDy=0;startArrow=classic;startFill=1;" edge="1" parent="1" source="_gCGdVEYh_d5aVmEuGKs-48" target="_gCGdVEYh_d5aVmEuGKs-5">
          <mxGeometry x="0.2067" y="10" relative="1" as="geometry">
            <mxPoint x="390" y="-717" as="sourcePoint"/>
            <mxPoint x="409" y="-606" as="targetPoint"/>
            <Array as="points">
              <mxPoint x="379" y="-676"/>
              <mxPoint x="409" y="-676"/>
            </Array>
            <mxPoint as="offset"/>
          </mxGeometry>
        </mxCell>
        <mxCell id="_gCGdVEYh_d5aVmEuGKs-50" value="PKIO-nlx.io-Cert" style="pointerEvents=1;shadow=0;dashed=0;html=1;strokeColor=none;fillColor=#E75D66;labelPosition=right;verticalLabelPosition=middle;verticalAlign=middle;outlineConnect=0;align=left;shape=mxgraph.office.security.certificate;" vertex="1" parent="1">
          <mxGeometry x="332" y="-1026.5" width="39" height="33" as="geometry"/>
        </mxCell>
        <mxCell id="_gCGdVEYh_d5aVmEuGKs-51" value="NLX.io Homepage" style="text;html=1;strokeColor=#990000;fillColor=#E75D66;align=center;verticalAlign=middle;whiteSpace=wrap;rounded=1;" vertex="1" parent="1">
          <mxGeometry x="261" y="-975.5" width="240" height="52" as="geometry"/>
        </mxCell>
        <mxCell id="_gCGdVEYh_d5aVmEuGKs-52" value="ORG-config-Cert" style="pointerEvents=1;shadow=0;dashed=0;html=1;strokeColor=none;fillColor=#FFBC2C;labelPosition=left;verticalLabelPosition=middle;verticalAlign=middle;outlineConnect=0;align=right;shape=mxgraph.office.security.certificate;" vertex="1" parent="1">
          <mxGeometry x="418" y="-481.5" width="39" height="33" as="geometry"/>
        </mxCell>
        <mxCell id="_gCGdVEYh_d5aVmEuGKs-53" value="grpc" style="edgeStyle=orthogonalEdgeStyle;curved=1;rounded=0;orthogonalLoop=1;jettySize=auto;html=1;startArrow=classic;startFill=1;exitX=0.75;exitY=1;exitDx=0;exitDy=0;entryX=0.25;entryY=0;entryDx=0;entryDy=0;" edge="1" parent="1" source="_gCGdVEYh_d5aVmEuGKs-5" target="_gCGdVEYh_d5aVmEuGKs-12">
          <mxGeometry relative="1" as="geometry">
            <mxPoint x="482.5" y="-382" as="targetPoint"/>
          </mxGeometry>
        </mxCell>
        <mxCell id="_gCGdVEYh_d5aVmEuGKs-54" value="PKIO-Management" style="pointerEvents=1;shadow=0;dashed=0;html=1;strokeColor=none;fillColor=#E75D66;labelPosition=left;verticalLabelPosition=middle;verticalAlign=middle;outlineConnect=0;align=right;shape=mxgraph.office.security.certificate;" vertex="1" parent="1">
          <mxGeometry x="343.5" y="-582" width="39" height="33" as="geometry"/>
        </mxCell>
        <mxCell id="_gCGdVEYh_d5aVmEuGKs-55" value="https" style="edgeStyle=orthogonalEdgeStyle;curved=1;rounded=0;orthogonalLoop=1;jettySize=auto;html=1;exitX=0;exitY=0.3333333333333333;exitDx=0;exitDy=0;entryX=1;entryY=0.5;entryDx=0;entryDy=0;startArrow=classic;startFill=1;exitPerimeter=0;" edge="1" parent="1" source="_gCGdVEYh_d5aVmEuGKs-44" target="_gCGdVEYh_d5aVmEuGKs-11">
          <mxGeometry relative="1" as="geometry">
            <mxPoint x="670" y="-717" as="sourcePoint"/>
            <mxPoint x="587" y="-657" as="targetPoint"/>
          </mxGeometry>
        </mxCell>
        <mxCell id="_gCGdVEYh_d5aVmEuGKs-56" value="grpc" style="edgeStyle=orthogonalEdgeStyle;curved=1;rounded=0;orthogonalLoop=1;jettySize=auto;html=1;startArrow=classic;startFill=1;exitX=0.5;exitY=1;exitDx=0;exitDy=0;entryX=1;entryY=0.75;entryDx=0;entryDy=0;" edge="1" parent="1" source="_gCGdVEYh_d5aVmEuGKs-6" target="_gCGdVEYh_d5aVmEuGKs-12">
          <mxGeometry relative="1" as="geometry">
            <mxPoint x="613.0294117647059" y="-432.73529411764684" as="targetPoint"/>
            <mxPoint x="483.5" y="-459.5" as="sourcePoint"/>
          </mxGeometry>
        </mxCell>
        <mxCell id="_gCGdVEYh_d5aVmEuGKs-57" value="ORG-CLI-Cert" style="pointerEvents=1;shadow=0;dashed=0;html=1;strokeColor=none;fillColor=#FFBC2C;labelPosition=right;verticalLabelPosition=middle;verticalAlign=middle;outlineConnect=0;align=left;shape=mxgraph.office.security.certificate;" vertex="1" parent="1">
          <mxGeometry x="427.5" y="-810" width="39" height="33" as="geometry"/>
        </mxCell>
        <mxCell id="_gCGdVEYh_d5aVmEuGKs-58" value="ORG-CertServ-Cert" style="pointerEvents=1;shadow=0;dashed=0;html=1;strokeColor=none;fillColor=#FFBC2C;labelPosition=center;verticalLabelPosition=bottom;verticalAlign=top;outlineConnect=0;align=center;shape=mxgraph.office.security.certificate;" vertex="1" parent="1">
          <mxGeometry x="756.5" y="-481.5" width="39" height="33" as="geometry"/>
        </mxCell>
        <mxCell id="_gCGdVEYh_d5aVmEuGKs-59" value="ORG-Worker-Cert" style="pointerEvents=1;shadow=0;dashed=0;html=1;strokeColor=none;fillColor=#FFBC2C;labelPosition=center;verticalLabelPosition=bottom;verticalAlign=top;outlineConnect=0;align=center;shape=mxgraph.office.security.certificate;" vertex="1" parent="1">
          <mxGeometry x="389" y="-549" width="39" height="33" as="geometry"/>
        </mxCell>
        <mxCell id="_gCGdVEYh_d5aVmEuGKs-60" value="CA ORG" style="pointerEvents=1;shadow=0;dashed=0;html=1;strokeColor=none;fillColor=#FFBC2C;labelPosition=right;verticalLabelPosition=middle;verticalAlign=middle;outlineConnect=0;align=left;shape=mxgraph.office.security.certificate;" vertex="1" parent="1">
          <mxGeometry x="726" y="-547.5" width="39" height="33" as="geometry"/>
        </mxCell>
        <mxCell id="_gCGdVEYh_d5aVmEuGKs-61" value="etcd" style="shape=cylinder;whiteSpace=wrap;html=1;boundedLbl=1;backgroundOutline=1;strokeColor=#d6b656;fillColor=#fff2cc;gradientColor=#ffd966;" vertex="1" parent="1">
          <mxGeometry x="569.5" y="-448.5" width="30" height="30" as="geometry"/>
        </mxCell>
        <mxCell id="_gCGdVEYh_d5aVmEuGKs-62" value="sql" style="shape=cylinder;whiteSpace=wrap;html=1;boundedLbl=1;backgroundOutline=1;strokeColor=#d6b656;fillColor=#fff2cc;gradientColor=#ffd966;" vertex="1" parent="1">
          <mxGeometry x="436.5" y="-888.5" width="30" height="30" as="geometry"/>
        </mxCell>
        <mxCell id="_gCGdVEYh_d5aVmEuGKs-63" value="etcd" style="shape=cylinder;whiteSpace=wrap;html=1;boundedLbl=1;backgroundOutline=1;strokeColor=#d6b656;fillColor=#fff2cc;gradientColor=#ffd966;" vertex="1" parent="1">
          <mxGeometry x="945" y="-579" width="55" height="50" as="geometry"/>
        </mxCell>
        <mxCell id="_gCGdVEYh_d5aVmEuGKs-64" value="The etcd cluster:&amp;nbsp;&lt;br&gt;persists all public certificates (keystore),&amp;nbsp;persists all trusted Roots (truststore),persists the config" style="text;html=1;align=left;whiteSpace=wrap;" vertex="1" parent="1">
          <mxGeometry x="1005" y="-579.5" width="330" height="56" as="geometry"/>
        </mxCell>
        <mxCell id="_gCGdVEYh_d5aVmEuGKs-65" value="&lt;font style=&quot;vertical-align: inherit&quot;&gt;&lt;font style=&quot;vertical-align: inherit&quot;&gt;&lt;font style=&quot;vertical-align: inherit&quot;&gt;&lt;font style=&quot;vertical-align: inherit&quot;&gt;Data Plane&lt;/font&gt;&lt;/font&gt;&lt;/font&gt;&lt;/font&gt;" style="rounded=1;whiteSpace=wrap;html=1;fillColor=none;verticalAlign=top;fontFamily=source sans pro;dashed=1;fontColor=#474E57;strokeColor=#474e57;align=left;labelPosition=center;verticalLabelPosition=middle;arcSize=2;" vertex="1" parent="1">
          <mxGeometry x="938.31" y="-377" width="700" height="267" as="geometry"/>
        </mxCell>
        <mxCell id="_gCGdVEYh_d5aVmEuGKs-66" value="https: API call" style="edgeStyle=orthogonalEdgeStyle;curved=1;rounded=0;orthogonalLoop=1;jettySize=auto;html=1;startArrow=none;startFill=0;endArrow=classic;endFill=1;" edge="1" parent="1" source="_gCGdVEYh_d5aVmEuGKs-67" target="_gCGdVEYh_d5aVmEuGKs-73">
          <mxGeometry x="-0.3333" relative="1" as="geometry">
            <mxPoint as="offset"/>
          </mxGeometry>
        </mxCell>
        <mxCell id="_gCGdVEYh_d5aVmEuGKs-67" value="inway" style="rounded=1;whiteSpace=wrap;html=1;fillColor=#dae8fc;strokeColor=#6c8ebf;" vertex="1" parent="1">
          <mxGeometry x="988.81" y="-211.5" width="120" height="60" as="geometry"/>
        </mxCell>
        <mxCell id="_gCGdVEYh_d5aVmEuGKs-68" value="nhp" style="edgeStyle=orthogonalEdgeStyle;curved=1;rounded=0;orthogonalLoop=1;jettySize=auto;html=1;startArrow=none;startFill=0;" edge="1" parent="1" source="_gCGdVEYh_d5aVmEuGKs-69">
          <mxGeometry relative="1" as="geometry">
            <mxPoint x="1663.31" y="-181.5" as="targetPoint"/>
          </mxGeometry>
        </mxCell>
        <mxCell id="_gCGdVEYh_d5aVmEuGKs-69" value="outway" style="rounded=1;whiteSpace=wrap;html=1;fillColor=#dae8fc;strokeColor=#6c8ebf;" vertex="1" parent="1">
          <mxGeometry x="1468.81" y="-211.5" width="120" height="60" as="geometry"/>
        </mxCell>
        <mxCell id="_gCGdVEYh_d5aVmEuGKs-70" value="nhp" style="edgeStyle=orthogonalEdgeStyle;curved=1;rounded=0;orthogonalLoop=1;jettySize=auto;html=1;startArrow=none;startFill=0;" edge="1" parent="1" target="_gCGdVEYh_d5aVmEuGKs-67">
          <mxGeometry relative="1" as="geometry">
            <mxPoint x="929.0023217773437" y="-181.5" as="sourcePoint"/>
          </mxGeometry>
        </mxCell>
        <mxCell id="_gCGdVEYh_d5aVmEuGKs-71" value="https: API call" style="edgeStyle=orthogonalEdgeStyle;curved=1;rounded=0;orthogonalLoop=1;jettySize=auto;html=1;startArrow=none;startFill=0;endArrow=classic;endFill=1;" edge="1" parent="1" source="_gCGdVEYh_d5aVmEuGKs-72" target="_gCGdVEYh_d5aVmEuGKs-69">
          <mxGeometry x="-0.3333" relative="1" as="geometry">
            <mxPoint as="offset"/>
          </mxGeometry>
        </mxCell>
        <mxCell id="_gCGdVEYh_d5aVmEuGKs-72" value="application" style="rounded=1;whiteSpace=wrap;html=1;fillColor=#e1d5e7;strokeColor=#9673a6;" vertex="1" parent="1">
          <mxGeometry x="1468.81" y="-331.5" width="120" height="60" as="geometry"/>
        </mxCell>
        <mxCell id="_gCGdVEYh_d5aVmEuGKs-73" value="API service" style="rounded=1;whiteSpace=wrap;html=1;fillColor=#e1d5e7;strokeColor=#9673a6;" vertex="1" parent="1">
          <mxGeometry x="988.81" y="-331.5" width="120" height="60" as="geometry"/>
        </mxCell>
        <mxCell id="_gCGdVEYh_d5aVmEuGKs-74" value="ORG-Inway-Cert" style="pointerEvents=1;shadow=0;dashed=0;html=1;strokeColor=none;fillColor=#FFBC2C;labelPosition=center;verticalLabelPosition=bottom;verticalAlign=top;outlineConnect=0;align=center;shape=mxgraph.office.security.certificate;" vertex="1" parent="1">
          <mxGeometry x="1089.31" y="-168" width="39" height="33" as="geometry"/>
        </mxCell>
        <mxCell id="_gCGdVEYh_d5aVmEuGKs-75" value="ORG-Outway-Cert" style="pointerEvents=1;shadow=0;dashed=0;html=1;strokeColor=none;fillColor=#FFBC2C;labelPosition=center;verticalLabelPosition=bottom;verticalAlign=top;outlineConnect=0;align=center;shape=mxgraph.office.security.certificate;" vertex="1" parent="1">
          <mxGeometry x="1449.31" y="-168" width="39" height="33" as="geometry"/>
        </mxCell>
        <mxCell id="_gCGdVEYh_d5aVmEuGKs-76" value="PKIO-Inway-Cert" style="pointerEvents=1;shadow=0;dashed=0;html=1;strokeColor=none;fillColor=#E75D66;labelPosition=center;verticalLabelPosition=bottom;verticalAlign=top;outlineConnect=0;align=center;shape=mxgraph.office.security.certificate;" vertex="1" parent="1">
          <mxGeometry x="969.31" y="-168" width="39" height="33" as="geometry"/>
        </mxCell>
        <mxCell id="_gCGdVEYh_d5aVmEuGKs-77" value="PKIO-Outway-Cert" style="pointerEvents=1;shadow=0;dashed=0;html=1;strokeColor=none;fillColor=#E75D66;labelPosition=center;verticalLabelPosition=bottom;verticalAlign=top;outlineConnect=0;align=center;shape=mxgraph.office.security.certificate;" vertex="1" parent="1">
          <mxGeometry x="1569.31" y="-168" width="39" height="33" as="geometry"/>
        </mxCell>
        <mxCell id="_gCGdVEYh_d5aVmEuGKs-78" value="ORG-API-Service-Cert" style="pointerEvents=1;shadow=0;dashed=0;html=1;strokeColor=none;fillColor=#FFBC2C;labelPosition=center;verticalLabelPosition=top;verticalAlign=bottom;outlineConnect=0;align=center;shape=mxgraph.office.security.certificate;" vertex="1" parent="1">
          <mxGeometry x="1089.31" y="-348" width="39" height="33" as="geometry"/>
        </mxCell>
      </root>
    </mxGraphModel>
  </diagram>
</mxfile>
