<mxfile host="app.diagrams.net" modified="2023-07-19T07:51:57.761Z" agent="Mozilla/5.0 (Macintosh; Intel Mac OS X 10_15_7) AppleWebKit/605.1.15 (KHTML, like Gecko) Version/16.5.2 Safari/605.1.15" etag="daO42luA1uw7jfFklWrI" version="21.6.3" type="device">
  <diagram name="Page-1" id="wv11gRvh9nXSD3CiD2J5">
    <mxGraphModel dx="1026" dy="691" grid="1" gridSize="10" guides="1" tooltips="1" connect="1" arrows="1" fold="1" page="1" pageScale="1" pageWidth="827" pageHeight="1169" math="0" shadow="0">
      <root>
        <mxCell id="0" />
        <mxCell id="1" parent="0" />
        <mxCell id="bKLp897wfc3CARhSRU7k-11" style="rounded=0;orthogonalLoop=1;jettySize=auto;html=1;exitX=0.75;exitY=1;exitDx=0;exitDy=0;entryX=0.5;entryY=0;entryDx=0;entryDy=0;fillColor=#ffe6cc;strokeColor=#d79b00;strokeWidth=3;endArrow=none;endFill=0;" edge="1" parent="1" source="bKLp897wfc3CARhSRU7k-13" target="bKLp897wfc3CARhSRU7k-19">
          <mxGeometry relative="1" as="geometry" />
        </mxCell>
        <mxCell id="bKLp897wfc3CARhSRU7k-13" value="Gemeente Stijns" style="rounded=1;whiteSpace=wrap;html=1;fontSize=14;" vertex="1" parent="1">
          <mxGeometry x="320" y="80" width="200" height="80" as="geometry" />
        </mxCell>
        <mxCell id="bKLp897wfc3CARhSRU7k-14" style="orthogonalLoop=1;jettySize=auto;html=1;exitX=0.5;exitY=0;exitDx=0;exitDy=0;entryX=0.25;entryY=1;entryDx=0;entryDy=0;strokeColor=#d79b00;rounded=1;fillColor=#ffe6cc;endArrow=none;endFill=0;strokeWidth=3;" edge="1" parent="1" source="bKLp897wfc3CARhSRU7k-18" target="bKLp897wfc3CARhSRU7k-13">
          <mxGeometry relative="1" as="geometry" />
        </mxCell>
        <mxCell id="bKLp897wfc3CARhSRU7k-16" style="edgeStyle=orthogonalEdgeStyle;rounded=0;orthogonalLoop=1;jettySize=auto;html=1;exitX=1;exitY=0.5;exitDx=0;exitDy=0;entryX=0;entryY=0.5;entryDx=0;entryDy=0;endArrow=none;endFill=0;fillColor=#ffe6cc;strokeColor=#d79b00;strokeWidth=3;" edge="1" parent="1" source="bKLp897wfc3CARhSRU7k-18" target="bKLp897wfc3CARhSRU7k-19">
          <mxGeometry relative="1" as="geometry" />
        </mxCell>
        <mxCell id="bKLp897wfc3CARhSRU7k-18" value="Vergunningsoftware BV" style="rounded=1;whiteSpace=wrap;html=1;fontSize=14;" vertex="1" parent="1">
          <mxGeometry x="160" y="240" width="200" height="80" as="geometry" />
        </mxCell>
        <mxCell id="bKLp897wfc3CARhSRU7k-19" value="Rijksdienst voor Realistische Demo&#39;s" style="rounded=1;whiteSpace=wrap;html=1;fontSize=14;" vertex="1" parent="1">
          <mxGeometry x="480" y="240" width="200" height="80" as="geometry" />
        </mxCell>
        <mxCell id="bKLp897wfc3CARhSRU7k-20" value="Contract" style="text;html=1;align=center;verticalAlign=middle;resizable=0;points=[];autosize=1;strokeColor=none;fillColor=none;" vertex="1" parent="1">
          <mxGeometry x="385" y="200" width="70" height="30" as="geometry" />
        </mxCell>
      </root>
    </mxGraphModel>
  </diagram>
</mxfile>
