[
    {
        "kenteken": "RT774D",
        "burgerservicenummer": "663678651",
        "datum_tenaamstelling": "29-01-2018",
        "eerste_kleur": "GRIJS",
        "europese_voertuigcategorie": "M1",
        "handelsbenaming": "MAZDA 3",
        "merk": "MAZDA",
        "voertuigsoort": "Personenauto"
    },
    {
        "kenteken": "KN958B",
        "burgerservicenummer": "425749708",
        "datum_tenaamstelling": "16-11-2016",
        "eerste_kleur": "GRIJS",
        "europese_voertuigcategorie": "M1",
        "handelsbenaming": "TOYOTA YARIS HYBRID",
        "merk": "TOYOTA",
        "voertuigsoort": "Personenauto"
    },
    {
        "kenteken": "81HZFB",
        "burgerservicenummer": "248496086",
        "datum_tenaamstelling": "17-04-2009",
        "eerste_kleur": "GRIJS",
        "europese_voertuigcategorie": "M1",
        "handelsbenaming": "CORSA-C",
        "merk": "OPEL",
        "voertuigsoort": "Personenauto"
    },
    {
        "kenteken": "GJ713R",
        "burgerservicenummer": "187788248",
        "datum_tenaamstelling": "15-06-2015",
        "eerste_kleur": "GRIJS",
        "europese_voertuigcategorie": "M1",
        "handelsbenaming": "HEARSE",
        "merk": "CADILLAC",
        "voertuigsoort": "Personenauto"
    },
    {
        "kenteken": "50HSZS",
        "burgerservicenummer": "581536630",
        "datum_tenaamstelling": "13-07-2017",
        "eerste_kleur": "BLAUW",
        "europese_voertuigcategorie": "M1",
        "handelsbenaming": "AGILA",
        "merk": "OPEL",
        "voertuigsoort": "Personenauto"
    },
    {
        "kenteken": "KS98DN",
        "burgerservicenummer": "750461986",
        "datum_tenaamstelling": "06-11-2000",
        "eerste_kleur": "BLAUW",
        "europese_voertuigcategorie": "M1",
        "handelsbenaming": "SOVEREIGN HE",
        "merk": "JAGUAR",
        "voertuigsoort": "Personenauto"
    }
]
