{
  "extends": [
    "config:base",
    ":semanticCommits",
    ":semanticCommitTypeAll(build)",
    ":semanticCommitScopeDisabled",
    "schedule:nonOfficeHours"
  ],
  "automerge": true,
  "automergeType": "branch",
  "packageRules": [
    {
      "groupName": "Python - v3.11.3 does not work for the parkeerrechten-api",
      "managers": ["docker"],
      "packageNames": ["python"],
      "allowedVersions": "3.10.12"
    }
  ]
}
