{
    "$id": "https://hhb-development.nl/schemas/department.schema.json",
    "type": "object",
    "properties": {
        "uuid": {"type": "string","format": "uuid"},
        "name": {"type": "string", "minLength": 1},
        "addresses":  {
            "type": "array",
            "items": {
                "$ref": "/schemas/address.schema.json"
            },
            "default": [],
            "minItems": 0
        },
        "accounts":  {
            "type": "array",
            "items": {
                "$ref": "/schemas/account.schema.json"
            },
            "default": [],
            "minItems": 0
        }
    },
    "required": ["uuid", "name"]
}