{
    "configurations": [{
            "id": "derdengeldenrekening_rekeninghouder",
            "value": "Gemeente Sloothuizen Huishoudboekje"
        },{
            "id": "derdengeldenrekening_iban",
            "value": "NL36ABNA5632579034"
        },{
            "id": "derdengeldenrekening_bic",
            "value": "ABNANL2A"
        }
    ],
    "categories": [{
        "id": 1,
        "naam": "Inkomsten",
        "grootboekrekening_id": "WOmzNooNdo",
        "credit": true
    },{
        "id": 2,
        "naam": "Toeslagen",
        "grootboekrekening_id": "WOvbOrsOsuSro",
        "credit": true
    },{
        "id": 3,
        "naam": "Uitkeringen",
        "grootboekrekening_id": "WOvbOrsOsuSov",
        "credit": true
    },{
        "id": 4,
        "naam": "Subsidies",
        "grootboekrekening_id": "WOvbOrsOsuSpo",
        "credit": true
    },{
        "id": 5,
        "naam": "Huur of hypotheek",
        "grootboekrekening_id": "WBedHuiBeh",
        "credit": false
    },{
        "id": 6,
        "naam": "Gas en elektriciteit",
        "grootboekrekening_id": "WBedHuiGweElk",
        "credit": false
    },{
        "id": 7,
        "naam": "Water",
        "grootboekrekening_id": "WBedHuiGweWat",
        "credit": false
    },{
        "id": 8,
        "naam": "Lokale lasten",
        "grootboekrekening_id": "WBedHuiMez",
        "credit": false
    },{
        "id": 9,
        "naam": "Telefoon, internet en televisie",
        "grootboekrekening_id": "WBedKanTef",
        "credit": false
    },{
        "id": 10,
        "naam": "Verzekeringen",
        "grootboekrekening_id": "WBedAssOva",
        "credit": false
    },{
        "id": 11,
        "naam": "Privé-opname",
        "grootboekrekening_id": "BEivKapProPok",
        "credit": false
    }
],
    "organisations": [],
    "civilians": []
}