{
    "$id": "https://hhb-development.nl/schemas/base",
    "type": "object",
    "properties": {
        "configurations": {
            "type": "array",
            "items": {
                "$ref": "/schemas/configuration.schema.json"
            },
            "default": [],
            "minItems": 0
        },
        "categories": {
            "type": "array",
            "items": {
                "$ref": "/schemas/category.schema.json"
            },
            "default": [],
            "minItems": 0
        },
        "organisations": {
            "type": "array",
            "items": {
                "$ref": "/schemas/organisation.schema.json"
            },
            "default": [],
            "minItems": 0
        },
        "civilians": {
            "type": "array",
            "items": {
                "$ref": "/schemas/civilian.schema.json"
            },
            "default": [],
            "minItems": 0
        }
    },
    "required": ["configurations", "categories", "organisations", "civilians"]
}