module gitlab.com/commonground/haven/haven/haven/cli

go 1.22.2

replace k8s.io/api => k8s.io/api v0.30.0

replace k8s.io/apiextensions-apiserver => k8s.io/apiextensions-apiserver v0.30.0

replace k8s.io/apimachinery => k8s.io/apimachinery v0.30.0

replace k8s.io/apiserver => k8s.io/apiserver v0.30.3

replace k8s.io/cli-runtime => k8s.io/cli-runtime v0.30.0

replace k8s.io/client-go => k8s.io/client-go v0.30.0

replace k8s.io/cloud-provider => k8s.io/cloud-provider v0.30.3

replace k8s.io/cluster-bootstrap => k8s.io/cluster-bootstrap v0.30.3

replace k8s.io/code-generator => k8s.io/code-generator v0.30.3

replace k8s.io/component-base => k8s.io/component-base v0.30.3

replace k8s.io/component-helpers => k8s.io/component-helpers v0.30.3

replace k8s.io/controller-manager => k8s.io/controller-manager v0.30.3

replace k8s.io/cri-api => k8s.io/cri-api v0.30.3

replace k8s.io/csi-translation-lib => k8s.io/csi-translation-lib v0.30.3

replace k8s.io/kube-aggregator => k8s.io/kube-aggregator v0.30.3

replace k8s.io/kube-controller-manager => k8s.io/kube-controller-manager v0.30.3

replace k8s.io/kube-proxy => k8s.io/kube-proxy v0.30.3

replace k8s.io/kube-scheduler => k8s.io/kube-scheduler v0.30.3

replace k8s.io/kubectl => k8s.io/kubectl v0.30.0

replace k8s.io/kubelet => k8s.io/kubelet v0.30.3

replace k8s.io/legacy-cloud-providers => k8s.io/legacy-cloud-providers v0.30.3

replace k8s.io/metrics => k8s.io/metrics v0.30.3

replace k8s.io/mount-utils => k8s.io/mount-utils v0.30.3

replace k8s.io/sample-apiserver => k8s.io/sample-apiserver v0.30.3

replace k8s.io/sample-cli-plugin => k8s.io/sample-cli-plugin v0.30.3

replace k8s.io/sample-controller => k8s.io/sample-controller v0.30.3

replace k8s.io/dynamic-resource-allocation => k8s.io/dynamic-resource-allocation v0.30.3

replace k8s.io/kms => k8s.io/kms v0.30.3

replace k8s.io/pod-security-admission => k8s.io/pod-security-admission v0.30.3

replace k8s.io/endpointslice => k8s.io/endpointslice v0.30.3

require (
	github.com/Masterminds/semver/v3 v3.2.1
	github.com/gookit/color v1.5.4
	github.com/lunixbochs/vtclean v1.0.0
	github.com/olekukonko/tablewriter v0.0.5
	github.com/spf13/cobra v1.8.1
	github.com/stretchr/testify v1.9.0
	k8s.io/api v0.30.1
	k8s.io/apiextensions-apiserver v0.30.1
	k8s.io/apimachinery v0.30.1
	k8s.io/cli-runtime v0.30.0
	k8s.io/client-go v0.30.1
	k8s.io/kubectl v0.30.0
	k8s.io/kubernetes v1.30.0
	sigs.k8s.io/controller-runtime v0.18.4
	sigs.k8s.io/yaml v1.4.0
)

require (
	github.com/Azure/go-ansiterm v0.0.0-20210617225240-d185dfc1b5a1 // indirect
	github.com/davecgh/go-spew v1.1.1 // indirect
	github.com/emicklei/go-restful/v3 v3.11.0 // indirect
	github.com/evanphx/json-patch v5.6.0+incompatible // indirect
	github.com/go-errors/errors v1.4.2 // indirect
	github.com/go-logr/logr v1.4.1 // indirect
	github.com/go-openapi/jsonpointer v0.19.6 // indirect
	github.com/go-openapi/jsonreference v0.20.2 // indirect
	github.com/go-openapi/swag v0.22.3 // indirect
	github.com/gogo/protobuf v1.3.2 // indirect
	github.com/golang/protobuf v1.5.4 // indirect
	github.com/google/btree v1.1.2 // indirect
	github.com/google/gnostic-models v0.6.8 // indirect
	github.com/google/gofuzz v1.2.0 // indirect
	github.com/google/shlex v0.0.0-20191202100458-e7afc7fbc510 // indirect
	github.com/google/uuid v1.3.0 // indirect
	github.com/gorilla/websocket v1.5.0 // indirect
	github.com/gregjones/httpcache v0.0.0-20190611155906-901d90724c79 // indirect
	github.com/imdario/mergo v0.3.13 // indirect
	github.com/inconshreveable/mousetrap v1.1.0 // indirect
	github.com/josharian/intern v1.0.0 // indirect
	github.com/json-iterator/go v1.1.12 // indirect
	github.com/liggitt/tabwriter v0.0.0-20181228230101-89fcab3d43de // indirect
	github.com/mailru/easyjson v0.7.7 // indirect
	github.com/mattn/go-runewidth v0.0.14 // indirect
	github.com/moby/spdystream v0.2.0 // indirect
	github.com/moby/term v0.0.0-20221205130635-1aeaba878587 // indirect
	github.com/modern-go/concurrent v0.0.0-20180306012644-bacd9c7ef1dd // indirect
	github.com/modern-go/reflect2 v1.0.2 // indirect
	github.com/monochromegane/go-gitignore v0.0.0-20200626010858-205db1a8cc00 // indirect
	github.com/munnerz/goautoneg v0.0.0-20191010083416-a7dc8b61c822 // indirect
	github.com/mxk/go-flowrate v0.0.0-20140419014527-cca7078d478f // indirect
	github.com/peterbourgon/diskv v2.0.1+incompatible // indirect
	github.com/pkg/errors v0.9.1 // indirect
	github.com/pmezard/go-difflib v1.0.0 // indirect
	github.com/rivo/uniseg v0.4.3 // indirect
	github.com/spf13/pflag v1.0.5 // indirect
	github.com/xlab/treeprint v1.2.0 // indirect
	github.com/xo/terminfo v0.0.0-20220910002029-abceb7e1c41e // indirect
	go.starlark.net v0.0.0-20230525235612-a134d8f9ddca // indirect
	golang.org/x/net v0.23.0 // indirect
	golang.org/x/oauth2 v0.12.0 // indirect
	golang.org/x/sync v0.6.0 // indirect
	golang.org/x/sys v0.18.0 // indirect
	golang.org/x/term v0.18.0 // indirect
	golang.org/x/text v0.14.0 // indirect
	golang.org/x/time v0.3.0 // indirect
	google.golang.org/appengine v1.6.7 // indirect
	google.golang.org/protobuf v1.33.0 // indirect
	gopkg.in/inf.v0 v0.9.1 // indirect
	gopkg.in/yaml.v2 v2.4.0 // indirect
	gopkg.in/yaml.v3 v3.0.1 // indirect
	k8s.io/klog/v2 v2.120.1 // indirect
	k8s.io/kube-openapi v0.0.0-20240228011516-70dd3763d340 // indirect
	k8s.io/utils v0.0.0-20230726121419-3b25d923346b // indirect
	sigs.k8s.io/json v0.0.0-20221116044647-bc3834ca7abd // indirect
	sigs.k8s.io/kustomize/api v0.13.5-0.20230601165947-6ce0bf390ce3 // indirect
	sigs.k8s.io/kustomize/kyaml v0.14.3-0.20230601165947-6ce0bf390ce3 // indirect
	sigs.k8s.io/structured-merge-diff/v4 v4.4.1 // indirect
)
