<svg width="1600" height="1600" viewBox="0 0 1600 1600" fill="none" xmlns="http://www.w3.org/2000/svg">
<g clip-path="url(#clip0_302_2)">
<path d="M1591.73 731.427L1341.73 506.427C1336.92 502.093 1330.61 499.796 1324.13 500.02C1317.66 500.249 1311.53 502.979 1307.03 507.635C1302.53 512.296 1300.01 518.52 1300.01 524.999V649.999H1150.01C1136.75 649.999 1124.03 644.733 1114.66 635.353C1105.27 625.979 1100.01 613.26 1100.01 599.999C1100.01 533.696 1073.67 470.108 1026.79 423.225C979.901 376.34 916.313 350.001 850.013 350.001C783.713 350.001 720.122 376.34 673.239 423.225C626.354 470.111 600.015 533.699 600.015 599.999V899.999C600.015 917.863 590.484 934.368 575.015 943.302C559.546 952.234 540.485 952.234 525.015 943.302C509.546 934.369 500.015 917.864 500.015 899.999C499.942 833.718 473.578 770.171 426.713 723.305C379.843 676.441 316.297 650.076 250.019 650.003H25.0192C18.3889 650.003 12.0296 652.638 7.34185 657.326C2.65439 662.013 0.0189209 668.373 0.0189209 675.003V925.003C0.0189209 931.633 2.65439 937.993 7.34185 942.68C12.0293 947.368 18.3888 950.003 25.0192 950.003H250.019C263.28 950.003 275.998 955.269 285.374 964.649C294.754 974.024 300.019 986.742 300.019 1000C300.019 1066.31 326.358 1129.89 373.243 1176.78C420.129 1223.66 483.717 1250 550.017 1250C616.317 1250 679.907 1223.66 726.79 1176.78C773.675 1129.89 800.014 1066.3 800.014 1000V700.003C800.014 682.139 809.545 665.634 825.014 656.701C840.483 647.768 859.544 647.768 875.014 656.701C890.483 665.633 900.014 682.138 900.014 700.003C900.087 766.285 926.451 829.831 973.317 876.697C1020.19 923.561 1083.73 949.926 1150.01 949.999H1300.01V1075C1300.01 1079.83 1301.41 1084.56 1304.05 1088.6C1306.68 1092.66 1310.42 1095.86 1314.83 1097.82C1318.04 1099.26 1321.5 1100 1325.01 1100C1331.19 1100 1337.15 1097.71 1341.73 1093.57L1591.73 868.572C1597 863.833 1600.01 857.083 1600.01 849.999V749.999C1600.01 742.916 1597 736.167 1591.73 731.427ZM250 700C303.027 700.057 353.86 721.151 391.36 758.645C428.86 796.14 449.948 846.973 450.005 900.005C450.005 935.729 469.063 968.745 500.005 986.609C530.948 1004.47 569.063 1004.47 600.005 986.609C630.948 968.745 650.005 935.729 650.005 900.005V600.005C650.005 528.552 688.125 462.525 750.005 426.805C811.885 391.076 888.125 391.076 950.005 426.805C1011.89 462.529 1050.01 528.555 1050.01 600.005C1050.01 626.527 1060.54 651.964 1079.3 670.713C1098.05 689.468 1123.49 700.005 1150.01 700.005H1325.01C1331.64 700.005 1338 697.37 1342.68 692.682C1347.37 687.995 1350.01 681.635 1350.01 675.005V581.13L1537.63 750.01L1350.01 918.89V825.016C1350.01 818.385 1347.37 812.026 1342.68 807.338C1338 802.651 1331.64 800.015 1325.01 800.015H1150.01C1096.98 799.958 1046.15 778.865 1008.65 741.37C971.145 703.875 950.057 653.042 950 600.01C950 564.286 930.943 531.27 900 513.406C869.057 495.546 830.943 495.546 800 513.406C769.057 531.27 750 564.286 750 600.01V900.01C750 971.463 711.88 1037.49 650 1073.21C588.12 1108.94 511.88 1108.94 450 1073.21C388.12 1037.49 350 971.461 350 900.01C350 873.489 339.464 848.051 320.708 829.302C301.959 810.547 276.52 800.01 250 800.01H50V700.01L250 700ZM250 900H50V850H250C263.26 850 275.979 855.266 285.355 864.645C294.735 874.02 300 886.739 300 900V913.901C284.864 904.901 267.604 900.104 250 900ZM550 1200C507.833 1199.92 466.771 1186.54 432.656 1161.77C398.541 1136.98 373.115 1102.07 360 1062C391.292 1098.86 432.631 1125.82 478.973 1139.6C525.323 1153.39 574.676 1153.39 621.027 1139.6C667.371 1125.82 708.709 1098.86 740 1062C726.885 1102.07 701.459 1136.98 667.344 1161.77C633.229 1186.54 592.167 1199.92 550 1200ZM850 600C832.396 600.104 815.136 604.901 800 613.901V600C800 582.136 809.531 565.631 825 556.697C840.469 547.765 859.531 547.765 875 556.697C890.469 565.63 900 582.135 900 600C900 604.823 900.448 609.552 900.724 614.303C885.421 605.032 867.891 600.089 850 600ZM1150 900C1107.83 899.922 1066.77 886.541 1032.66 861.765C998.541 836.984 973.115 802.072 960 762C983.401 789.563 1012.51 811.708 1045.32 826.901C1078.12 842.099 1113.84 849.98 1150 850H1300V900H1150ZM1350 1018.87V986.125L1550 806.125V838.875L1350 1018.87Z" fill="#0B71A1"/>
<path d="M1350 1018.87V986.125L1550 806.125V838.875L1350 1018.87Z" fill="#004B6F"/>
<path d="M1150 900C1107.83 899.922 1066.77 886.541 1032.66 861.765C998.541 836.984 973.115 802.072 960 762C983.401 789.563 1012.51 811.708 1045.32 826.901C1078.12 842.099 1113.84 849.98 1150 850H1300V900H1150Z" fill="#004B6F"/>
<path d="M550 1200C507.833 1199.92 466.771 1186.54 432.656 1161.77C398.541 1136.98 373.115 1102.07 360 1062C391.292 1098.86 432.631 1125.82 478.973 1139.6C525.323 1153.39 574.676 1153.39 621.027 1139.6C667.371 1125.82 708.709 1098.86 740 1062C726.885 1102.07 701.459 1136.98 667.344 1161.77C633.229 1186.54 592.167 1199.92 550 1200Z" fill="#004B6F"/>
<path d="M850 600C832.396 600.104 815.136 604.901 800 613.901V600C800 582.136 809.531 565.631 825 556.697C840.469 547.765 859.531 547.765 875 556.697C890.469 565.63 900 582.135 900 600C900 604.823 900.448 609.552 900.724 614.303C885.421 605.032 867.891 600.089 850 600Z" fill="#004B6F"/>
<path d="M250 900H50V850H250C263.26 850 275.979 855.266 285.355 864.645C294.735 874.02 300 886.739 300 900V913.901C284.864 904.901 267.604 900.104 250 900Z" fill="#004B6F"/>
</g>
<defs>
<clipPath id="clip0_302_2">
<rect width="1600" height="1600" fill="white"/>
</clipPath>
</defs>
</svg>
