<?xml version="1.0" encoding="UTF-8"?>
<svg width="48px" height="48px" viewBox="0 0 48 48" version="1.1" xmlns="http://www.w3.org/2000/svg" xmlns:xlink="http://www.w3.org/1999/xlink">
    <defs>
        <rect id="path-1" x="0" y="0" width="48" height="48"></rect>
    </defs>
    <g id="Repository-placeholder" stroke="none" stroke-width="1" fill="none" fill-rule="evenodd">
        <mask id="mask-2" fill="white">
            <use href="#path-1"></use>
        </mask>
        <use id="Rectangle" fill="#E0E4EA" href="#path-1"></use>
        <polygon id="Rectangle-Copy-3" fill="#FFFFFF" opacity="0.5" mask="url(#mask-2)" transform="translate(11.942424, 21.529969) scale(-1, 1) translate(-11.942424, -21.529969) " points="23.8181818 1.06239309e-12 23.8181818 43.0599375 0.0666666667 1.0658141e-14"></polygon>
        <polygon id="Rectangle-Copy-2" fill="#000000" opacity="0.100000001" mask="url(#mask-2)" transform="translate(33.408593, 38.127660) scale(-1, 1) translate(-33.408593, -38.127660) " points="18.8171862 28.2553191 48.0666667 48 18.7505196 48"></polygon>
        <path d="M24.9090909,33.2093023 L24.9090909,36 L21.6363636,33.7674419 L18.3636364,36 L18.3636364,33.2093023 L17.8181818,33.2093023 C15.7094582,33.2093023 14,31.4600893 14,29.3023256 L14,15.3488372 C14,13.4993255 15.4652499,12 17.2727273,12 L32.5454545,12 C33.147947,12 33.6363636,12.4997752 33.6363636,13.1162791 L33.6363636,32.0930233 C33.6363636,32.7095272 33.147947,33.2093023 32.5454545,33.2093023 L24.9090909,33.2093023 Z M24.9090909,30.5454545 L31.4545455,30.5454545 L31.4545455,27.2727273 L17.8181818,27.2727273 C16.9144431,27.2727273 16.1818182,28.0053522 16.1818182,28.9090909 C16.1818182,29.8128296 16.9144431,30.5454545 17.8181818,30.5454545 L18.3636364,30.5454545 L18.3636364,28.3636364 L24.9090909,28.3636364 L24.9090909,30.5454545 Z M31.4545455,25.0528604 L31.4545455,14.1818182 L17.2727273,14.1818182 L17.2727273,25.0909091 C17.4534111,25.0653629 17.6356886,25.0526479 17.8181818,25.0528604 L31.4545455,25.0528604 L31.4545455,25.0528604 Z M18.3636364,15.2727273 L20.5454545,15.2727273 L20.5454545,17.4545455 L18.3636364,17.4545455 L18.3636364,15.2727273 Z M18.3636364,18.5454545 L20.5454545,18.5454545 L20.5454545,20.7272727 L18.3636364,20.7272727 L18.3636364,18.5454545 Z M18.3636364,21.8181818 L20.5454545,21.8181818 L20.5454545,24 L18.3636364,24 L18.3636364,21.8181818 Z" id="Shape" fill="#212121" fill-rule="nonzero" opacity="0.699999988" mask="url(#mask-2)"></path>
    </g>
</svg>
