{
  "$schema": "https://docs.renovatebot.com/renovate-schema.json",
  "description": "Default preset for use with developer.overheid.nl projects",
  "extends": [
    "config:base",
    "group:allNonMajor"
  ],
  "dependencyDashboard": true,
  "dependencyDashboardApproval": true,
  "postUpdateOptions": [
    "gomodTidy",
    "gomodUpdateImportPaths",
    "helmUpdateSubChartArchives"
  ],
  "major": {
    "dependencyDashboardApproval": true
  },
  "gitlabci": {
    "fileMatch": [
      "^\\.gitlab/ci/.*\\.yml$"
    ]
  },
  "customManagers": [
    {
      "customType": "regex",
      "description": "Update _VERSION variables in Dockerfiles",
      "fileMatch": ["(^|/|\\.)Dockerfile$"],
      "matchStrings": [
        "# renovate: datasource=(?<datasource>[a-z-]+?) depName=(?<depName>.+?)(?: (?:packageName|lookupName)=(?<packageName>.+?))?(?: versioning=(?<versioning>[a-z0-9-]+?))?\\s(?:ENV|ARG) .+?_VERSION=(?<currentValue>.+?)\\s"
      ],
      "versioningTemplate": "{{#if versioning}}{{versioning}}{{else}}semver{{/if}}"
    },
    {
      "customType": "regex",
      "description": "Update appVersion in Helm Chart files",
      "fileMatch": ["^helm\/.+\/Chart\\.yaml$"],
      "matchStrings": [
        "# renovate: datasource=(?<datasource>[a-z-]+?) depName=(?<depName>.+?)\\sappVersion: \"(?<currentValue>.+?)\"\\s"
      ],
      "extractVersionTemplate": "^v?(?<version>.*)$"
    }
  ]
}
