<svg width="254" height="299" viewBox="0 0 254 299" fill="none" xmlns="http://www.w3.org/2000/svg">
<path fill-rule="evenodd" clip-rule="evenodd" d="M186.291 137.33C172.265 137.33 160.884 125.993 160.884 111.984C160.884 97.9906 172.265 86.6372 186.291 86.6372C200.319 86.6372 211.698 97.9906 211.698 111.984C211.698 125.993 200.319 137.33 186.291 137.33ZM42.3171 111.984C42.3171 97.9906 53.6978 86.6372 67.7242 86.6372C81.7515 86.6372 93.1313 97.9906 93.1313 111.984C93.1313 125.993 81.7515 137.33 67.7242 137.33C53.6978 137.33 42.3171 125.993 42.3171 111.984ZM127 0C-0.0367355 0 1.22733e-08 118.282 1.22733e-08 118.282V298.737L31.7732 256.538L63.4913 298.737L95.213 256.538L126.937 298.737L158.66 256.538L190.385 298.737L222.135 256.538L253.999 298.737V118.282C253.999 118.282 254.036 0 127 0Z" fill="#6B747C"/>
</svg>
