module headless

go 1.17

require (
	github.com/jessevdk/go-flags v1.5.0
	gitlab.com/commonground/blauwe-knop/health-checker v0.0.2
)

require golang.org/x/sys v0.0.0-20210320140829-1e4c9ba3b0c4 // indirect
