{
  "CN": "Gemeente Zeewolde Root CA",
  "key": {
    "algo": "rsa",
    "size": 4096
  },
  "names": [
    {
      "O": "Gemeente Zeewolde",
      "C": "NL"
    }
  ],
  "ca": {
    "expiry": "131400h"
  }
}
