{
  "extends": [
    "config:base",
    ":semanticCommits",
    ":semanticCommitTypeAll(build)",
    ":semanticCommitScopeDisabled",
    "schedule:nonOfficeHours"
  ],
  "automerge": true,
  "automergeType": "pr",
  "dependencyDashboard": true,
  "postUpdateOptions": [
    "gomodTidy"
  ],
  "gitlabci": {
    "fileMatch": [
      "^\\.gitlab/ci/.*\\.yml$"
    ]
  },
  "gomod": {
    "major": {
      "dependencyDashboardApproval": true
    }
  },
  "ignoreDeps": [],
  "packageRules": []
}
