@startuml
title Variant 2: Create a debt request at the registrator
actor User
participant App
participant Browser
participant LoginPage
participant SessionProcess
participant DebtRequestProcess
database DebtRequestRegister
database SessionRegister


User -> App: start aggregation wizard
App -> User: show aggregation wizard
User -> App: select source organizations
User -> App: select aggregator
User -> App: finish wizard
App -> Browser: Start browser with debt request
Browser -> DebtRequestProcess: HTTP GET: start debt request (include public key)
DebtRequestProcess -> DebtRequestRegister: store debt request
DebtRequestRegister -> DebtRequestProcess: return temporary debt request token
DebtRequestProcess -> Browser: store temporary debt request in cookie and show request summary
User -> Browser: click login button
group mocked DigiD login
Browser -> LoginPage: HTTP GET: start loginpage with callback URL
LoginPage -> Browser: return login page
Browser -> User: show login page
User -> Browser: login with DigiD
Browser -> DebtRequestProcess: HTTP GET: callback URL with BSN
end
DebtRequestProcess -> DebtRequestRegister: add BSN to debt request
DebtRequestRegister -> DebtRequestProcess: debt request updated
DebtRequestProcess -> Browser: return confirm request screen
Browser -> User: show consent page
User -> Browser: give consent
Browser -> DebtRequestProcess: HTTP GET: consent given
DebtRequestProcess -> DebtRequestRegister: store debt request
DebtRequestRegister -> DebtRequestProcess: debt request stored
DebtRequestProcess -> Browser: show confirmation
Browser -> User: show confirmation
User -> Browser: click back to app
Browser -> App: open app
!include create_session.plantuml
App -> DebtRequestProcess: HTTP GET: exchange sessionToken for debt request
DebtRequestProcess -> SessionRegister: get session
SessionRegister -> DebtRequestProcess: return session
DebtRequestProcess -> DebtRequestRegister: get debt request for public key of session
DebtRequestRegister -> DebtRequestProcess: return debt request 
DebtRequestProcess -> App: return debt request
App -> User: display debt request
@enduml
