"numid","pid","vid","lid","sid","postcode","straat","huisnummer","huisletter","huisnummertoevoeging","oppervlakte","woningequivalent","gebruiksdoelen","pand_bouwjaar","gemiddelde_woz_waarde_woning","gemiddelde_gemeente_woz","energieklasse","woning_type","pand_gebruiksoppervlakte","sbicode","eancount","group_id_2022","p6_gasm3_2022","p6_kwh_2022","kwh_leveringsrichting_2022","p6_grondbeslag_m2","p6_gas_aansluitingen_2022","point","buurtcode","buurtnaam","wijkcode","wijknaam","gemeentecode","gemeentenaam","provincienaam","provinciecode"
"1659200000010709","1659100000000712","1659010000010699",,,"5738PA",Broek,6,z,,71,1,{woonfunctie},1978,504,"340",D,Vrijstaande woning,"","",,"5738CX-5738PA",2685,8120,68,3852,24,POINT (5.562908433247009 51.52744793660527),BU16590309,Verspreide huizen Mariahout,WK165903,Wijk 03 Mariahout,GM1659,Laarbeek,Noord-Brabant,PV30
"0794200000083371","0794100000384084","0794010000127438",,,"5703BA",Trompstraat,35,,,76,1,{woonfunctie},1961,131,"275",B,Flatwoning (overig),"","",1,"5703AJ-5703BA",912,1616,100,700,36,POINT (5.681332998682511 51.475338943651366),BU07941101,Beisterveldse Broek,WK079411,Wijk 11 Helmond-Oost,GM0794,Helmond,Noord-Brabant,PV30
"0870200000038913","0870100000024640","0870010000003710",,,"4255HM",Irisstraat,4,,,111,1,{woonfunctie},1973,243,"320",,,,,1,"4255HM-4255HN",1443,3350,80,825,15,POINT (4.922518370025093 51.77658650426625),BU19590301,Nieuwendijk,WK195903,Nieuwendijk,GM1959,Altena,Noord-Brabant,PV30
"0518200000619762","0518100000298638","0518010000619763",,,"2548SW",Voorstondenstraat,24,,,92,1,{woonfunctie},2000,356,"311",,,,,1,"2548SW",1010,3323,90,1619,30,POINT (4.29757050028908 52.02775334397109),BU05184003,Parkbuurt oosteinde,WK051840,Wijk 40 Wateringse Veld,GM0518,'s-Gravenhage,Zuid-Holland,PV28
"0058200000218265","0058100000217140","0058010000218266",,,"9151KD",Beyertstrjitte,11,,,124,1,{woonfunctie},1969,141,"232",,,,,1,"9151KD",1432,3467,27,1148,18,POINT (5.9030334618809315 53.36992922458259),BU19700600,Holwerd,WK197006,Holwerd,GM1970,Noardeast-Fryslân,Fryslân,PV21
"0599200000283198","0599100000600409","0599010000025567",,,"3062SJ",'s-Gravenwetering,244,,,90,1,{woonfunctie},1961,247,"275",E,Appartement,"87.00","",,"3062SJ",0,2122,100,1855,0,POINT (4.526567613124849 51.92176069359572),BU05990842,Kralingen Oost,WK059908,Kralingen-Crooswijk,GM0599,Rotterdam,Zuid-Holland,PV28
"0362200000011546","0362100001059332","0362010002011546",,,"1186GN",Groenhof,389,,,59,1,{woonfunctie},1973,319,"470",C,Flatwoning (overig),"","",,"1186EW-1186GP",2234,4768,100,16033,54,POINT (4.868349858634335 52.289050993648885),BU03620905,Kringloopbuurt,WK036209,Groenelaan,GM0362,Amstelveen,Noord-Holland,PV27
"0344200000029466","0344100000016415","0344010000022985",,,"3562GZ",Stroyenborchdreef,233,,,106,1,{woonfunctie},1966,219,"392",F,Appartement,"102.77","",1,"3562GZ",81,2346,100,265,29,POINT (5.116525678975272 52.12066977631741),BU03440322,Neckardreef en omgeving,WK034403,Wijk 03 Overvecht,GM0344,Utrecht,Utrecht,PV26
"0599200000214169","0599100000611256","0599010000239610",,,"3082KK",Boergoensevliet,83,B,,122,1,{woonfunctie},1955,194,"275",G,Flatwoning (overig),"","",1,"3082KK",1458,2297,100,878,22,POINT (4.4668445133938555 51.88898903193004),BU05991574,Oud Charlois,WK059915,Charlois,GM0599,Rotterdam,Zuid-Holland,PV28
