"numid","pid","vid","lid","sid","postcode","straat","huisnummer","huisletter","huisnummertoevoeging","oppervlakte","woningequivalent","gebruiksdoelen","pand_bouwjaar","elabel_definitief","energieklasse","woning_type","pand_gebruiksoppervlakte","sbicode","eancount","group_id_2021","p6_gasm3_2021","p6_kwh_2021","kwh_leveringsrichting_2021","p6_grondbeslag_m2","p6_gas_aansluitingen_2021","point","buurtcode","buurtnaam","wijkcode","wijknaam","gemeentecode","gemeentenaam","provincienaam","provinciecode"
"0363200000297629","0363100012093948","0363010000839332",,,"1051GZ",Van Hallstraat,71,,"2",35,1,{woonfunctie},1912,C,C,Flatwoning (overig),"","",1,"1051GZ",963,2297,100,562,36,POINT (4.8709385029895405 52.38238989669739),BU03631404,Westerstaatsman,WK036314,Staatsliedenbuurt,GM0363,Amsterdam,Noord-Holland,PV27
"0268200000088051","0268100000084006","0268010000086715",,,"6541ZZ",Biezenstraat,180,,,149,1,{woonfunctie},2010,A,A,Rijwoning tussen,"","",1,"6541ZZ",1207,2641,85,1145,22,POINT (5.84239367433778 51.84958717567177),BU02680320,Biezen,WK026803,Wijk 03 Nijmegen-Oud-West,GM0268,Nijmegen,Gelderland,PV25
"0484200000014816","0484100000031893","0484010000014816",,,"2401JJ",Mandenvlechter,12,,,397,3,{sportfunctie},1983,,,,,,1,"2401JJ",2681,5848,93,2568,12,POINT (4.653533866694883 52.15255030952842),BU04840106,Ambachtenbuurt-Oost,WK048401,Oudshoorn,GM0484,Alphen aan den Rijn,Zuid-Holland,PV28
"1916200000035575","1916100000085468","1916010000077906",,,"2274TC",van Duvenvoordelaan,126,,,120,1,{woonfunctie},1938,,,,,,1,"2274TC",1400,2121,100,733,24,POINT (4.349581970833766 52.07394150200942),BU19161100,Voorburg Noord zuid,WK191611,Voorburg Noord,GM1916,Leidschendam-Voorburg,Zuid-Holland,PV28
"1581200000125566","1581100000017393","1581010000034504",,,"3951WX",Trompstaete,70,,,88,1,{woonfunctie},2003,B,B,Flatwoning (overig),"","",1,"3951WV-3951WX",793,2289,99,3464,60,POINT (5.376540273816129 52.06642655992487),BU15810400,Maarn-Dorp,WK158104,Maarn,GM1581,Utrechtse Heuvelrug,Utrecht,PV26
"0882200000015473","0882100000021771","0882010000015473",,,"6372MB",Houtbaan,77,,,115,1,{woonfunctie},1980,A,A,Rijwoning tussen,"","",1,"6372MB",1488,2794,88,1725,31,POINT (6.01907553728623 50.88552034297527),BU08820010,Mijnbuurt,WK088200,Wijk 00 Schaesberg,GM0882,Landgraaf,Limburg,PV31
"0267200000008775","0267100000011178","0267010000009440",,,"3862WJ",Luxoolseweg,20,b,,134,1,{woonfunctie},1980,,,,,,2,"3862WJ",3614,14186,100,6293,20,POINT (5.50018205080138 52.221969913655826),BU02670110,Luxool,WK026701,Nijkerk-stad,GM0267,Nijkerk,Gelderland,PV25
"0546200000062040","0546100000052107","0546010000062007",,,"2323LK",Vlietpark,10,,,48,0,{logiesfunctie},1971,,,,,,,"2322LA-2324AA",1146,6377,80,9246,70,POINT (4.482271612407039 52.13512852739331),BU05460505,Oostvliet,WK054605,Bos- en Gasthuisdistrict,GM0546,Leiden,Zuid-Holland,PV28
"0344200000140061","0344100000008972","0344010000132970",,,"3521BN",Croeselaan,205,,,97,1,{industriefunctie},1930,,,,,,1,"3521BN",1909,4309,100,1008,18,POINT (5.109393651186467 52.083849701614064),BU03440811,Dichterswijk,WK034408,Wijk 08 Zuidwest,GM0344,Utrecht,Utrecht,PV26
"0203200001017294",,,,"0203030001017295","3781NW",Hoge Boeschoterweg,96,,"143","35,72",0,,0,,,,,,,,,,,,,POINT (5.651382190849583 52.20417473285381),BU02035530,Buitengebied Voorthuizen,WK020355,Wijk 55 Voorthuizen,GM0203,Barneveld,Gelderland,PV25
