<?xml version="1.0" encoding="UTF-8"?>
<svg width="36" height="36" version="1.1" viewBox="0 0 9.525 9.525" xmlns="http://www.w3.org/2000/svg">
 <g transform="matrix(.866067 0 0 .866067 -1.21169 -2.97121)" stroke="#333" stroke-linejoin="round" stroke-miterlimit="7.32035">
  <g stroke-width="1.5">
   <g transform="matrix(.352778 0 0 -.352778 1.66365 9.39943)">
    <path d="m0 0h14.323v10.313l4.877-2.671v2.867l5.234-2.867v2.867l5.234-2.867c0.01-5.925 7e-3 -15.106 7e-3 -21.031h-29.675z" fill="none" stroke="#333" stroke-linecap="round" stroke-linejoin="round" stroke-miterlimit="7.32035" stroke-width="1.5"/>
   </g>
   <g transform="matrix(.352778 0 0 -.352778 3.47178 4.49397)">
    <path d="m0 0 0.383-13.905h-3.768l0.383 13.905" fill="none" stroke="#333" stroke-linecap="round" stroke-linejoin="round" stroke-miterlimit="7.32035" stroke-width="1.5"/>
   </g>
   <g transform="matrix(.352778 0 0 -.352778 4.58352 4.49397)">
    <path d="m0 0-0.383-13.905h3.768l-0.383 13.905" fill="none" stroke="#333" stroke-linecap="round" stroke-linejoin="round" stroke-miterlimit="7.32035" stroke-width="1.5"/>
   </g>
   <g transform="matrix(.352778 0 0 -.352778 6.71656 9.39943)">
    <path d="m0 0v-13.389" fill="none" stroke="#333" stroke-linecap="round" stroke-linejoin="round" stroke-miterlimit="7.32035" stroke-width="1.5"/>
   </g>
  </g>
  <g fill="none" stroke-linecap="round" stroke-width=".529167">
   <path d="m10.2219 11.6865h0.769055v0.6731h-0.769055z"/>
   <path d="m10.2219 10.2545h0.769055v0.672748h-0.769055z"/>
   <path d="m10.2219 8.82225h0.769055v0.672747h-0.769055z"/>
   <path d="m2.16484 3.7366h1.55504v0.672747h-1.55504z"/>
   <path d="m4.33548 3.7366h1.55504v0.672747h-1.55504z"/>
  </g>
 </g>
</svg>
