<?xml version="1.0" encoding="UTF-8" standalone="no"?>
<svg
   xmlns:dc="http://purl.org/dc/elements/1.1/"
   xmlns:cc="http://creativecommons.org/ns#"
   xmlns:rdf="http://www.w3.org/1999/02/22-rdf-syntax-ns#"
   xmlns:svg="http://www.w3.org/2000/svg"
   xmlns="http://www.w3.org/2000/svg"
   width="36"
   height="36"
   viewBox="0 0 9.5249998 9.5250003"
   version="1.1"
   id="svg4651">
  <defs
     id="defs4645" />
  <metadata
     id="metadata4648">
    <rdf:RDF>
      <cc:Work
         rdf:about="">
        <dc:format>image/svg+xml</dc:format>
        <dc:type
           rdf:resource="http://purl.org/dc/dcmitype/StillImage" />
        <dc:title></dc:title>
      </cc:Work>
    </rdf:RDF>
  </metadata>
  <g
     id="layer1">
    <g
       id="g5862"
       transform="matrix(0.84106911,0,0,0.84106911,-0.96473652,0.62625785)">
      <g
         id="g2502"
         transform="matrix(0.35277777,0,0,-0.35277777,2.9761182,4.4442717)"
         style="stroke:#333333;stroke-width:1.5;stroke-linejoin:round;stroke-miterlimit:7.32035;stroke-dasharray:none;stroke-opacity:1">
        <path
           d="m 0,0 c 1.196,1.091 5.609,1.901 10.872,1.901 5.246,0 9.648,-0.804 10.86,-1.89"
           style="fill:none;stroke:#333333;stroke-width:1.5;stroke-linecap:round;stroke-linejoin:round;stroke-miterlimit:7.32035;stroke-dasharray:none;stroke-opacity:1"
           id="path2504" />
      </g>
      <g
         id="g2506"
         transform="matrix(0.35277777,0,0,-0.35277777,2.4209165,5.1528787)"
         style="stroke:#333333;stroke-width:1.5;stroke-linejoin:round;stroke-miterlimit:7.32035;stroke-dasharray:none;stroke-opacity:1">
        <path
           d="m 0,0 c 2.776,-1.18 7.313,-1.947 12.44,-1.947 8.45,0 15.301,2.087 15.301,4.662 0,2.575 -6.851,4.662 -15.301,4.662 -8.451,0 -15.301,-2.087 -15.301,-4.662 l 2.569,-12.753 c 2.023,-1.027 5.079,-1.796 8.658,-2.133 l -0.009,5.925 c 1.298,-0.108 2.672,-0.167 4.083,-0.167 1.41,0 2.786,0.059 4.082,0.167 l -0.004,-5.926 c 3.581,0.337 6.639,1.106 8.664,2.134 l 2.559,12.753"
           style="fill:none;stroke:#333333;stroke-width:1.5;stroke-linecap:butt;stroke-linejoin:round;stroke-miterlimit:7.32035;stroke-dasharray:none;stroke-opacity:1"
           id="path2508" />
      </g>
      <g
         id="g2510"
         transform="matrix(0.35277777,0,0,-0.35277777,6.8034406,2.4898474)"
         style="stroke:#333333;stroke-width:1.5;stroke-linejoin:round;stroke-miterlimit:7.32035;stroke-dasharray:none;stroke-opacity:1">
        <path
           d="M 0,0 V 6.005 L 4.163,4.359 1.811,3.357"
           style="fill:none;stroke:#333333;stroke-width:1.5;stroke-linecap:round;stroke-linejoin:round;stroke-miterlimit:7.32035;stroke-dasharray:none;stroke-opacity:1"
           id="path2512" />
      </g>
      <g
         id="g2514"
         transform="matrix(0.35277777,0,0,-0.35277777,10.891219,3.1154548)"
         style="stroke:#333333;stroke-width:1.5;stroke-linejoin:round;stroke-miterlimit:7.32035;stroke-dasharray:none;stroke-opacity:1">
        <path
           d="M 0,0 V 5.887 L 4.163,4.242 1.81,3.239"
           style="fill:none;stroke:#333333;stroke-width:1.5;stroke-linecap:round;stroke-linejoin:round;stroke-miterlimit:7.32035;stroke-dasharray:none;stroke-opacity:1"
           id="path2516" />
      </g>
      <g
         id="g2518"
         transform="matrix(0.35277777,0,0,-0.35277777,2.7279046,3.0320846)"
         style="stroke:#333333;stroke-width:1.5;stroke-linejoin:round;stroke-miterlimit:7.32035;stroke-dasharray:none;stroke-opacity:1">
        <path
           d="M 0,0 V 5.65 L -4.163,4.006 -1.81,3.003"
           style="fill:none;stroke:#333333;stroke-width:1.5;stroke-linecap:round;stroke-linejoin:round;stroke-miterlimit:7.32035;stroke-dasharray:none;stroke-opacity:1"
           id="path2520" />
      </g>
      <g
         id="g2522"
         transform="matrix(0.35277777,0,0,-0.35277777,6.8094731,3.2243308)"
         style="stroke:#333333;stroke-width:1.5;stroke-linejoin:round;stroke-miterlimit:7.32035;stroke-dasharray:none;stroke-opacity:1">
        <path
           d="M 0,0 V -4.348"
           style="fill:none;stroke:#333333;stroke-width:1.5;stroke-linecap:round;stroke-linejoin:round;stroke-miterlimit:7.32035;stroke-dasharray:none;stroke-opacity:1"
           id="path2524" />
      </g>
      <g
         id="g2526"
         transform="matrix(0.35277777,0,0,-0.35277777,3.9620987,3.5164837)"
         style="stroke:#333333;stroke-width:1.5;stroke-linejoin:round;stroke-miterlimit:7.32035;stroke-dasharray:none;stroke-opacity:1">
        <path
           d="m 0,0 1.557,-4.462 0.469,0.143 c 1.382,0.378 3.56,0.622 6.015,0.622 2.785,0 5.226,-0.315 6.538,-0.782 l 1.564,4.46"
           style="fill:none;stroke:#333333;stroke-width:1.5;stroke-linecap:round;stroke-linejoin:round;stroke-miterlimit:7.32035;stroke-dasharray:none;stroke-opacity:1"
           id="path2528" />
      </g>
      <g
         id="g2530"
         transform="matrix(0.35277777,0,0,-0.35277777,4.6769658,5.0402456)"
         style="stroke:#333333;stroke-width:1.5;stroke-linejoin:round;stroke-miterlimit:7.32035;stroke-dasharray:none;stroke-opacity:1">
        <path
           d="M 0,0 C -0.167,-0.045 -0.327,-0.093 -0.47,-0.143 Z"
           style="fill:none;stroke:#333333;stroke-width:1.5;stroke-linecap:round;stroke-linejoin:round;stroke-miterlimit:7.32035;stroke-dasharray:none;stroke-opacity:1"
           id="path2532" />
      </g>
    </g>
  </g>
</svg>
