{
  "response": {
    "numFound": 247180,
    "start": 0,
    "maxScore": 9.486154,
    "numFoundExact": true,
    "docs": [
      {
        "bron": "Bestuurlijke Grenzen",
        "identificatie": "0344",
        "provinciecode": "PV26",
        "type": "gemeente",
        "provincienaam": "Utrecht",
        "centroide_ll": "POINT(5.0747543 52.09113798)",
        "gemeentecode": "0344",
        "weergavenaam": "Gemeente Utrecht",
        "suggest": ["Gemeente Utrecht"],
        "geometrie_rd": "MULTIPOLYGON(((129682 452722,129617 452603,129645 452579,129893 452057,129925 452008,130015 451984,130211 452011,130303 451960,130292 451875,130370 451811,130377 451781,130386 451636,130339 451548,130392 451429,130870 450887,130968 450812,131048 450706,131144 450556,131442 449858,131825 449261,131967 449131,131995 449225,132225 449096,132196 448999,132614 448710,132682 448759,132756 448774,132760 448887,132717 448968,132718 449014,132766 449100,132794 450021,132796 450298,132780 450344,132801 450413,132808 450598,132797 450598,132819 450734,132842 451510,132859 451651,132922 451949,132979 451931,133104 452366,133127 452361,133192 452566,133264 452654,133412 452698,133619 452706,133769 452683,134041 452593,134308 452587,134305 452560,134321 452557,134348 452578,134576 452545,134664 452508,134787 452364,134900 452313,134974 452310,135122 452393,135444 451811,135522 451616,135601 451329,135725 451364,135803 451338,135877 451558,135944 451939,136014 452158,136075 452261,136213 452211,136205 452191,136407 452125,136520 452071,136700 451905,136712 451833,136765 451818,136811 451806,136959 451916,136979 451916,137645 451791,138112 451678,138202 451647,138218 451627,138256 451639,138400 451608,138448 451614,138487 451636,138727 451947,138804 452009,139264 452252,139206 452817,139356 452989,139304 453014,139387 453244,139274 453320,139183 453428,139135 453596,139125 453711,139165 453839,139237 453933,139334 454211,139409 454298,139422 454360,139455 454415,139465 454506,139438 454606,139438 454694,139475 454723,139535 454646,139561 454545,139589 454506,139648 454451,139898 454290,140221 454511,140350 454489,140382 454450,140406 454462,140747 454423,140891 454233,141076 454305,141297 454315,141384 454352,141525 454368,141662 454422,141834 454358,141675 455320,141670 455332,141505 455342,141467 455359,141223 456094,141126 456113,140982 456250,140849 456282,140839 456118,140582 456143,140576 456205,140527 456224,140517 456149,140160 456208,139849 456186,139665 456225,139672 456241,139564 456277,139553 456251,139521 456261,139472 456305,139319 456545,139272 456642,139279 456659,139263 456654,139247 456702,139185 456681,139169 456730,139566 457688,139384 457745,139358 457740,139299 457787,139249 457791,139216 457842,138777 458098,138685 458391,138694 458386,138658 458596,138712 458858,138707 458946,138670 459037,138628 459092,138543 459156,138325 459216,138273 459190,138250 459209,138220 459136,138202 459144,138200 459226,138171 459248,138081 459180,138097 459226,137148 459631,135821 460594,135567 460220,135490 460274,135461 460278,135409 460221,134458 460873,133701 459917,133678 459935,133437 459726,133380 459830,133292 459933,133261 459902,133260 459848,133089 459776,133071 459803,132674 459422,131926 460120,131743 460251,131566 460119,131596 460083,131434 459938,131284 459753,131124 459488,130988 459200,130956 459120,130966 459114,130786 458780,130741 458805,130717 458786,130581 458909,130488 459035,130466 459054,130456 459042,130351 459136,130089 459402,129907 459595,129911 459613,129891 459633,129876 459625,129526 459976,129323 460221,129145 460528,128991 460889,129000 460903,128983 460944,128679 461526,128670 461564,128714 461594,128707 461610,128051 461197,127558 460859,127478 460547,126702 460243,126452 459452,126443 459466,126435 459440,126984 458370,127002 458404,127122 458300,127076 458219,127095 458029,127079 457910,127017 457841,126868 457841,126837 457812,126799 457491,126639 457281,126615 457178,126647 457084,126802 456918,127739 457020,127905 456353,127955 456363,128027 456045,128043 455909,128067 455863,128806 455649,128678 454479,128569 454516,128415 453164,128560 453107,129118 452937,129299 452854,129682 452722)))",
        "provincieafkorting": "UT",
        "centroide_rd": "POINT(133587.182 455921.594)",
        "id": "gem-df0ca8ab37eccea5217e2a13f74d2833",
        "gemeentenaam": "Utrecht",
        "geometrie_ll": "MULTIPOLYGON(((5.01801 52.06222,5.01707 52.06114,5.01748 52.06093,5.02113 52.05625,5.02161 52.05581,5.02292 52.0556,5.02578 52.05585,5.02712 52.0554,5.02696 52.05463,5.02811 52.05406,5.02821 52.05379,5.02835 52.05249,5.02767 52.0517,5.02845 52.05062,5.03547 52.04577,5.0369 52.04511,5.03806 52.04415,5.03949 52.04281,5.04387 52.03655,5.0495 52.0312,5.05157 52.03004,5.05198 52.03089,5.05534 52.02974,5.05491 52.02887,5.06102 52.02628,5.06202 52.02672,5.06309 52.02687,5.06314 52.02788,5.06251 52.0286,5.06252 52.02902,5.06321 52.0298,5.06357 52.03808,5.06358 52.04056,5.06334 52.04097,5.06365 52.0416,5.06373 52.04326,5.06357 52.04326,5.06388 52.04448,5.06416 52.05146,5.0644 52.05272,5.06531 52.05541,5.06613 52.05525,5.06793 52.05917,5.06827 52.05912,5.06921 52.06097,5.07024 52.06176,5.0724 52.06216,5.07542 52.06224,5.07761 52.06204,5.08158 52.06124,5.08547 52.06119,5.08543 52.06095,5.08566 52.06092,5.08606 52.06111,5.08939 52.06083,5.09067 52.0605,5.09247 52.05921,5.09412 52.05875,5.09521 52.05873,5.09735 52.05948,5.10209 52.05426,5.10324 52.05251,5.1044 52.04994,5.1062 52.05026,5.10734 52.05003,5.10842 52.05201,5.10936 52.05543,5.11038 52.0574,5.11126 52.05832,5.11328 52.05788,5.11316 52.0577,5.11611 52.05712,5.11775 52.05664,5.1204 52.05515,5.12057 52.0545,5.12134 52.05437,5.12201 52.05427,5.12417 52.05526,5.12446 52.05526,5.13417 52.05416,5.14099 52.05315,5.1423 52.05288,5.14253 52.0527,5.14309 52.05281,5.14519 52.05253,5.1459 52.05259,5.14646 52.05279,5.14994 52.05559,5.15106 52.05615,5.15776 52.05834,5.15689 52.06343,5.15906 52.06498,5.1583 52.0652,5.1595 52.06726,5.15785 52.06795,5.15653 52.06891,5.15582 52.07042,5.15566 52.07146,5.15623 52.07261,5.15729 52.07346,5.15869 52.07596,5.15978 52.07674,5.15996 52.0773,5.16044 52.07779,5.16059 52.07861,5.16018 52.07951,5.16018 52.0803,5.16072 52.08056,5.1616 52.07987,5.16199 52.07896,5.1624 52.07861,5.16326 52.07812,5.16692 52.07668,5.17161 52.07867,5.1735 52.07848,5.17397 52.07813,5.17431 52.07824,5.17929 52.0779,5.1814 52.07619,5.1841 52.07684,5.18732 52.07695,5.18859 52.07727,5.19064 52.07742,5.19264 52.07791,5.19515 52.07735,5.1928 52.08598,5.19271 52.08609,5.19031 52.08618,5.18976 52.08633,5.18617 52.09293,5.18475 52.09309,5.18264 52.09433,5.1807 52.09461,5.18056 52.09313,5.17681 52.09336,5.17672 52.09391,5.17601 52.09408,5.17586 52.09341,5.17065 52.09393,5.16612 52.09373,5.16343 52.09407,5.16352 52.09421,5.16196 52.09453,5.16179 52.0943,5.16132 52.09438,5.16061 52.09478,5.15836 52.09693,5.15767 52.0978,5.15777 52.09796,5.15753 52.09791,5.15731 52.09834,5.1564 52.09815,5.15617 52.09859,5.16192 52.10722,5.15926 52.10772,5.15887 52.10767,5.15801 52.1081,5.15728 52.10813,5.1568 52.10859,5.15038 52.11088,5.14901 52.11351,5.14915 52.11347,5.14861 52.11535,5.14939 52.1177,5.14931 52.11849,5.14878 52.11931,5.14816 52.1198,5.14692 52.12038,5.14373 52.12091,5.14297 52.12067,5.14262 52.12084,5.1422 52.12019,5.14193 52.12026,5.14189 52.121,5.14148 52.12119,5.14016 52.12058,5.1404 52.12099,5.12652 52.1246,5.10709 52.13321,5.1034 52.12985,5.10227 52.13032,5.10185 52.13036,5.10108 52.12984,5.08716 52.13567,5.07616 52.12705,5.07582 52.12722,5.07233 52.12533,5.07148 52.12626,5.0702 52.12718,5.06974 52.1269,5.06973 52.12641,5.06723 52.12576,5.06697 52.126,5.0612 52.12256,5.05023 52.12881,5.04756 52.12997,5.04498 52.12878,5.04542 52.12846,5.04306 52.12715,5.04088 52.12548,5.03856 52.12309,5.0366 52.12049,5.03614 52.11978,5.03628 52.11972,5.03368 52.11672,5.03303 52.11693,5.03268 52.11677,5.03068 52.11787,5.02931 52.11899,5.02899 52.11916,5.02884 52.11905,5.02731 52.1199,5.02346 52.12227,5.02078 52.124,5.02085 52.12416,5.02054 52.12434,5.02033 52.12427,5.01519 52.12741,5.01221 52.1296,5.00959 52.13235,5.00731 52.13559,5.00744 52.13572,5.00719 52.13608,5.0027 52.1413,5.00257 52.14164,5.00321 52.14191,5.0031 52.14205,4.99356 52.13831,4.98639 52.13525,4.98524 52.13244,4.97394 52.12967,4.97035 52.12255,4.97022 52.12267,4.9701 52.12244,4.9782 52.11285,4.97847 52.11316,4.98023 52.11223,4.97956 52.1115,4.97985 52.10979,4.97962 52.10872,4.97873 52.1081,4.97655 52.10809,4.9761 52.10782,4.97558 52.10494,4.97326 52.10305,4.97292 52.10211,4.97339 52.10127,4.97566 52.09979,4.98933 52.10076,4.99181 52.09476,4.99253 52.09486,4.99362 52.092,4.99386 52.09078,4.99422 52.09037,5.00501 52.08849,5.00323 52.07796,5.00164 52.07829,4.9995 52.06613,5.00162 52.06562,5.00976 52.06412,5.01241 52.06338,5.01801 52.06222)))",
        "shards": "bag",
        "_version_": 1775544800106250243,
        "typesortering": 1.0,
        "shard": "bag"
      },
      {
        "bron": "Bestuurlijke Grenzen",
        "identificatie": "PV26",
        "geometrie_ll": "MULTIPOLYGON(((5.05181 51.85748,5.05381 51.85739,5.05919 51.85815,5.06236 51.85936,5.06307 51.85985,5.06368 51.86082,5.06329 51.86168,5.06246 51.86219,5.0542 51.8651,5.0522 51.86664,5.05181 51.86827,5.05231 51.86998,5.05361 51.8719,5.05536 51.87304,5.06339 51.87441,5.06852 51.87405,5.07366 51.87404,5.08053 51.87552,5.08285 51.87727,5.08393 51.87866,5.08634 51.88077,5.08738 51.88307,5.08765 51.88554,5.08816 51.88709,5.08904 51.88809,5.09097 51.88898,5.09241 51.88905,5.09483 51.88874,5.09763 51.88785,5.10313 51.88866,5.10576 51.88881,5.10884 51.88819,5.11274 51.88778,5.11511 51.89018,5.1171 51.89173,5.11767 51.89257,5.1185 51.89638,5.11699 51.89691,5.11695 51.8981,5.11907 51.89827,5.11941 51.89861,5.13228 51.91488,5.13572 51.9142,5.13644 51.91451,5.13665 51.91481,5.13617 51.91774,5.13567 51.91822,5.14222 51.92475,5.14846 51.92949,5.14901 51.93054,5.14802 51.93179,5.14828 51.93274,5.14941 51.93352,5.15069 51.93332,5.15147 51.93362,5.15396 51.93729,5.16343 51.94686,5.16966 51.95547,5.18023 51.96745,5.18972 51.96291,5.1961 51.96081,5.20308 51.95956,5.20743 51.95948,5.21028 51.95985,5.21343 51.96065,5.21544 51.96145,5.21974 51.96387,5.22151 51.96529,5.22437 51.96828,5.22719 51.9726,5.22991 51.97565,5.23301 51.97755,5.23546 51.97847,5.23687 51.97876,5.24117 51.97887,5.24526 51.978,5.24758 51.97691,5.25419 51.97213,5.25855 51.96976,5.26456 51.96729,5.27241 51.96485,5.27652 51.96402,5.28408 51.96298,5.28912 51.96251,5.29665 51.96215,5.30089 51.96157,5.30459 51.96028,5.31098 51.95721,5.31077 51.95705,5.31486 51.95562,5.31832 51.95502,5.32161 51.95492,5.32908 51.95614,5.3327 51.95707,5.33522 51.95804,5.33832 51.95995,5.34355 51.96394,5.34709 51.967,5.35024 51.96867,5.35404 51.96998,5.35767 51.97069,5.36184 51.97097,5.36621 51.97067,5.37252 51.96959,5.37691 51.96916,5.382 51.9692,5.38707 51.96983,5.39098 51.97073,5.39934 51.9731,5.41351 51.97543,5.41816 51.97661,5.42336 51.97876,5.4313 51.98372,5.43387 51.98474,5.43732 51.98556,5.4406 51.98592,5.44465 51.9858,5.4484 51.98516,5.45389 51.98371,5.46269 51.98353,5.47099 51.98299,5.47322 51.98299,5.48151 51.98389,5.48621 51.98383,5.48592 51.98328,5.48868 51.98284,5.49188 51.98186,5.50075 51.97859,5.50805 51.97491,5.51248 51.97308,5.51695 51.97194,5.53609 51.9686,5.53894 51.96783,5.54135 51.96664,5.54241 51.96585,5.54571 51.96226,5.54956 51.9592,5.55274 51.9574,5.55693 51.95571,5.56125 51.9545,5.57557 51.95283,5.58614 51.95093,5.59099 51.94978,5.59444 51.94849,5.60201 51.94462,5.60578 51.94316,5.61643 51.94935,5.61864 51.94844,5.61879 51.94812,5.61937 51.94835,5.62045 51.94817,5.62016 51.9515,5.62345 51.95195,5.62503 51.95161,5.62731 51.95247,5.62712 51.95562,5.6265 51.95737,5.62498 51.96007,5.62026 51.96658,5.61833 51.96626,5.61954 51.9672,5.62242 51.96824,5.62486 51.97045,5.62615 51.97362,5.62606 51.97407,5.62226 51.97653,5.62015 51.97736,5.61878 51.97914,5.61508 51.98269,5.6149 51.98427,5.61523 51.98517,5.61434 51.98637,5.61433 51.98879,5.61391 51.99018,5.60997 51.99369,5.60955 51.99388,5.60825 51.9939,5.60705 51.99433,5.60507 51.99406,5.6028 51.99487,5.60097 51.99625,5.59932 51.99699,5.59656 51.9992,5.592 52.00139,5.59081 52.00302,5.59111 52.0073,5.58913 52.00986,5.58601 52.01178,5.58675 52.01229,5.58692 52.01571,5.58962 52.01559,5.59024 52.02027,5.5872 52.02045,5.58751 52.02663,5.5865 52.02917,5.58671 52.03129,5.58959 52.03118,5.59003 52.03439,5.58354 52.03645,5.56739 52.04061,5.56866 52.0424,5.56975 52.04341,5.57004 52.0434,5.57024 52.0445,5.57001 52.04451,5.56998 52.04568,5.57085 52.048,5.5579 52.04887,5.55865 52.05001,5.55757 52.05037,5.55982 52.05955,5.55995 52.06323,5.56033 52.06388,5.56073 52.0675,5.56078 52.06859,5.55921 52.07104,5.56144 52.07329,5.56274 52.07833,5.56258 52.07926,5.56134 52.08006,5.56071 52.08141,5.56078 52.08439,5.55912 52.08447,5.55669 52.08548,5.55741 52.08611,5.55711 52.08685,5.55654 52.08679,5.55578 52.08711,5.55491 52.08655,5.55526 52.0881,5.55471 52.09152,5.55587 52.09182,5.55443 52.09347,5.55418 52.09419,5.55452 52.09471,5.55443 52.09539,5.55056 52.09639,5.55046 52.09664,5.55158 52.09726,5.55295 52.09914,5.55424 52.10015,5.55306 52.10095,5.55034 52.10542,5.54529 52.10439,5.5464 52.10285,5.5463 52.10244,5.54401 52.10195,5.5435 52.10207,5.54154 52.10374,5.53154 52.10227,5.53282 52.09998,5.53424 52.09977,5.53916 52.09781,5.53883 52.09644,5.53508 52.09287,5.53829 52.09269,5.53713 52.08866,5.53086 52.08977,5.52663 52.0849,5.53131 52.08394,5.53181 52.08362,5.53125 52.08242,5.53047 52.08182,5.52946 52.08168,5.5269 52.08068,5.52265 52.07754,5.52141 52.07823,5.52036 52.07831,5.51944 52.07923,5.5164 52.07918,5.51416 52.07875,5.50992 52.07905,5.50969 52.07898,5.51036 52.07806,5.5092 52.07697,5.50648 52.07671,5.50507 52.07691,5.50458 52.07335,5.50209 52.07335,5.49988 52.07134,5.49751 52.07135,5.49517 52.0719,5.49389 52.07189,5.4907 52.07141,5.48782 52.07025,5.48589 52.07026,5.48472 52.06969,5.48415 52.06962,5.48174 52.07046,5.47998 52.07138,5.47722 52.07201,5.47617 52.07272,5.47382 52.07305,5.47031 52.07495,5.46714 52.07557,5.46638 52.07619,5.46611 52.07773,5.46543 52.07843,5.46466 52.07875,5.46133 52.07931,5.45924 52.08023,5.46015 52.08095,5.45968 52.082,5.46337 52.08344,5.46405 52.08306,5.4715 52.08835,5.47189 52.08938,5.47279 52.08916,5.47483 52.09026,5.47676 52.09035,5.48062 52.09203,5.48608 52.09366,5.48474 52.09662,5.48524 52.09922,5.48499 52.1033,5.4843 52.10554,5.49386 52.1111,5.49394 52.1125,5.49369 52.11309,5.49338 52.113,5.49301 52.11356,5.49183 52.11409,5.49183 52.11451,5.49094 52.11449,5.48972 52.1149,5.48741 52.11505,5.48645 52.11536,5.48808 52.1161,5.49075 52.11605,5.49258 52.11566,5.49563 52.11559,5.49646 52.11594,5.49892 52.11602,5.50261 52.11509,5.5025 52.11495,5.50395 52.11372,5.50617 52.11431,5.5077 52.1139,5.50755 52.11564,5.50376 52.11659,5.50535 52.11975,5.50167 52.11957,5.50004 52.1192,5.49692 52.11956,5.49665 52.1205,5.49506 52.12199,5.49469 52.1247,5.49642 52.1246,5.4965 52.12485,5.49676 52.12481,5.49791 52.13028,5.49834 52.13022,5.49909 52.13054,5.49917 52.13024,5.50142 52.12993,5.50498 52.13093,5.50504 52.13111,5.50672 52.13098,5.50734 52.13133,5.50769 52.13113,5.5077 52.13134,5.50886 52.13158,5.5092 52.13195,5.51193 52.1321,5.51217 52.13219,5.51188 52.13412,5.51237 52.13422,5.51354 52.13577,5.51408 52.13592,5.51248 52.13707,5.51031 52.138,5.50745 52.13853,5.50759 52.13887,5.5026 52.13954,5.5 52.14104,5.49731 52.14144,5.49801 52.14315,5.49898 52.14739,5.49625 52.14735,5.48948 52.14822,5.4848 52.14917,5.48134 52.1505,5.48263 52.1515,5.48325 52.15402,5.48377 52.15398,5.48361 52.15538,5.48411 52.15548,5.48432 52.15806,5.48365 52.15829,5.4815 52.1583,5.48212 52.1598,5.48097 52.1601,5.4792 52.16136,5.47552 52.16216,5.47287 52.16185,5.47243 52.16285,5.47339 52.163,5.47298 52.16382,5.47448 52.16388,5.47556 52.16439,5.47774 52.16424,5.47888 52.1644,5.47992 52.16581,5.47575 52.1661,5.47575 52.16576,5.44882 52.1677,5.44424 52.16856,5.44293 52.16918,5.43988 52.1712,5.43892 52.17292,5.44014 52.17322,5.43904 52.18413,5.43925 52.18431,5.43809 52.18458,5.43935 52.18712,5.4401 52.19005,5.43997 52.19576,5.43971 52.19596,5.43939 52.20143,5.43964 52.20261,5.44115 52.20431,5.44019 52.20463,5.44104 52.20569,5.43982 52.20598,5.43924 52.2046,5.43665 52.20559,5.43638 52.2053,5.43471 52.20588,5.43433 52.20621,5.43189 52.20712,5.42199 52.21228,5.42103 52.21319,5.40967 52.21858,5.40722 52.2134,5.39364 52.22008,5.39321 52.22063,5.39679 52.23038,5.40464 52.24963,5.4029 52.24953,5.39324 52.25516,5.33546 52.29022,5.30583 52.27733,5.287 52.27964,5.26598 52.28193,5.24398 52.25453,5.24509 52.25443,5.2229 52.22526,5.22473 52.2252,5.21649 52.20637,5.21721 52.20623,5.19259 52.17783,5.18932 52.17768,5.14336 52.18027,5.14321 52.17994,5.12118 52.18095,5.08245 52.17384,5.04773 52.16619,5.04622 52.16601,5.04439 52.17222,5.04205 52.18337,5.04155 52.18375,5.0325 52.18411,5.0332 52.18472,5.03363 52.18605,5.03498 52.1868,5.03516 52.18838,5.03571 52.1892,5.03534 52.1907,5.03622 52.19149,5.03652 52.19355,5.03779 52.19452,5.03813 52.19516,5.03777 52.19657,5.03712 52.19663,5.03742 52.19741,5.0372 52.19795,5.03434 52.19811,5.0322 52.19854,5.03183 52.19844,5.02985 52.19953,5.02794 52.19996,5.02606 52.20137,5.02277 52.20153,5.02129 52.20189,5.02143 52.20204,5.02301 52.20175,5.02245 52.20223,5.02159 52.20248,5.02303 52.20204,5.02311 52.20274,5.02253 52.20268,5.02245 52.20281,5.02262 52.20394,5.02343 52.20383,5.02332 52.20305,5.02467 52.20286,5.025 52.20284,5.02504 52.20327,5.02543 52.20326,5.0256 52.20398,5.03665 52.20214,5.03742 52.20496,5.03532 52.20523,5.03644 52.20957,5.0334 52.20984,5.03434 52.2129,5.03435 52.21312,5.03373 52.21312,5.03379 52.21371,5.0367 52.21365,5.03667 52.2142,5.03729 52.21422,5.03699 52.21441,5.03533 52.21446,5.03577 52.21456,5.03568 52.21512,5.03691 52.21516,5.03669 52.21569,5.03714 52.2162,5.03692 52.21624,5.03713 52.21655,5.03685 52.21719,5.03585 52.21753,5.03667 52.22436,5.0392 52.22402,5.03934 52.22441,5.04263 52.22387,5.0428 52.22404,5.04198 52.22433,5.04193 52.22409,5.03696 52.22478,5.0371 52.22534,5.03873 52.22518,5.04005 52.22703,5.04049 52.22694,5.04084 52.22769,5.04248 52.22878,5.0411 52.22932,5.04131 52.22949,5.04071 52.22955,5.04052 52.22983,5.04135 52.23008,5.04159 52.23089,5.0424 52.23055,5.04356 52.23111,5.0438 52.23101,5.05181 52.23356,5.05224 52.23386,5.05292 52.23392,5.05328 52.23424,5.05353 52.23412,5.05622 52.23498,5.05579 52.23521,5.05676 52.23559,5.05748 52.23521,5.05773 52.23535,5.05628 52.23713,5.04585 52.24338,5.04663 52.24854,5.0448 52.25067,5.04398 52.25245,5.04348 52.25534,5.04294 52.25598,5.04138 52.2567,5.04006 52.2565,5.03888 52.25559,5.0375 52.25369,5.03573 52.25265,5.0345 52.25286,5.03186 52.25512,5.03117 52.25602,5.03097 52.25682,5.03246 52.25871,5.03249 52.26017,5.0311 52.26156,5.02658 52.26415,5.02658 52.26464,5.0278 52.26604,5.02775 52.26757,5.02714 52.26823,5.02482 52.26963,5.02348 52.27121,5.02289 52.27248,5.02334 52.27307,5.02408 52.27324,5.02833 52.27209,5.02954 52.27201,5.03058 52.27225,5.03333 52.27544,5.03822 52.27697,5.04211 52.27787,5.04373 52.27791,5.04722 52.27701,5.0486 52.27703,5.04962 52.2778,5.04973 52.2805,5.05075 52.28182,5.05159 52.28219,5.05529 52.28301,5.06052 52.28517,5.06186 52.28513,5.06284 52.2848,5.0628 52.28257,5.06307 52.28184,5.06438 52.28075,5.06588 52.28054,5.06588 52.28127,5.06549 52.28127,5.06547 52.2852,5.06479 52.28508,5.06419 52.28629,5.06328 52.28719,5.05954 52.28932,5.05483 52.28755,5.05277 52.28649,5.0504 52.28787,5.04748 52.28502,5.04278 52.28249,5.04079 52.28388,5.03943 52.28324,5.03515 52.28553,5.03321 52.28626,5.03053 52.28849,5.02438 52.28136,5.02187 52.28265,5.02154 52.30246,5.01784 52.30266,5.01426 52.30368,5.01177 52.30339,5.00992 52.30209,5.00789 52.30152,5.00526 52.29839,5.00383 52.29851,5.00323 52.29739,5.00323 52.29606,5.00185 52.29588,5.00179 52.29279,4.99748 52.28912,4.99046 52.2896,4.98351 52.29037,4.98289 52.28964,4.97515 52.28634,4.96973 52.28312,4.96938 52.28179,4.96767 52.27958,4.96649 52.2801,4.96617 52.28098,4.96532 52.28045,4.96224 52.28021,4.96105 52.27817,4.95677 52.27867,4.9538 52.27803,4.94991 52.27844,4.94721 52.279,4.94554 52.27883,4.94411 52.27828,4.94269 52.27818,4.94072 52.27906,4.93746 52.27955,4.93635 52.28017,4.9338 52.28089,4.93139 52.28051,4.92859 52.27961,4.92644 52.27978,4.92596 52.2782,4.92679 52.27686,4.92675 52.27538,4.92766 52.27371,4.92665 52.27244,4.92801 52.27174,4.92851 52.27047,4.92935 52.26989,4.92965 52.26925,4.92942 52.2684,4.92832 52.26798,4.92582 52.26752,4.92475 52.267,4.92424 52.26608,4.92384 52.26374,4.92326 52.26309,4.92213 52.26263,4.91894 52.26205,4.91812 52.2617,4.91799 52.26121,4.91864 52.25894,4.9176 52.25708,4.91663 52.25639,4.91431 52.25534,4.91081 52.25261,4.90971 52.25245,4.90571 52.25316,4.90308 52.2532,4.9018 52.25275,4.89982 52.25124,4.89857 52.25093,4.89635 52.25129,4.89304 52.253,4.89133 52.2533,4.89074 52.2531,4.88826 52.2512,4.88702 52.2509,4.88571 52.25147,4.88408 52.25335,4.88272 52.25371,4.87773 52.25282,4.87385 52.25074,4.87229 52.25118,4.87004 52.25336,4.86858 52.25158,4.86625 52.25106,4.8644 52.24979,4.86062 52.24822,4.85927 52.24779,4.85752 52.24772,4.85686 52.24639,4.85577 52.24605,4.85531 52.2456,4.85494 52.24215,4.85422 52.24187,4.85167 52.24204,4.85125 52.24187,4.85131 52.24128,4.85219 52.23988,4.85163 52.23899,4.85082 52.2386,4.84843 52.23968,4.84728 52.23977,4.84608 52.23772,4.84548 52.23741,4.84364 52.23713,4.84294 52.23674,4.84283 52.23534,4.84138 52.23517,4.83869 52.23537,4.83612 52.23394,4.83489 52.23288,4.83253 52.23241,4.83011 52.23091,4.82656 52.23008,4.82371 52.22981,4.82081 52.22883,4.81914 52.22894,4.81446 52.22722,4.80896 52.22696,4.8054 52.22799,4.80176 52.22688,4.7973 52.22666,4.79458 52.22673,4.79443 52.22342,4.79589 52.22348,4.797 52.22035,4.80215 52.21763,4.80162 52.21491,4.80159 52.20432,4.80293 52.20103,4.81359 52.20185,4.8131 52.20119,4.8144 52.19931,4.8178 52.19797,4.81961 52.197,4.82221 52.19612,4.82355 52.1943,4.82344 52.19327,4.82491 52.19261,4.82632 52.19126,4.82758 52.19093,4.82934 52.18929,4.8316 52.18844,4.83259 52.18773,4.83346 52.18756,4.83403 52.18667,4.83535 52.18611,4.83652 52.18436,4.84237 52.18131,4.84392 52.18012,4.84452 52.17992,4.84579 52.17998,4.84895 52.17939,4.84998 52.17942,4.85141 52.17903,4.85238 52.17918,4.85418 52.17886,4.85558 52.17892,4.88623 52.16453,4.88642 52.16419,4.89174 52.16177,4.89218 52.1618,4.89227 52.16159,4.88757 52.15996,4.87362 52.15608,4.87452 52.13883,4.87132 52.13884,4.87034 52.13821,4.86492 52.13739,4.85524 52.13721,4.85384 52.13755,4.85261 52.13827,4.85215 52.13939,4.85148 52.13967,4.84953 52.13958,4.84748 52.13894,4.84625 52.13955,4.84287 52.13946,4.84219 52.13982,4.84174 52.1409,4.84096 52.14142,4.84028 52.14156,4.83889 52.14119,4.83795 52.14062,4.83737 52.14065,4.8367 52.14288,4.83557 52.14276,4.83549 52.14303,4.83413 52.14288,4.83413 52.14343,4.83286 52.14476,4.83197 52.14446,4.83014 52.14331,4.82924 52.14321,4.82647 52.14218,4.82338 52.14223,4.82158 52.14191,4.82049 52.14222,4.81792 52.14076,4.81717 52.13965,4.81667 52.13939,4.81597 52.13944,4.81404 52.14022,4.81311 52.14017,4.81172 52.13909,4.80996 52.13843,4.80909 52.13764,4.80866 52.13715,4.80897 52.13584,4.80749 52.13502,4.80888 52.13189,4.80835 52.13153,4.80836 52.13086,4.80779 52.12986,4.80807 52.12895,4.80706 52.12828,4.80642 52.12742,4.80347 52.1264,4.80298 52.12539,4.8021 52.12489,4.80115 52.12485,4.79834 52.1253,4.79699 52.12466,4.79349 52.12397,4.79235 52.12316,4.79208 52.12229,4.82538 52.10709,4.82439 52.1054,4.82306 52.10519,4.82335 52.09337,4.82563 52.07977,4.82649 52.07953,4.82628 52.07464,4.83063 52.07497,4.8309 52.07435,4.83305 52.07483,4.83267 52.07284,4.83404 52.07274,4.82981 52.06682,4.83714 52.06842,4.8422 52.06901,4.85079 52.06912,4.85606 52.06881,4.85727 52.069,4.86226 52.06906,4.86404 52.06855,4.86425 52.06861,4.8639 52.06905,4.8732 52.06875,4.86786 52.06305,4.86483 52.062,4.86269 52.06156,4.85597 52.05906,4.85323 52.05859,4.84805 52.05816,4.84439 52.05678,4.82949 52.04981,4.82971 52.04948,4.81888 52.03824,4.81719 52.03693,4.81182 52.03382,4.8099 52.03343,4.8067 52.03317,4.80934 52.02838,4.80993 52.02676,4.80388 52.02443,4.80397 52.02428,4.80352 52.0241,4.80343 52.02424,4.80315 52.02412,4.80329 52.02389,4.79912 52.02225,4.79902 52.02241,4.7987 52.02227,4.80352 52.01396,4.80631 52.01415,4.81562 52.01398,4.81721 52.01435,4.82499 52.01724,4.82751 52.01682,4.83333 52.01642,4.84018 52.01671,4.8469 52.01818,4.85713 52.00596,4.85334 52.00475,4.81781 51.99977,4.83522 51.98614,4.83411 51.98558,4.84562 51.97498,4.84721 51.97525,4.84755 51.97514,4.85783 51.969,4.85948 51.96867,4.86081 51.96778,4.86249 51.9654,4.86407 51.96391,4.86569 51.9604,4.87043 51.955,4.87122 51.95464,4.87777 51.93904,4.87779 51.93803,4.88511 51.93859,4.91401 51.94244,4.91638 51.94318,4.91919 51.94473,4.92449 51.94895,4.9263 51.95093,4.92948 51.95019,4.92996 51.94882,4.93013 51.94865,4.93073 51.94901,4.93137 51.94861,4.93262 51.94666,4.93924 51.92894,4.94036 51.9292,4.94229 51.93017,4.94487 51.93212,4.94594 51.93329,4.9477 51.93372,4.94855 51.93123,4.9496 51.93157,4.95616 51.91559,4.95856 51.91529,4.95969 51.91405,4.96038 51.91483,4.96479 51.91352,4.96326 51.9128,4.96416 51.91227,4.96413 51.91064,4.96779 51.91009,4.97374 51.90767,4.97341 51.89725,4.97435 51.89709,4.99246 51.90195,4.99435 51.90235,4.99497 51.90229,4.9963 51.89669,4.99633 51.89545,4.99577 51.89348,4.99596 51.89196,4.99945 51.88428,4.99884 51.88228,4.99617 51.87975,4.99505 51.87762,4.99508 51.87574,4.99624 51.87312,4.9968 51.87355,5.00127 51.87499,5.00124 51.87473,5.02696 51.88192,5.02725 51.88153,5.02613 51.88125,5.02547 51.88063,5.02325 51.8758,5.02284 51.87426,5.02317 51.87203,5.02175 51.86882,5.02342 51.86728,5.02398 51.86635,5.02611 51.86498,5.02739 51.86374,5.02741 51.86031,5.02709 51.86022,5.02742 51.8602,5.02751 51.85985,5.02691 51.85861,5.036 51.85868,5.03844 51.85899,5.04134 51.85896,5.04385 51.85923,5.0481 51.85868,5.05181 51.85748)))",
        "provinciecode": "PV26",
        "type": "provincie",
        "provincienaam": "Utrecht",
        "centroide_ll": "POINT(5.16385544 52.08423158)",
        "weergavenaam": "Provincie Utrecht",
        "suggest": ["Provincie Utrecht"],
        "provincieafkorting": "UT",
        "centroide_rd": "POINT(139691.101 455130.674)",
        "id": "pro-3c35250f0081bd7bc08056e290fbceb4",
        "geometrie_rd": "MULTIPOLYGON(((131894 429932,132032 429922,132403 430005,132622 430139,132672 430193,132714 430301,132688 430396,132631 430454,132063 430780,131981 430866,131926 430952,131900 431133,131936 431324,132026 431536,132147 431663,132189 431687,132701 431813,132832 431810,133054 431771,133221 431782,133408 431768,133882 431931,134042 432124,134118 432279,134284 432513,134325 432618,134357 432769,134377 433044,134412 433216,134474 433327,134595 433403,134589 433415,134607 433425,134706 433433,134872 433398,134944 433372,134994 433339,134992 433321,135065 433298,135127 433299,135220 433337,135444 433386,135625 433403,135837 433333,136105 433286,136269 433553,136407 433724,136446 433818,136505 434241,136401 434301,136399 434434,136428 434451,136545 434451,136569 434489,137461 436296,137697 436219,137747 436254,137761 436288,137729 436613,137696 436667,138148 437392,138579 437917,138617 438035,138550 438174,138546 438214,138568 438279,138646 438366,138734 438344,138788 438376,138961 438785,139553 439767,139615 439847,140046 440804,140776 442134,141427 441628,141677 441481,141865 441392,142150 441295,142345 441253,142644 441243,142839 441283,143056 441372,143195 441460,143348 441586,143491 441729,143613 441886,143810 442220,144005 442700,144193 443038,144406 443249,144575 443351,144671 443383,144871 443403,144967 443395,145070 443373,145248 443297,145407 443175,145860 442643,146159 442379,146572 442103,147111 441831,147393 441738,147913 441622,148259 441569,148776 441528,149068 441463,149322 441320,149760 440978,149746 440960,150027 440801,150147 440756,150265 440733,150491 440722,150617 440742,151004 440858,151253 440960,151427 441069,151640 441281,152000 441724,152244 442065,152460 442250,152721 442396,152971 442476,153257 442506,153558 442473,153991 442352,154293 442305,154642 442309,154991 442379,155259 442479,155597 442647,155834 442743,156808 443002,157127 443133,157294 443231,157484 443373,158030 443926,158206 444039,158443 444130,158668 444170,158947 444158,159204 444087,159477 443958,159581 443925,160186 443906,160756 443846,160909 443847,161478 443947,161802 443941,161782 443881,161971 443831,162191 443722,162801 443360,163303 442952,163608 442748,163916 442622,165231 442253,165428 442167,165593 442036,165666 441948,165894 441548,166160 441209,166379 441009,166667 440822,166964 440688,167949 440504,168676 440295,169010 440168,169248 440026,169454 439871,169769 439596,170029 439434,170040 439431,170759 440126,170912 440024,170902 440012,170922 439989,170961 440014,171036 439995,171015 440365,171241 440416,171350 440379,171506 440475,171492 440825,171448 441019,171343 441319,171025 442025,171009 442027,171016 442043,170884 442007,170898 442045,170967 442112,171165 442228,171331 442475,171419 442828,171413 442878,171150 443150,171005 443243,170911 443440,170794 443595,170655 443834,170642 444010,170664 444111,170603 444244,170601 444512,170571 444667,170455 444837,170407 444881,170300 445057,170271 445078,170182 445080,170099 445127,169963 445097,169923 445108,169807 445187,169681 445341,169567 445422,169377 445668,169135 445839,169063 445910,168981 446092,168979 446301,169008 446438,169001 446568,168864 446852,168649 447065,168700 447121,168710 447503,168896 447490,168937 448010,168728 448030,168747 448717,168740 448791,168687 448917,168677 449000,168691 449236,168889 449224,168918 449581,168472 449809,167783 450099,167432 450228,167362 450269,167447 450435,167449 450468,167524 450582,167544 450580,167557 450702,167542 450704,167539 450834,167598 451092,166710 451186,166760 451313,166744 451335,166687 451354,166755 451761,166793 452166,166838 452375,166846 452785,166864 452797,166872 452857,166878 453135,166898 453260,166902 453381,166793 453654,166946 453904,167033 454465,167022 454568,166937 454657,166893 454808,166897 455139,166815 455156,166783 455147,166711 455183,166617 455260,166666 455330,166643 455367,166645 455412,166606 455405,166554 455441,166509 455376,166498 455367,166494 455378,166518 455551,166480 455932,166559 455965,166460 456148,166442 456229,166465 456286,166459 456362,166194 456473,166187 456500,166264 456569,166357 456778,166445 456892,166364 456981,166177 457477,165831 457362,165907 457190,165901 457145,165744 457090,165709 457103,165574 457289,164889 457124,164977 456870,165075 456846,165412 456629,165390 456476,165134 456079,165354 456059,165275 455610,164845 455734,164557 455191,164877 455084,164912 455049,164889 455010,164873 454915,164821 454849,164751 454833,164576 454721,164506 454655,164385 454474,164286 454372,164258 454412,164200 454448,164175 454438,164128 454456,164065 454559,163856 454553,163703 454505,163413 454538,163397 454530,163443 454427,163364 454306,163177 454277,163080 454299,163048 453903,162877 453902,162726 453678,162563 453680,162402 453741,162314 453739,162208 453703,162096 453686,161899 453556,161841 453546,161766 453558,161686 453493,161647 453486,161482 453579,161361 453681,161172 453752,161100 453830,160991 453844,160939 453867,160697 454078,160480 454146,160428 454215,160409 454387,160363 454464,160310 454500,160081 454562,159938 454664,160000 454745,159968 454862,160221 455022,160268 454979,160419 455175,160777 455569,160804 455684,160865 455659,161006 455781,161138 455791,161402 455979,161776 456160,161684 456490,161717 456779,161700 457234,161652 457483,162306 458102,162311 458258,162294 458324,162273 458314,162248 458375,162167 458434,162167 458481,162122 458491,162106 458478,162022 458524,161864 458541,161798 458575,161910 458658,162093 458653,162119 458633,162218 458609,162426 458601,162483 458641,162521 458631,162652 458650,162905 458547,162897 458531,162997 458394,163149 458460,163254 458415,163243 458609,163217 458605,163211 458631,163130 458647,162983 458713,163048 458887,163092 459066,162840 459045,162728 459004,162514 459043,162496 459148,162387 459314,162361 459615,162479 459604,162484 459632,162502 459628,162581 460237,162610 460230,162661 460266,162666 460232,162821 460197,162833 460215,162914 460233,163039 460309,163064 460310,163069 460330,163141 460308,163184 460315,163226 460354,163250 460332,163250 460355,163309 460390,163330 460383,163353 460423,163540 460441,163556 460451,163542 460486,163536 460665,163569 460677,163649 460849,163686 460866,163577 460994,163428 461096,163232 461155,163242 461193,162900 461267,162805 461374,162722 461434,162537 461478,162585 461668,162651 462140,162464 462135,162000 462231,161680 462336,161443 462484,161531 462596,161573 462876,161608 462872,161597 463028,161629 463024,161632 463039,161645 463326,161600 463351,161452 463352,161495 463519,161416 463553,161348 463648,161295 463693,161222 463732,161043 463781,160861 463746,160832 463858,160897 463874,160892 463926,160869 463966,160972 463972,161045 464029,161194 464013,161273 464031,161277 464069,161344 464188,161058 464219,161058 464182,159216 464396,159081 464436,159065 464430,158902 464491,158813 464560,158603 464784,158537 464976,158621 465009,158545 466223,158559 466244,158480 466274,158566 466556,158617 466882,158608 467517,158590 467539,158567 468148,158584 468279,158687 468469,158622 468504,158680 468622,158597 468655,158557 468501,158380 468610,158362 468578,158248 468642,158215 468669,158221 468680,158055 468781,158041 468808,157654 469138,157377 469354,157312 469456,157216 469514,156535 470055,156368 469479,155440 470222,155411 470283,155655 471367,156191 473510,156072 473498,155412 474124,151470 478027,149447 476594,148425 476789,148162 476853,148053 476860,146728 477110,145220 474065,145296 474053,143774 470811,143899 470803,143331 468710,143380 468695,141688 465539,141465 465523,138322 465820,138312 465783,137683 465845,136805 465901,134153 465121,131775 464280,131685 464252,131671 464261,131549 464952,131395 466193,131361 466236,130742 466279,130745 466302,130790 466346,130821 466494,130913 466578,130926 466753,130964 466844,130939 467011,131000 467099,131022 467328,131109 467435,131133 467507,131109 467663,131065 467670,131086 467757,131071 467817,131066 467829,130875 467836,130729 467884,130704 467873,130695 467898,130648 467908,130569 467996,130439 468044,130311 468202,130086 468221,129985 468260,129995 468277,130103 468244,130065 468298,130006 468326,130029 468329,130104 468277,130110 468355,130070 468348,130065 468363,130077 468489,130133 468476,130124 468389,130218 468382,130217 468368,130239 468366,130242 468413,130269 468411,130281 468492,131035 468283,131090 468598,130946 468628,131025 469110,130818 469141,130883 469481,130884 469506,130842 469506,130846 469572,131045 469564,131054 469605,131043 469625,131086 469627,131066 469648,130952 469655,130982 469665,130976 469729,131060 469732,131046 469791,131077 469848,131061 469853,131076 469887,131057 469958,130989 469996,131048 470756,131221 470717,131231 470761,131456 470699,131467 470718,131412 470750,131408 470724,131069 470802,131079 470865,131190 470846,131220 470939,131281 471052,131311 471042,131344 471107,131336 471125,131448 471246,131354 471306,131369 471325,131327 471332,131315 471363,131371 471390,131388 471480,131443 471442,131501 471472,131523 471504,131539 471493,132088 471775,132117 471807,132132 471797,132164 471814,132189 471850,132206 471836,132390 471931,132361 471957,132427 471999,132476 471956,132493 471972,132478 472026,132395 472170,131686 472869,131742 473443,131651 473592,131618 473680,131563 473879,131530 474200,131494 474271,131388 474352,131340 474352,131298 474330,131216 474230,131121 474019,131057 473943,131000 473904,130945 473907,130916 473928,130737 474179,130690 474281,130677 474369,130693 474424,130780 474579,130795 474664,130783 474741,130746 474820,130688 474896,130440 475113,130381 475186,130382 475240,130442 475329,130466 475396,130463 475567,130422 475640,130313 475733,130264 475797,130174 475972,130134 476115,130165 476180,130216 476198,130505 476069,130588 476060,130659 476086,130804 476386,130848 476440,131183 476609,131449 476708,131560 476711,131797 476611,131891 476612,131936 476648,131961 476697,131970 476998,131993 477069,132041 477144,132098 477186,132351 477275,132709 477514,132800 477509,132867 477472,132863 477224,132881 477143,132970 477021,133022 476998,133072 476998,133073 477078,133046 477079,133058 477237,133047 477516,133000 477503,132960 477638,132898 477738,132644 477976,132322 477780,132181 477663,132100 477756,132020 477818,131819 477501,131497 477221,131362 477377,131269 477306,130978 477562,130860 477650,130846 477644,130664 477893,130241 477101,130070 477246,130059 479450,129807 479474,129728 479499,129563 479588,129393 479558,129344 479517,129266 479414,129127 479351,129103 479278,128946 479004,128849 479017,128807 478893,128806 478745,128712 478725,128706 478382,128501 478099,128483 478098,128476 478054,128409 477974,127931 478031,127457 478119,127415 478038,126884 477674,126512 477318,126488 477170,126444 477052,126370 476925,126290 476982,126268 477081,126210 477022,126000 476996,125917 476771,125843 476790,125754 476791,125696 476821,125625 476828,125422 476757,125366 476779,125157 476805,125026 476863,124973 476869,124859 476850,124761 476790,124664 476779,124530 476877,124308 476933,124233 477003,124059 477085,123894 477043,123703 476944,123626 476943,123557 476964,123522 476788,123578 476638,123575 476474,123635 476288,123565 476148,123658 476069,123691 475927,123748 475862,123768 475790,123752 475697,123676 475650,123505 475600,123432 475543,123396 475441,123368 475181,123327 475108,123250 475058,123032 474994,122975 474955,122966 474902,123009 474649,122993 474571,122937 474442,122870 474366,122711 474251,122469 473948,122395 473930,122122 474012,121942 474017,121854 473968,121718 473800,121633 473767,121481 473808,121434 473843,121405 473891,121257 474000,121140 474034,121100 474012,120929 473801,120844 473768,120809 473781,120755 473833,120645 474043,120600 474077,120552 474083,120211 473986,119945 473757,119866 473783,119838 473807,119686 474050,119585 473853,119426 473796,119298 473656,119039 473483,118946 473436,118827 473429,118801 473388,118781 473282,118706 473244,118674 473195,118663 472880,118646 472810,118597 472780,118423 472800,118394 472781,118397 472716,118456 472560,118448 472513,118417 472461,118362 472418,118199 472539,118121 472549,118102 472527,118070 472382,118038 472322,117996 472288,117870 472257,117822 472215,117807 472162,117813 472059,117714 472041,117567 472074,117530 472064,117464 472019,117354 471907,117269 471789,117155 471765,117108 471738,117000 471617,116941 471573,116698 471482,116503 471454,116303 471347,116190 471360,116056 471292,115984 471226,115868 471171,115556 471159,115492 471144,115379 471185,115293 471256,115250 471261,115099 471201,115000 471140,114695 471117,114509 471127,114496 470759,114596 470765,114669 470416,115019 470111,114980 469808,114962 469049,114968 468630,115057 468263,115787 468348,115753 468275,115840 468065,116071 467914,116194 467806,116371 467707,116422 467622,116461 467503,116453 467388,116553 467314,116583 467252,116627 467217,116648 467164,116734 467126,116852 466943,117007 466846,117073 466767,117133 466748,117171 466649,117261 466585,117300 466500,117307 466436,117339 466390,117454 466276,117737 466048,117842 465915,117883 465893,117969 465899,118186 465831,118256 465834,118353 465789,118420 465806,118542 465769,118638 465775,120724 464159,120736 464121,121099 463850,121129 463853,121135 463830,120812 463650,119854 463226,119902 461306,119683 461308,119616 461238,119244 461150,118581 461135,118486 461173,118402 461254,118372 461379,118326 461411,118192 461401,118087 461337,118052 461331,117968 461399,117849 461382,117736 461391,117690 461432,117660 461552,117607 461611,117560 461627,117465 461586,117400 461523,117360 461527,117317 461775,117239 461763,117234 461792,117141 461776,117141 461838,117055 461987,117023 461954,116994 461953,116990 461929,116868 461826,116806 461816,116694 461735,116616 461702,116404 461710,116281 461675,116233 461709,116207 461710,116029 461549,115977 461427,115942 461397,115894 461403,115763 461491,115700 461487,115603 461367,115482 461295,115422 461207,115392 461152,115415 461064,115412 461007,115401 460987,115319 460939,115310 460916,115345 460836,115363 460666,115403 460567,115366 460527,115366 460452,115326 460342,115344 460240,115275 460167,115230 460072,115188 460033,115028 459960,114993 459848,114932 459792,114867 459789,114675 459840,114622 459815,114582 459770,114342 459695,114262 459606,114244 459508,114309 459475,114478 459332,116511 457799,116442 457612,116350 457589,116360 456274,116504 454760,116563 454732,116544 454189,116843 454223,116861 454154,117009 454206,116981 453985,117075 453973,116780 453317,117284 453491,117632 453553,118220 453561,118352 453554,118364 453534,118398 453553,118406 453538,118582 453525,118664 453545,119007 453550,119128 453492,119143 453498,119119 453548,119725 453521,119757 453509,119386 452878,119177 452762,119030 452715,118567 452440,118379 452389,118023 452344,117794 452193,117771 452192,117610 452056,116744 451425,116758 451387,116006 450142,115889 449998,115518 449655,115385 449613,115166 449585,115342 449050,115382 448871,115108 448689,115103 448705,114964 448614,114970 448598,114939 448577,114933 448593,114914 448580,114923 448554,114635 448375,114629 448392,114607 448377,114930 447449,115122 447470,115594 447439,115761 447445,115870 447485,116208 447683,116322 447767,116407 447803,116580 447754,116979 447708,117449 447736,117581 447768,117911 447896,117951 447844,118122 447467,118604 446531,118342 446399,115898 445863,117083 444338,117077 444320,117032 444305,117006 444276,117788 443091,117897 443119,117921 443107,118622 442420,118735 442382,118826 442282,118940 442016,119047 441850,119155 441458,119477 440855,119531 440815,119969 439076,119970 438964,120473 439022,122463 439437,122627 439519,122821 439690,122969 439860,123189 440157,123314 440377,123532 440293,123565 440141,123576 440121,123618 440161,123661 440116,123746 439899,124189 437924,124266 437953,124328 438016,124400 438060,124463 438153,124578 438276,124653 438406,124774 438453,124830 438176,124896 438222,124903 438212,125344 436432,125509 436397,125586 436259,125634 436346,125936 436198,125831 436120,125892 436059,125889 435878,126141 435816,126548 435544,126519 434385,126584 434367,127833 434900,127963 434944,127964 434932,128006 434938,128094 434314,128095 434176,128056 433957,128068 433788,128092 433654,128148 433500,128304 432933,128294 432823,128260 432710,128075 432429,128029 432323,127997 432192,127997 431984,128076 431692,128108 431711,128115 431740,128423 431898,128421 431869,130196 432660,130216 432616,130139 432586,130093 432517,130030 432248,129938 431981,129908 431810,129930 431561,129830 431204,129851 431152,129945 431032,129982 430928,130129 430776,130216 430637,130215 430255,130193 430245,130216 430244,130206 430219,130222 430205,130180 430066,130806 430071,130975 430105,131174 430101,131347 430129,131640 430067,131640 430056,131743 430024,131857 429943,131894 429932)))",
        "shards": "bag",
        "_version_": 1775544736243777537,
        "typesortering": 0.5,
        "shard": "bag"
      },
      {
        "bron": "Bestuurlijke Grenzen",
        "identificatie": "1581",
        "geometrie_ll": "MULTIPOLYGON(((5.40294 51.97375,5.41351 51.97543,5.41626 51.97605,5.41877 51.97681,5.42336 51.97876,5.4313 51.98372,5.43387 51.98474,5.43732 51.98556,5.4406 51.98592,5.44482 51.98579,5.4484 51.98516,5.45237 51.98401,5.45405 51.98369,5.46269 51.98353,5.47163 51.98297,5.47322 51.98299,5.47766 51.98347,5.47785 51.98769,5.47903 51.98739,5.47974 51.9882,5.47948 51.9883,5.48064 51.98886,5.4801 51.98915,5.48033 51.98933,5.47919 51.99014,5.4803 51.99109,5.47962 51.99171,5.47986 51.99181,5.48381 51.98828,5.48462 51.98778,5.48608 51.99085,5.48529 51.99097,5.4909 51.99656,5.49287 51.99609,5.4938 51.99507,5.4942 51.9949,5.49829 51.99988,5.52938 52.04025,5.52855 52.0407,5.52683 52.04105,5.526 52.04137,5.51742 52.04675,5.51749 52.04687,5.51643 52.04776,5.51591 52.05261,5.51499 52.05263,5.51568 52.05419,5.51416 52.05489,5.513 52.05511,5.51192 52.0551,5.50944 52.05553,5.50767 52.05564,5.50478 52.05623,5.49796 52.05701,5.49462 52.05704,5.49155 52.05732,5.4893 52.05703,5.48403 52.05596,5.47719 52.05285,5.46714 52.05121,5.46605 52.05079,5.4657 52.05081,5.46543 52.05058,5.46346 52.04987,5.46355 52.04935,5.46088 52.04864,5.46114 52.04726,5.46029 52.0474,5.4563 52.04879,5.45352 52.04998,5.44853 52.04312,5.4457 52.04526,5.4416 52.04569,5.43519 52.04785,5.42987 52.05287,5.42982 52.05395,5.42864 52.05534,5.42834 52.05631,5.42868 52.05728,5.43034 52.05889,5.4309 52.0591,5.43281 52.05914,5.43511 52.05952,5.43579 52.06021,5.43645 52.06161,5.43726 52.06734,5.43785 52.06768,5.43747 52.06777,5.43744 52.06804,5.43832 52.07035,5.43747 52.07202,5.43697 52.07229,5.43599 52.07251,5.43558 52.07288,5.43474 52.07278,5.43338 52.07229,5.42891 52.07256,5.42557 52.07216,5.42458 52.0723,5.42265 52.073,5.42206 52.07296,5.41758 52.07139,5.41262 52.07041,5.41039 52.06918,5.41005 52.06941,5.40935 52.06898,5.40894 52.06837,5.4019 52.0643,5.40053 52.06475,5.39896 52.06694,5.40082 52.06783,5.39954 52.06921,5.40537 52.071,5.4048 52.07205,5.40706 52.07258,5.40589 52.07522,5.4035 52.07568,5.39866 52.07486,5.39749 52.07481,5.39574 52.07508,5.39145 52.07458,5.39104 52.07509,5.38982 52.07567,5.38834 52.07493,5.38784 52.07572,5.38453 52.07827,5.38129 52.0784,5.34902 52.08206,5.33225 52.08416,5.33261 52.07874,5.3281 52.07521,5.32621 52.0741,5.32163 52.07078,5.32042 52.07033,5.29076 52.08657,5.26527 52.07015,5.25789 52.06588,5.25724 52.06506,5.25642 52.063,5.25228 52.06212,5.24814 52.05898,5.24699 52.0584,5.24879 52.05741,5.2501 52.05639,5.25123 52.05482,5.25138 52.05394,5.25168 52.05396,5.25131 52.05354,5.25162 52.05304,5.25154 52.05203,5.24991 52.05105,5.24971 52.05031,5.24881 52.04953,5.24831 52.04764,5.24801 52.04741,5.25104 52.04576,5.25014 52.04491,5.25009 52.04442,5.24981 52.04413,5.24984 52.04291,5.24897 52.04217,5.24948 52.04101,5.25048 52.04007,5.25081 52.03938,5.25268 52.0386,5.25394 52.03837,5.25513 52.03795,5.25643 52.03834,5.2578 52.03829,5.25803 52.03764,5.25858 52.03726,5.25753 52.03685,5.25728 52.03646,5.25768 52.0342,5.25736 52.0334,5.25702 52.03334,5.2575 52.03268,5.25865 52.0323,5.2618 52.03175,5.26231 52.03145,5.26388 52.03197,5.26438 52.03118,5.26575 52.03031,5.26773 52.02993,5.26923 52.02922,5.26939 52.02823,5.27086 52.02748,5.26324 52.02438,5.2659 52.02215,5.26988 52.01833,5.27067 52.01719,5.27169 52.01461,5.27891 52.01086,5.288 52.00992,5.29122 52.00835,5.31465 52.027,5.31874 52.02529,5.32399 52.02283,5.34068 52.02034,5.34429 52.02019,5.34656 52.01902,5.34823 52.01723,5.35026 52.01604,5.35235 52.01523,5.35629 52.01329,5.38155 52.00217,5.39891 52.00292,5.40336 52.00135,5.41528 51.9967,5.39942 51.98795,5.38535 51.98689,5.37839 51.98612,5.38759 51.97631,5.38938 51.97639,5.39416 51.97593,5.39495 51.97444,5.39343 51.9742,5.39201 51.9734,5.39177 51.97266,5.39215 51.97218,5.39265 51.97197,5.39052 51.97125,5.39098 51.97073,5.39758 51.97269,5.40294 51.97375)))",
        "provinciecode": "PV26",
        "type": "gemeente",
        "provincienaam": "Utrecht",
        "centroide_ll": "POINT(5.38832134 52.03471452)",
        "gemeentecode": "1581",
        "weergavenaam": "Gemeente Utrechtse Heuvelrug",
        "suggest": ["Gemeente Utrechtse Heuvelrug"],
        "geometrie_rd": "MULTIPOLYGON(((156081 442816,156808 443002,156996 443071,157169 443156,157484 443373,158030 443926,158206 444039,158443 444130,158668 444170,158958 444156,159204 444087,159477 443958,159592 443924,160186 443906,160800 443844,160909 443847,161214 443901,161227 444370,161307 444337,161357 444426,161338 444438,161418 444501,161381 444533,161397 444553,161318 444642,161394 444749,161348 444818,161364 444829,161636 444436,161692 444380,161792 444723,161737 444735,162121 445358,162257 445306,162321 445193,162349 445174,162629 445728,164755 450223,164698 450273,164579 450312,164523 450347,163933 450945,163937 450958,163865 451058,163828 451597,163765 451599,163812 451773,163708 451850,163628 451875,163554 451874,163384 451921,163262 451933,163064 451998,162596 452085,162367 452087,162157 452119,162002 452086,161641 451966,161173 451620,160483 451437,160408 451389,160385 451392,160366 451366,160231 451287,160237 451230,160054 451150,160072 450996,160014 451012,159740 451167,159549 451298,159207 450535,159013 450773,158732 450821,158292 451060,157926 451618,157923 451739,157842 451894,157821 452001,157845 452110,157958 452289,157997 452312,158128 452317,158285 452359,158332 452435,158377 452591,158432 453229,158473 453267,158446 453277,158445 453307,158504 453564,158446 453749,158412 453779,158345 453805,158317 453845,158259 453834,158166 453780,157859 453810,157631 453764,157563 453781,157431 453858,157390 453853,157083 453679,156742 453569,156590 453433,156566 453458,156519 453411,156490 453343,156008 452890,155914 452939,155806 453183,155933 453283,155846 453436,156245 453635,156206 453752,156361 453811,156281 454105,156117 454156,155786 454065,155705 454059,155585 454089,155291 454033,155263 454090,155180 454154,155078 454072,155044 454160,154817 454444,154595 454458,152382 454867,151233 455101,151258 454498,150948 454105,150818 453982,150504 453613,150421 453562,148390 455371,146640 453547,146133 453074,146088 452982,146032 452753,145747 452655,145463 452306,145384 452243,145507 452132,145596 452018,145674 451843,145684 451745,145704 451748,145679 451701,145700 451646,145695 451534,145582 451424,145569 451342,145506 451255,145472 451045,145451 451020,145659 450835,145597 450741,145594 450686,145574 450655,145576 450519,145516 450436,145551 450308,145619 450203,145642 450125,145770 450039,145856 450013,145938 449966,146027 450010,146121 450003,146137 449932,146175 449889,146102 449843,146085 449800,146112 449548,146090 449460,146067 449453,146099 449379,146178 449338,146395 449276,146429 449242,146537 449300,146571 449212,146665 449115,146801 449072,146904 448993,146914 448883,147015 448800,146492 448455,146674 448207,146947 447781,147000 447654,147070 447367,147565 446950,148189 446844,148410 446669,150021 448742,150301 448551,150661 448277,151807 448000,152055 447983,152210 447852,152325 447653,152464 447521,152607 447431,152878 447214,154612 445977,155804 446061,156109 445886,156928 445369,155839 444395,154873 444277,154395 444191,155027 443100,155149 443109,155478 443058,155532 442892,155428 442865,155330 442777,155314 442694,155340 442640,155374 442617,155228 442537,155259 442479,155713 442697,156081 442816)))",
        "provincieafkorting": "UT",
        "centroide_rd": "POINT(155076.735 449597.958)",
        "id": "gem-79f2df23df8ee16a3dc53b081ef11124",
        "gemeentenaam": "Utrechtse Heuvelrug",
        "shards": "bag",
        "_version_": 1775544800155533314,
        "typesortering": 1.0,
        "shard": "bag"
      },
      {
        "bron": "BAG",
        "identificatie": "3295",
        "provinciecode": "PV26",
        "woonplaatscode": "3295",
        "type": "woonplaats",
        "woonplaatsnaam": "Utrecht",
        "provincienaam": "Utrecht",
        "centroide_ll": "POINT(5.09520363 52.0886922)",
        "gemeentecode": "0344",
        "rdf_seealso": "http://bag.basisregistraties.overheid.nl/bag/id/woonplaats/3295",
        "weergavenaam": "Utrecht, Utrecht, Utrecht",
        "suggest": ["Utrecht, Utrecht, Utrecht"],
        "geometrie_rd": "MULTIPOLYGON(((129515 458479,129541 458468,129553 458525,129617 458504,129637 458566,129758 458526,129768 458556,129957 458486,129916 458365,130164 458255,130172 458278,130220 458255,130212 458233,130323 458185,130377 458287,130440 458464,130454 458574,130485 458605,130517 458605,130559 458579,130827 458375,130837 458332,130794 458238,130822 458234,130816 458223,130791 458231,130724 458092,130641 457992,130639 457970,130679 457948,130677 457919,130770 457798,130752 457702,130646 457686,130449 457080,130433 457082,130368 456882,130338 456834,130425 456778,130440 456792,130471 456712,130529 456667,130617 456685,130694 456663,130708 456682,130699 456659,130771 456606,130787 456612,130778 456601,130906 456462,131038 456265,131184 455958,131208 455867,131214 455718,131276 455621,131334 455685,131399 455723,131403 455745,131445 455744,131470 455780,131776 455770,131760 455468,131744 455467,131733 455322,131903 455325,131870 455008,132099 455000,132108 455105,132112 455082,132180 455078,132179 455067,132241 455062,132240 455051,132281 455055,132281 454973,132326 454973,132331 455023,132399 455021,132394 454974,132430 454973,132435 455019,132451 455019,132453 455044,132469 455042,132467 455020,132528 455021,132548 455007,132554 454974,132579 454974,132569 454904,132589 454895,132584 454852,132555 454853,132548 454832,132657 454810,132566 454509,132457 454545,132053 453291,130402 453658,130045 453137,129963 452925,129901 452867,129730 452780,129617 452603,129645 452579,129925 452008,130015 451984,130211 452011,130303 451960,130292 451875,130370 451811,130377 451781,130386 451636,130339 451548,130392 451429,130870 450887,130968 450812,131048 450706,131144 450556,131442 449858,131561 449656,131853 449224,131967 449131,131995 449225,132225 449096,132196 448999,132614 448710,132682 448759,132756 448774,132760 448887,132717 448968,132718 449014,132766 449100,132794 450021,132796 450298,132780 450344,132801 450413,132808 450598,132797 450598,132819 450734,132841 451500,132859 451651,132922 451949,132979 451931,133104 452366,133127 452361,133204 452589,133283 452666,133427 452700,133626 452706,133769 452683,134041 452593,134308 452587,134305 452560,134321 452557,134348 452578,134576 452545,134664 452508,134787 452364,134900 452313,134974 452310,135122 452393,135444 451811,135522 451616,135601 451329,135725 451364,135803 451338,135877 451558,135944 451939,136014 452158,136075 452261,136213 452211,136205 452191,136407 452125,136520 452071,136700 451905,136712 451833,136765 451818,136811 451806,136959 451916,136979 451916,137645 451791,138112 451678,138202 451647,138218 451627,138256 451639,138437 451611,138487 451636,138693 451909,138804 452009,139264 452252,139206 452817,139356 452989,139304 453014,139387 453244,139274 453320,139183 453428,139135 453596,139125 453711,139165 453839,139237 453933,139334 454211,139409 454298,139422 454360,139455 454415,139465 454506,139438 454606,139438 454694,139475 454723,139535 454646,139561 454545,139589 454506,139648 454451,139898 454290,140221 454511,140350 454489,140382 454450,140406 454462,140747 454423,140891 454233,141076 454305,141297 454315,141384 454352,141525 454368,141662 454422,141834 454358,141673 455329,141505 455342,141466 455361,141223 456094,141126 456113,140982 456250,140849 456282,140839 456118,140582 456143,140576 456205,140527 456224,140517 456149,140160 456208,139849 456186,139665 456225,139672 456241,139564 456277,139553 456251,139492 456282,139391 456424,139247 456702,139185 456681,139169 456730,139566 457688,139384 457745,139358 457740,139299 457787,139249 457791,139216 457842,138777 458098,138685 458391,138694 458386,138658 458596,138712 458858,138707 458946,138670 459037,138628 459092,138543 459156,138326 459216,138273 459190,138250 459209,138220 459136,138202 459144,138200 459226,138171 459248,138081 459180,138097 459226,137148 459631,135821 460594,135567 460220,135490 460274,135461 460278,135409 460221,134458 460873,133701 459917,133678 459935,133437 459726,133380 459830,133292 459933,133261 459902,133260 459848,133089 459776,133071 459803,132674 459422,131926 460119,131743 460251,131566 460119,131596 460083,131434 459938,131284 459753,131124 459488,130988 459200,130956 459120,130966 459114,130786 458780,130741 458805,130717 458786,130670 458818,130678 458834,130581 458909,130488 459035,130466 459054,130456 459042,130329 459158,129907 459595,129911 459613,129891 459633,129876 459625,129411 460107,129170 460164,128765 458972,128899 458938,128910 458964,128960 458948,128954 458927,129055 458874,129130 458850,129137 458874,129224 458845,129191 458746,129239 458728,129234 458712,129254 458705,129240 458662,129287 458661,129284 458646,129419 458593,129432 458633,129467 458619,129468 458571,129537 458539,129515 458479)))",
        "provincieafkorting": "UT",
        "centroide_rd": "POINT(134987.52 455643.648)",
        "id": "wpl-d7676180b7f172bcb7356429b19563a5",
        "gemeentenaam": "Utrecht",
        "geometrie_ll": "MULTIPOLYGON(((5.01514 52.11395,5.01553 52.11385,5.01569 52.11436,5.01663 52.11418,5.01691 52.11474,5.01869 52.11438,5.01883 52.11465,5.0216 52.11404,5.02101 52.11295,5.02464 52.11197,5.02475 52.11217,5.02545 52.11197,5.02534 52.11177,5.02696 52.11135,5.02774 52.11226,5.02864 52.11386,5.02885 52.11484,5.0293 52.11513,5.02977 52.11513,5.03037 52.1149,5.03431 52.11307,5.03446 52.11269,5.03383 52.11184,5.03424 52.11181,5.03416 52.11171,5.03379 52.11178,5.03283 52.11052,5.03161 52.10963,5.03159 52.10942,5.03217 52.10924,5.03215 52.10897,5.03352 52.10789,5.03326 52.10702,5.03171 52.10687,5.02888 52.10142,5.02864 52.10144,5.02772 52.09963,5.02728 52.09921,5.02855 52.09871,5.02876 52.09883,5.02923 52.09811,5.03008 52.09771,5.03136 52.09788,5.03248 52.09769,5.03269 52.09785,5.03256 52.09765,5.03362 52.09717,5.03384 52.09723,5.03371 52.09713,5.03559 52.09588,5.03754 52.09412,5.03968 52.09137,5.04005 52.09055,5.04014 52.08921,5.04106 52.08834,5.04189 52.08892,5.04283 52.08927,5.0429 52.08946,5.04351 52.08945,5.04387 52.08978,5.04833 52.0897,5.04812 52.08699,5.04789 52.08697,5.04774 52.08567,5.05022 52.08571,5.04976 52.08286,5.0531 52.0828,5.05323 52.08374,5.05329 52.08353,5.05428 52.0835,5.05426 52.0834,5.05517 52.08336,5.05515 52.08326,5.05575 52.08329,5.05576 52.08256,5.05642 52.08256,5.05648 52.08301,5.05748 52.08299,5.05741 52.08257,5.05792 52.08257,5.058 52.08298,5.05823 52.08298,5.05826 52.0832,5.0585 52.08319,5.05846 52.08299,5.05936 52.083,5.05965 52.08288,5.05974 52.08258,5.0601 52.08258,5.05997 52.08195,5.06025 52.08187,5.06019 52.08149,5.05976 52.08149,5.05966 52.08131,5.06126 52.08111,5.05995 52.0784,5.05835 52.07872,5.05254 52.06743,5.02844 52.07066,5.02327 52.06596,5.02209 52.06405,5.0212 52.06353,5.01871 52.06274,5.01707 52.06114,5.01748 52.06093,5.02161 52.05581,5.02292 52.0556,5.02578 52.05585,5.02712 52.0554,5.02696 52.05463,5.02811 52.05406,5.02821 52.05379,5.02835 52.05249,5.02767 52.0517,5.02845 52.05062,5.03547 52.04577,5.0369 52.04511,5.03806 52.04415,5.03949 52.04281,5.04387 52.03655,5.04561 52.03474,5.04991 52.03087,5.05157 52.03004,5.05198 52.03089,5.05534 52.02974,5.05491 52.02887,5.06102 52.02628,5.06202 52.02672,5.06309 52.02687,5.06314 52.02788,5.06251 52.0286,5.06252 52.02902,5.06321 52.0298,5.06357 52.03808,5.06358 52.04056,5.06334 52.04097,5.06365 52.0416,5.06373 52.04326,5.06357 52.04326,5.06388 52.04448,5.06416 52.05137,5.0644 52.05272,5.06531 52.05541,5.06613 52.05525,5.06793 52.05917,5.06827 52.05912,5.06938 52.06117,5.07053 52.06187,5.07261 52.06218,5.07553 52.06223,5.07761 52.06204,5.08158 52.06124,5.08547 52.06119,5.08543 52.06095,5.08566 52.06092,5.08606 52.06111,5.08939 52.06083,5.09067 52.0605,5.09247 52.05921,5.09412 52.05875,5.09521 52.05873,5.09735 52.05948,5.10209 52.05426,5.10324 52.05251,5.1044 52.04994,5.1062 52.05026,5.10734 52.05003,5.10842 52.05201,5.10936 52.05543,5.11038 52.0574,5.11126 52.05832,5.11328 52.05788,5.11316 52.0577,5.11611 52.05712,5.11775 52.05664,5.1204 52.05515,5.12057 52.0545,5.12134 52.05437,5.12201 52.05427,5.12417 52.05526,5.12446 52.05526,5.13417 52.05416,5.14099 52.05315,5.1423 52.05288,5.14253 52.0527,5.14309 52.05281,5.14573 52.05256,5.14646 52.05279,5.14945 52.05525,5.15106 52.05615,5.15776 52.05834,5.15689 52.06343,5.15906 52.06498,5.1583 52.0652,5.1595 52.06726,5.15785 52.06795,5.15653 52.06891,5.15582 52.07042,5.15566 52.07146,5.15623 52.07261,5.15729 52.07346,5.15869 52.07596,5.15978 52.07674,5.15996 52.0773,5.16044 52.07779,5.16059 52.07861,5.16018 52.07951,5.16018 52.0803,5.16072 52.08056,5.1616 52.07987,5.16199 52.07896,5.1624 52.07861,5.16326 52.07812,5.16692 52.07668,5.17161 52.07867,5.1735 52.07848,5.17397 52.07813,5.17431 52.07824,5.17929 52.0779,5.1814 52.07619,5.1841 52.07684,5.18732 52.07695,5.18859 52.07727,5.19064 52.07742,5.19264 52.07791,5.19515 52.07735,5.19276 52.08606,5.19031 52.08618,5.18974 52.08635,5.18617 52.09293,5.18475 52.09309,5.18264 52.09433,5.1807 52.09461,5.18056 52.09313,5.17681 52.09336,5.17672 52.09391,5.17601 52.09408,5.17586 52.09341,5.17065 52.09393,5.16612 52.09373,5.16343 52.09407,5.16352 52.09421,5.16196 52.09453,5.16179 52.0943,5.1609 52.09458,5.15942 52.09585,5.15731 52.09834,5.1564 52.09815,5.15617 52.09859,5.16192 52.10722,5.15926 52.10772,5.15887 52.10767,5.15801 52.1081,5.15728 52.10813,5.1568 52.10859,5.15038 52.11088,5.14901 52.11351,5.14915 52.11347,5.14861 52.11535,5.14939 52.1177,5.14931 52.11849,5.14878 52.11931,5.14816 52.1198,5.14692 52.12038,5.14373 52.12091,5.14297 52.12067,5.14262 52.12084,5.1422 52.12019,5.14193 52.12026,5.14189 52.121,5.14148 52.12119,5.14016 52.12058,5.1404 52.12099,5.12652 52.1246,5.10709 52.13321,5.1034 52.12985,5.10227 52.13032,5.10185 52.13036,5.10108 52.12984,5.08716 52.13567,5.07616 52.12705,5.07582 52.12722,5.07233 52.12533,5.07148 52.12626,5.0702 52.12718,5.06974 52.1269,5.06973 52.12641,5.06723 52.12576,5.06697 52.126,5.0612 52.12256,5.05023 52.1288,5.04756 52.12997,5.04498 52.12878,5.04542 52.12846,5.04306 52.12715,5.04088 52.12548,5.03856 52.12309,5.0366 52.12049,5.03614 52.11978,5.03628 52.11972,5.03368 52.11672,5.03302 52.11693,5.03268 52.11677,5.03198 52.11705,5.0321 52.1172,5.03068 52.11787,5.02931 52.11899,5.02899 52.11916,5.02884 52.11905,5.02697 52.12009,5.02078 52.124,5.02085 52.12416,5.02054 52.12434,5.02033 52.12427,5.0135 52.12858,5.00997 52.12908,5.00416 52.11834,5.00612 52.11804,5.00628 52.11829,5.00701 52.11814,5.00691 52.11796,5.0084 52.11748,5.0095 52.11727,5.0096 52.11748,5.01087 52.11723,5.0104 52.11634,5.01109 52.11617,5.01102 52.11603,5.01131 52.11597,5.01111 52.11558,5.0118 52.11557,5.01176 52.11544,5.01373 52.11497,5.01392 52.11533,5.01443 52.11521,5.01446 52.11478,5.01546 52.1145,5.01514 52.11395)))",
        "shards": "bag",
        "_version_": 1775544866159198209,
        "typesortering": 2.0,
        "shard": "bag"
      },
      {
        "bron": "BAG",
        "identificatie": "3298",
        "geometrie_ll": "MULTIPOLYGON(((4.97775 52.13057,4.97394 52.12967,4.97035 52.12255,4.97022 52.12267,4.9701 52.12244,4.97821 52.11284,4.97847 52.11316,4.9787 52.11306,4.97905 52.11342,4.9803 52.11516,4.98062 52.11487,4.98262 52.11427,4.98435 52.113,4.98574 52.11145,4.99059 52.10888,4.99196 52.10924,4.99329 52.11155,4.99978 52.11039,5.00316 52.11659,5.00462 52.1163,5.00503 52.11705,5.00626 52.11688,5.00707 52.11653,5.00784 52.1164,5.00774 52.1162,5.00823 52.1161,5.00827 52.11619,5.00908 52.11571,5.00894 52.11524,5.00956 52.11506,5.00963 52.11521,5.00994 52.1151,5.00979 52.11493,5.01005 52.11484,5.01037 52.11521,5.01094 52.11501,5.0108 52.11478,5.01281 52.11428,5.01295 52.11451,5.01321 52.11443,5.01297 52.11363,5.01441 52.11405,5.01507 52.11387,5.01546 52.1145,5.01446 52.11478,5.01443 52.11521,5.01392 52.11533,5.01373 52.11497,5.01176 52.11544,5.0118 52.11557,5.01111 52.11558,5.01131 52.11597,5.01102 52.11603,5.01109 52.11617,5.0104 52.11634,5.01087 52.11723,5.0096 52.11748,5.0095 52.11727,5.0084 52.11748,5.00691 52.11796,5.00701 52.11814,5.00628 52.11829,5.00612 52.11804,5.00416 52.11834,5.00997 52.12908,5.0135 52.12858,5.01162 52.13014,5.00959 52.13235,5.00731 52.13559,5.00744 52.13572,5.00719 52.13608,5.0027 52.1413,5.00257 52.14164,5.00321 52.14191,5.0031 52.14205,4.99356 52.13831,4.9864 52.13525,4.98524 52.13244,4.97775 52.13057)))",
        "provinciecode": "PV26",
        "woonplaatscode": "3298",
        "type": "woonplaats",
        "woonplaatsnaam": "Haarzuilens",
        "provincienaam": "Utrecht",
        "centroide_ll": "POINT(4.99217483 52.12464618)",
        "gemeentecode": "0344",
        "rdf_seealso": "http://bag.basisregistraties.overheid.nl/bag/id/woonplaats/3298",
        "weergavenaam": "Haarzuilens, Utrecht, Utrecht",
        "suggest": ["Haarzuilens, Utrecht, Utrecht"],
        "geometrie_rd": "MULTIPOLYGON(((126964 460342,126702 460243,126452 459452,126443 459466,126435 459440,126984 458369,127002 458404,127018 458393,127043 458433,127129 458627,127151 458594,127287 458527,127405 458384,127499 458211,127830 457923,127924 457963,128017 458220,128461 458088,128696 458777,128796 458744,128824 458828,128908 458808,128964 458769,129016 458754,129009 458732,129043 458720,129046 458731,129101 458676,129091 458625,129133 458604,129138 458621,129159 458609,129149 458589,129167 458580,129189 458620,129228 458598,129218 458573,129356 458516,129365 458542,129383 458533,129366 458444,129465 458490,129510 458469,129537 458539,129468 458571,129467 458619,129432 458633,129419 458593,129284 458646,129287 458661,129240 458662,129254 458705,129234 458712,129239 458728,129191 458746,129224 458845,129137 458874,129130 458850,129055 458874,128954 458927,128960 458948,128910 458964,128899 458938,128765 458972,129170 460164,129411 460107,129283 460281,129145 460528,128991 460889,129000 460903,128983 460944,128679 461526,128670 461564,128714 461594,128707 461610,128051 461197,127559 460860,127478 460547,126964 460342)))",
        "provincieafkorting": "UT",
        "centroide_rd": "POINT(127948.146 459677.227)",
        "id": "wpl-d026e71ba8ef05c528c22f900e1dcbc8",
        "gemeentenaam": "Utrecht",
        "shards": "bag",
        "_version_": 1775544866160246785,
        "typesortering": 2.0,
        "shard": "bag"
      },
      {
        "bron": "BAG",
        "identificatie": "3296",
        "geometrie_ll": "MULTIPOLYGON(((4.98085 52.10015,4.98933 52.10076,4.99181 52.09476,4.99253 52.09486,4.99372 52.09152,4.99697 52.09085,4.99694 52.09068,4.9984 52.0906,5.00088 52.09022,5.00127 52.09093,5.00319 52.09052,5.00278 52.08978,5.00415 52.08949,5.00386 52.08887,5.00455 52.08875,5.00478 52.08941,5.00581 52.08925,5.00573 52.08908,5.00645 52.08893,5.00661 52.08923,5.00688 52.08897,5.00849 52.08876,5.00898 52.0897,5.00975 52.08955,5.00906 52.08829,5.01138 52.08783,5.01208 52.08906,5.01279 52.08891,5.01196 52.08743,5.01231 52.08735,5.01242 52.08759,5.01488 52.08715,5.01475 52.08693,5.01494 52.08714,5.01735 52.08672,5.01759 52.08715,5.01984 52.08668,5.01966 52.0862,5.02307 52.08562,5.02326 52.08609,5.02409 52.086,5.02478 52.08892,5.02509 52.08917,5.02419 52.08985,5.02349 52.09016,5.02162 52.09033,5.02151 52.0909,5.0221 52.09118,5.02187 52.09136,5.0221 52.09153,5.0225 52.09133,5.02277 52.09153,5.02329 52.09126,5.02351 52.09143,5.02481 52.09113,5.02509 52.09125,5.02521 52.09131,5.02447 52.09159,5.02523 52.09179,5.02676 52.09263,5.02612 52.09306,5.02737 52.09378,5.02817 52.09307,5.02973 52.0933,5.0299 52.09318,5.02904 52.09305,5.02896 52.09252,5.0309 52.09226,5.03081 52.0919,5.03154 52.09183,5.03149 52.09147,5.03503 52.09121,5.03636 52.09078,5.03608 52.08949,5.03829 52.0891,5.03948 52.08906,5.04014 52.08921,5.04005 52.09055,5.03968 52.09137,5.03754 52.09412,5.03559 52.09588,5.03371 52.09713,5.03384 52.09723,5.03362 52.09717,5.03256 52.09765,5.03269 52.09785,5.03248 52.09769,5.03136 52.09788,5.03008 52.09771,5.02923 52.09811,5.02876 52.09883,5.02855 52.09871,5.02728 52.09921,5.02772 52.09963,5.02864 52.10144,5.02888 52.10142,5.03171 52.10687,5.03326 52.10702,5.03352 52.10789,5.03215 52.10897,5.03217 52.10924,5.03159 52.10942,5.03161 52.10963,5.03283 52.11052,5.03379 52.11178,5.03416 52.11171,5.03424 52.11181,5.03383 52.11184,5.03447 52.11274,5.03425 52.11311,5.0297 52.11514,5.02925 52.11512,5.02888 52.11489,5.02864 52.11386,5.02774 52.11226,5.02696 52.11135,5.02534 52.11177,5.02545 52.11197,5.02475 52.11217,5.02464 52.11197,5.02101 52.11295,5.0216 52.11404,5.01883 52.11465,5.01869 52.11438,5.01691 52.11474,5.01663 52.11418,5.01569 52.11436,5.01553 52.11385,5.01441 52.11405,5.01297 52.11363,5.01321 52.11443,5.01295 52.11451,5.01281 52.11428,5.0108 52.11478,5.01094 52.11501,5.01037 52.11521,5.01005 52.11484,5.00979 52.11493,5.00994 52.1151,5.00963 52.11521,5.00956 52.11506,5.00894 52.11524,5.00908 52.11571,5.00827 52.11619,5.00823 52.1161,5.00774 52.1162,5.00784 52.1164,5.00707 52.11653,5.00626 52.11688,5.00503 52.11705,5.00462 52.1163,5.00316 52.11659,4.99978 52.11039,4.99329 52.11155,4.99196 52.10924,4.99059 52.10888,4.98574 52.11145,4.98435 52.113,4.98262 52.11427,4.98062 52.11487,4.9803 52.11516,4.9787 52.11306,4.98023 52.11224,4.97956 52.1115,4.97984 52.11001,4.97976 52.10894,4.97936 52.10843,4.97882 52.10813,4.97655 52.10809,4.9761 52.10782,4.97558 52.10494,4.97326 52.10305,4.97292 52.10215,4.97339 52.10127,4.97566 52.09979,4.98085 52.10015)))",
        "provinciecode": "PV26",
        "woonplaatscode": "3296",
        "type": "woonplaats",
        "woonplaatsnaam": "Vleuten",
        "provincienaam": "Utrecht",
        "centroide_ll": "POINT(5.00828849 52.10196571)",
        "gemeentecode": "0344",
        "rdf_seealso": "http://bag.basisregistraties.overheid.nl/bag/id/woonplaats/3296",
        "weergavenaam": "Vleuten, Utrecht, Utrecht",
        "suggest": ["Vleuten, Utrecht, Utrecht"],
        "geometrie_rd": "MULTIPOLYGON(((127157 456956,127739 457020,127905 456353,127955 456363,128034 455991,128256 455915,128254 455896,128354 455887,128524 455844,128551 455922,128682 455876,128654 455794,128748 455761,128728 455693,128774 455679,128790 455752,128861 455734,128856 455715,128905 455698,128916 455731,128934 455702,129044 455679,129079 455784,129131 455766,129084 455626,129242 455574,129291 455711,129340 455694,129282 455529,129306 455521,129313 455547,129481 455498,129473 455473,129486 455496,129651 455448,129667 455496,129821 455443,129809 455390,130042 455324,130055 455377,130112 455367,130161 455690,130182 455718,130121 455795,130073 455829,129945 455849,129938 455912,129979 455943,129963 455963,129979 455982,130006 455959,130025 455982,130060 455952,130075 455971,130164 455936,130184 455950,130192 455957,130141 455988,130193 456010,130299 456103,130255 456151,130341 456230,130395 456151,130503 456176,130514 456163,130455 456148,130449 456090,130582 456061,130576 456020,130626 456012,130622 455973,130865 455943,130956 455893,130936 455751,131087 455706,131169 455701,131214 455718,131208 455867,131184 455958,131038 456265,130906 456462,130778 456601,130787 456612,130771 456606,130699 456659,130708 456682,130694 456663,130617 456685,130529 456667,130471 456712,130440 456792,130425 456778,130338 456834,130368 456882,130433 457082,130449 457080,130646 457686,130752 457702,130770 457798,130677 457919,130679 457948,130639 457970,130641 457992,130724 458092,130791 458231,130816 458223,130822 458234,130794 458238,130838 458338,130823 458379,130513 458606,130482 458604,130456 458579,130440 458464,130377 458287,130323 458185,130212 458233,130220 458255,130172 458278,130164 458255,129916 458365,129957 458486,129768 458556,129758 458526,129637 458566,129617 458504,129553 458525,129541 458468,129465 458490,129366 458444,129383 458533,129365 458542,129356 458516,129218 458573,129228 458598,129189 458620,129167 458580,129149 458589,129159 458609,129138 458621,129133 458604,129091 458625,129101 458676,129046 458731,129043 458720,129009 458732,129016 458754,128964 458769,128908 458808,128824 458828,128796 458744,128696 458777,128461 458088,128017 458220,127924 457963,127830 457923,127499 458211,127405 458384,127287 458527,127151 458594,127129 458627,127018 458393,127122 458302,127076 458219,127094 458053,127088 457934,127060 457878,127023 457844,126868 457841,126837 457812,126799 457491,126639 457281,126615 457182,126647 457084,126802 456918,127157 456956)))",
        "provincieafkorting": "UT",
        "centroide_rd": "POINT(129038.446 457147.95)",
        "id": "wpl-f15fd43ce050829f61e015bad222fffa",
        "gemeentenaam": "Utrecht",
        "shards": "bag",
        "_version_": 1775544866159198210,
        "typesortering": 2.0,
        "shard": "bag"
      },
      {
        "bron": "BAG",
        "identificatie": "3337",
        "geometrie_ll": "MULTIPOLYGON(((5.46583 52.02581,5.46557 52.02139,5.47137 52.02083,5.47107 52.02012,5.47365 52.01955,5.46472 52.01296,5.45019 52.00095,5.4457 51.99778,5.44556 51.99786,5.43592 51.99535,5.43204 51.99903,5.43148 51.99929,5.42722 52.0031,5.42632 52.00282,5.39942 51.98795,5.38535 51.98689,5.37839 51.98612,5.38759 51.97631,5.38938 51.97639,5.39416 51.97593,5.39495 51.97444,5.39343 51.9742,5.39201 51.9734,5.39177 51.97266,5.39215 51.97218,5.39265 51.97197,5.39052 51.97125,5.39098 51.97073,5.39589 51.97224,5.39934 51.9731,5.41351 51.97543,5.41816 51.97661,5.4206 51.97748,5.42336 51.97876,5.4313 51.98372,5.43387 51.98474,5.43732 51.98556,5.4406 51.98592,5.44482 51.98579,5.4484 51.98516,5.45237 51.98401,5.45405 51.98369,5.46269 51.98353,5.47163 51.98297,5.47322 51.98299,5.47766 51.98347,5.47785 51.98769,5.47903 51.98739,5.47974 51.9882,5.47948 51.9883,5.48064 51.98886,5.4801 51.98915,5.48033 51.98933,5.47919 51.99014,5.4803 51.99109,5.47962 51.99171,5.47986 51.99181,5.48381 51.98828,5.48462 51.98778,5.48608 51.99085,5.48529 51.99097,5.48757 51.99326,5.4909 51.99656,5.49287 51.99609,5.4938 51.99507,5.4942 51.9949,5.5034 52.0065,5.49884 52.00503,5.49797 52.01009,5.49434 52.0083,5.49241 52.01049,5.48996 52.01637,5.48983 52.01864,5.49042 52.02021,5.49029 52.02093,5.4897 52.02197,5.4889 52.02211,5.48854 52.02267,5.4879 52.02279,5.48833 52.02301,5.48709 52.02511,5.48589 52.02884,5.48638 52.02948,5.48748 52.03028,5.48873 52.03176,5.4837 52.03091,5.48215 52.0311,5.47707 52.02205,5.47691 52.02193,5.47618 52.02205,5.47614 52.02155,5.47193 52.02212,5.47319 52.02512,5.46583 52.02581)))",
        "provinciecode": "PV26",
        "woonplaatscode": "3337",
        "type": "woonplaats",
        "woonplaatsnaam": "Amerongen",
        "provincienaam": "Utrecht",
        "centroide_ll": "POINT(5.44951048 51.99605759)",
        "gemeentecode": "1581",
        "rdf_seealso": "http://bag.basisregistraties.overheid.nl/bag/id/woonplaats/3337",
        "weergavenaam": "Amerongen, Utrechtse Heuvelrug, Utrecht",
        "suggest": ["Amerongen, Utrechtse Heuvelrug, Utrecht"],
        "geometrie_rd": "MULTIPOLYGON(((160397 448610,160379 448118,160777 448057,160757 447978,160934 447915,160321 447181,159326 445844,159017 445491,159007 445499,158346 445220,158079 445628,158040 445658,157748 446082,157686 446050,155839 444395,154873 444277,154395 444191,155027 443100,155149 443109,155478 443058,155532 442892,155428 442865,155330 442777,155314 442694,155340 442640,155374 442617,155228 442537,155259 442479,155597 442647,155834 442743,156808 443002,157127 443133,157294 443231,157484 443373,158030 443926,158206 444039,158443 444130,158668 444170,158958 444156,159204 444087,159477 443958,159592 443924,160186 443906,160800 443844,160909 443847,161214 443901,161227 444370,161307 444337,161357 444426,161338 444438,161418 444501,161381 444533,161397 444553,161318 444642,161394 444749,161348 444818,161364 444829,161636 444436,161692 444380,161792 444723,161737 444735,161893 444990,162121 445358,162257 445306,162321 445193,162349 445174,162978 446465,162666 446301,162605 446864,162356 446664,162223 446908,162054 447562,162044 447815,162085 447990,162076 448070,162035 448185,161981 448201,161955 448263,161911 448276,161941 448301,161855 448534,161773 448949,161806 449021,161881 449110,161967 449274,161622 449179,161516 449200,161168 448193,161157 448180,161107 448193,161105 448137,160815 448200,160902 448533,160397 448610)))",
        "provincieafkorting": "UT",
        "centroide_rd": "POINT(159279.161 445298.914)",
        "id": "wpl-9ccbd861496d43dfd87d01b3e6be5198",
        "gemeentenaam": "Utrechtse Heuvelrug",
        "shards": "bag",
        "_version_": 1775544866175975424,
        "typesortering": 2.0,
        "shard": "bag"
      },
      {
        "bron": "BAG",
        "identificatie": "3297",
        "geometrie_ll": "MULTIPOLYGON(((5.0429 52.08946,5.04283 52.08927,5.04189 52.08892,5.04106 52.08834,5.04014 52.08921,5.03948 52.08906,5.03829 52.0891,5.03608 52.08949,5.03636 52.09078,5.03503 52.09121,5.03149 52.09147,5.03154 52.09183,5.03081 52.0919,5.0309 52.09226,5.02896 52.09252,5.02904 52.09305,5.0299 52.09318,5.02973 52.0933,5.02817 52.09307,5.02737 52.09378,5.02612 52.09306,5.02676 52.09263,5.02523 52.09179,5.02447 52.09159,5.02521 52.09131,5.02509 52.09125,5.02481 52.09113,5.02351 52.09143,5.02329 52.09126,5.02277 52.09153,5.0225 52.09133,5.0221 52.09153,5.02187 52.09136,5.0221 52.09118,5.02151 52.0909,5.02162 52.09033,5.02349 52.09016,5.02419 52.08985,5.02509 52.08917,5.02478 52.08892,5.02409 52.086,5.02326 52.08609,5.02291 52.08558,5.01966 52.0862,5.01984 52.08668,5.01759 52.08715,5.01735 52.08672,5.01494 52.08714,5.01475 52.08693,5.01488 52.08715,5.01242 52.08759,5.01231 52.08735,5.01196 52.08743,5.01279 52.08891,5.01208 52.08906,5.01138 52.08783,5.00906 52.08829,5.00975 52.08955,5.00898 52.0897,5.00849 52.08876,5.00688 52.08897,5.00661 52.08923,5.00645 52.08893,5.00573 52.08908,5.00581 52.08925,5.00478 52.08941,5.00455 52.08875,5.00386 52.08887,5.00415 52.08949,5.00278 52.08978,5.00319 52.09052,5.00127 52.09093,5.00088 52.09022,4.9984 52.0906,4.99694 52.09068,4.99697 52.09085,4.99372 52.09152,4.99389 52.09072,4.99422 52.09037,5.00501 52.08849,5.00323 52.07796,5.00164 52.07829,4.9995 52.06613,5.00162 52.06562,5.00976 52.06412,5.01244 52.06339,5.01801 52.06222,5.01871 52.06274,5.0212 52.06353,5.02209 52.06405,5.02327 52.06596,5.02844 52.07066,5.05254 52.06743,5.05835 52.07872,5.05995 52.0784,5.06126 52.08111,5.05966 52.08131,5.05976 52.08149,5.06019 52.08149,5.06025 52.08187,5.05997 52.08195,5.0601 52.08258,5.05974 52.08258,5.05965 52.08288,5.05936 52.083,5.05846 52.08299,5.0585 52.08319,5.05826 52.0832,5.05823 52.08298,5.058 52.08298,5.05792 52.08257,5.05741 52.08257,5.05748 52.08299,5.05648 52.08301,5.05642 52.08256,5.05576 52.08256,5.05575 52.08329,5.05515 52.08326,5.05517 52.08336,5.05426 52.0834,5.05428 52.0835,5.05329 52.08353,5.05323 52.08374,5.0531 52.0828,5.04976 52.08286,5.05022 52.08571,5.04774 52.08567,5.04789 52.08697,5.04812 52.08699,5.04833 52.0897,5.04396 52.08979,5.0435 52.08945,5.0429 52.08946)))",
        "provinciecode": "PV26",
        "woonplaatscode": "3297",
        "type": "woonplaats",
        "woonplaatsnaam": "De Meern",
        "provincienaam": "Utrecht",
        "centroide_ll": "POINT(5.02740209 52.0776684)",
        "gemeentecode": "0344",
        "rdf_seealso": "http://bag.basisregistraties.overheid.nl/bag/id/woonplaats/3297",
        "weergavenaam": "De Meern, Utrecht, Utrecht",
        "suggest": ["De Meern, Utrecht, Utrecht"],
        "geometrie_rd": "MULTIPOLYGON(((131403 455745,131399 455723,131334 455685,131276 455621,131214 455718,131169 455701,131087 455706,130936 455751,130956 455893,130865 455943,130622 455973,130626 456012,130576 456020,130582 456061,130449 456090,130455 456148,130514 456163,130503 456176,130395 456151,130341 456230,130255 456151,130299 456103,130193 456010,130141 455988,130192 455957,130184 455950,130164 455936,130075 455971,130060 455952,130025 455982,130006 455959,129979 455982,129963 455963,129979 455943,129938 455912,129945 455849,130073 455829,130121 455795,130182 455718,130161 455690,130112 455367,130055 455377,130031 455320,129809 455390,129821 455443,129667 455496,129651 455448,129486 455496,129473 455473,129481 455498,129313 455547,129306 455521,129282 455529,129340 455694,129291 455711,129242 455574,129084 455626,129131 455766,129079 455784,129044 455679,128934 455702,128916 455731,128905 455698,128856 455715,128861 455734,128790 455752,128774 455679,128728 455693,128748 455761,128654 455794,128682 455876,128551 455922,128524 455844,128354 455887,128254 455896,128256 455915,128034 455991,128045 455902,128067 455863,128806 455649,128678 454479,128569 454516,128415 453164,128560 453107,129118 452937,129301 452854,129682 452722,129730 452780,129901 452867,129963 452925,130045 453137,130402 453658,132053 453291,132457 454545,132566 454509,132657 454810,132548 454832,132555 454853,132584 454852,132589 454895,132569 454904,132579 454974,132554 454974,132548 455007,132528 455021,132467 455020,132469 455042,132453 455044,132451 455019,132435 455019,132430 454973,132394 454974,132399 455021,132331 455023,132326 454973,132281 454973,132281 455055,132240 455051,132241 455062,132179 455067,132180 455078,132112 455082,132108 455105,132099 455000,131870 455008,131903 455325,131733 455322,131744 455467,131760 455468,131776 455770,131476 455781,131445 455743,131403 455745)))",
        "provincieafkorting": "UT",
        "centroide_rd": "POINT(130334.623 454438.014)",
        "id": "wpl-37eaac1d90a16cec7d6ead9c5e68fccd",
        "gemeentenaam": "Utrecht",
        "shards": "bag",
        "_version_": 1775544866160246784,
        "typesortering": 2.0,
        "shard": "bag"
      }
    ]
  },
  "highlighting": {
    "gem-df0ca8ab37eccea5217e2a13f74d2833": {
      "suggest": ["Gemeente <b>Utrecht</b>"]
    },
    "pro-3c35250f0081bd7bc08056e290fbceb4": {
      "suggest": ["Provincie <b>Utrecht</b>"]
    },
    "gem-79f2df23df8ee16a3dc53b081ef11124": {
      "suggest": ["Gemeente <b>Utrechtse</b> Heuvelrug"]
    },
    "wpl-d7676180b7f172bcb7356429b19563a5": {
      "suggest": ["<b>Utrecht</b>, <b>Utrecht</b>, <b>Utrecht</b>"]
    },
    "wpl-d026e71ba8ef05c528c22f900e1dcbc8": {
      "suggest": ["Haarzuilens, <b>Utrecht</b>, <b>Utrecht</b>"]
    },
    "wpl-f15fd43ce050829f61e015bad222fffa": {
      "suggest": ["Vleuten, <b>Utrecht</b>, <b>Utrecht</b>"]
    },
    "wpl-9ccbd861496d43dfd87d01b3e6be5198": {
      "suggest": ["Amerongen, <b>Utrechtse</b> Heuvelrug, <b>Utrecht</b>"]
    },
    "wpl-37eaac1d90a16cec7d6ead9c5e68fccd": {
      "suggest": ["De Meern, <b>Utrecht</b>, <b>Utrecht</b>"]
    }
  },
  "spellcheck": {
    "suggestions": [],
    "collations": []
  }
}
