{
  "BAG": {
    "referenceDate": "2022-05",
    "url": "https://bagviewer.kadaster.nl",
    "updateFrequency": "Jaarlijks"
  },
  "BAGdownload": {
    "referenceDate": "2023-09",
    "url": "https://bagviewer.kadaster.nl",
    "updateFrequency": "Jaarlijks"
  },
  "BAGverblijfsobject": {
    "referenceDate": "2023-05",
    "url": "https://bagviewer.kadaster.nl",
    "updateFrequency": "Jaarlijks"
  },
  "BAGverblijfsobjectDownload": {
    "referenceDate": "2023-05",
    "url": "https://bagviewer.kadaster.nl",
    "updateFrequency": "Jaarlijks"
  },
  "RVO": {
    "referenceDate": "2022-07",
    "updateFrequency": "Jaarlijks"
  },
  "CBS": {
    "referenceDate": "2019"
  },
  "CBS": {
    "referenceDate": "2019",
    "url": "https://opendata.cbs.nl/statline/#/CBS/nl/dataset/84286NED/table?dl=6A021",
    "desc": "Kerncijfers wijken en buurten 2018"
  },
  "CBSpc6": {
    "referenceDate": "2022",
    "url": "https://www.cbs.nl/nl-nl/dossier/nederland-regionaal/geografische-data/gegevens-per-postcode",
    "updateFrequency": "Jaarlijks"
  },
  "CBSEigenaren": {
    "url": "https://www.cbs.nl/nl-nl/maatwerk/2021/02/energie-indicatoren-naar-regio-2018",
    "referenceDate": "2018",
    "updateFrequency": "Eenmalig maatwerk"
  },
  "CBSkookgas": {
    "referenceDate": "2020-01-01",
    "url": "https://www.cbs.nl/nl-nl/maatwerk/2021/47/woningen-met-kookgasaansluitingen-2020"
  },
  "CBSEnergieIndicatoren": {
    "url": "https://www.cbs.nl/nl-nl/maatwerk/2021/02/energie-indicatoren-naar-regio-2018",
    "referenceDate": "2018"
  },
  "CBSBereidheid": {
    "url": "https://www.cbs.nl/nl-nl/maatwerk/2023/14/bereidheid-energietransitiemaatregelen-2021",
    "referenceDate": "2021-01-01",
    "updateFrequency": "Eenmalig maatwerk"
  },
  "CBSArmoede": {
    "referenceDate": "2021",
    "url": "https://www.cbs.nl/nl-nl/maatwerk/2023/47/monitor-energiearmoede-2021",
    "updateFrequency": "Eenmalig maatwerk"
  },
  "energie": {
    "referenceDate": "2021-01-01",
    "url": "https://data.overheid.nl/datasets?sort=score%20desc%2C%20sys_modified%20desc&search=kleinverbruik&facet_theme%5B0%5D=http%3A//standaarden.overheid.nl/owms/terms/Natuur_en_milieu%7Chttp%3A//standaarden.overheid.nl/owms/terms/Energie",
    "updateFrequency": "Jaarlijks"
  },
  "BAG3D": {
    "referenceDate": "2022-05",
    "url": "https://bagviewer.kadaster.nl",
    "updateFrequency": "Jaarlijks"
  },
  "EDSN": {
    "referenceDate": "2022-09",
    "updateFrequency": "Jaarlijks"
  },

  "KVK": {
    "referenceDate": "2024-02",
    "updateFrequency": "Maandelijks",
    "url": ""
  },
  "RDW": {
    "url": "https://opendata.rdw.nl/browse?category=Erkende+bedrijven&provenance=official",
    "referenceDate": "2023-11-28",
    "updateFrequency": "2x per week"
  },
  "BOVAG": {
    "referenceDate": "2023-11-28",
    "url": "https://www.bovag.nl/",
    "updateFrequency": "2x per week"
  },
  "Eigendom": {
    "referenceDate": "2020-11"
  },
  "klimaateffectatlas": {
    "referenceDate": "2018",
    "url": "https://www.klimaateffectatlas.nl/nl/"
  },
  "ruimtelijkeplannen": {
    "url": "https://nationaalgeoregister.nl/geonetwork/srv/dut/catalog.search#/metadata/17716ed7-ce0d-4bfd-8868-a398e5578a88?tab=general",
    "referenceDate": "2023-10-01",
    "updateFrequency": "Maandelijks geactualiseerd"
  }
}
