{
  "version": 8,
  "name": "openmaptilesTopoLight",
  "glyphs": "https://files.commondatafactory.nl/maputilities/glyphs/{fontstack}/{range}.pbf",
  "sprite": "https://files.commondatafactory.nl/maputilities/sprites/cdfSprite_v1",
  "sources": {
    "openmaptiles": {
      "type": "vector",
      "url": "https://files.commondatafactory.nl/tiles/osmnl202205/v3.json"
    }
  },
  "light": {
    "anchor": "viewport",
    "color": "white",
    "intensity": 0.4
  },
  "layers": [
    {
      "id": "background",
      "type": "background",
      "paint": {
        "background-color": "#F8F9FC"
      }
    },
    {
      "id": "park",
      "type": "fill",
      "source": "openmaptiles",
      "source-layer": "park",
      "minzoom": 8,
      "maxzoom": 22,
      "paint": {
        "fill-color": [
          "interpolate",
          ["linear"],
          ["zoom"],
          12,
          "#C5D0B8",
          13,
          "#EAEEE7"
        ],
        "fill-outline-color": [
          "interpolate",
          ["linear"],
          ["zoom"],
          12,
          "#C5D0B8",
          13,
          "#EAEEE7"
        ]
      }
    },
    {
      "id": "residential",
      "type": "fill",
      "source": "openmaptiles",
      "source-layer": "landuse",
      "minzoom": 4,
      "maxzoom": 22,
      "filter": [
        "all",
        ["has", "class"],
        ["in", "class", "residential", "retail", "suburb", "neighbourhood"]
      ],
      "paint": {
        "fill-color": [
          "interpolate",
          ["linear"],
          ["zoom"],
          13,
          ["match", ["get", "class"], "retail", "#E4E1DA", "#E0E0E0"],
          14,
          "#F8F9FC"
        ],
        "fill-outline-color": [
          "interpolate",
          ["linear"],
          ["zoom"],
          13,
          "#E0E0E0",
          14,
          "#E0E0E0"
        ]
      }
    },
    {
      "id": "industrial",
      "type": "fill",
      "source": "openmaptiles",
      "source-layer": "landuse",
      "minzoom": 9,
      "maxzoom": 22,
      "filter": ["all", ["has", "class"], ["in", "class", "industrial"]],
      "paint": {
        "fill-color": "#E8DDD8",
        "fill-outline-color": [
          "interpolate",
          ["linear"],
          ["zoom"],
          13,
          "#BDBDBD",
          14,
          "#E0E0E0"
        ]
      }
    },
    {
      "id": "landuse_other",
      "type": "fill",
      "source": "openmaptiles",
      "source-layer": "landuse",
      "minzoom": 9,
      "maxzoom": 22,
      "filter": [
        "all",
        ["has", "class"],
        [
          "!in",
          "class",
          "retail",
          "residential",
          "industrial",
          "suburb",
          "neighbourhood",
          "quarter",
          "grass"
        ]
      ],
      "paint": {
        "fill-opacity": 0.8,
        "fill-color": [
          "match",
          ["get", "class"],
          "railway",
          "#e7e1dd",
          "cementry",
          "#efeff0",
          "track",
          "#e7e1dd",
          "playground",
          "#C5D0B8",
          "theme_park",
          "#C5D0B8",
          "zoo",
          "#C5D0B8",
          "commercial",
          "#f6f3ec",
          "hospital",
          "#e9bea6",
          "garages",
          "#e7e1dd",
          "bus_station",
          "#ebdcd0",
          "school",
          "#efeff0",
          "university",
          "#efeff0",
          "kindergarten",
          "#efeff0",
          "college",
          "#efeff0",
          "library",
          "#efeff0",
          "dam",
          "#e7e1dd",
          "stadium",
          "#e7e1dd",
          "pitch",
          "#e7e1dd",
          "education",
          "#efeff0",
          "#F8F9FC"
        ]
      }
    },
    {
      "id": "landcover",
      "type": "fill",
      "source": "openmaptiles",
      "source-layer": "landcover",
      "minzoom": 7,
      "maxzoom": 22,
      "paint": {
        "fill-color": [
          "match",
          ["get", "subclass"],
          "heath",
          "#E4DBDD",
          [
            "match",
            ["get", "class"],
            "wood",
            "#C5D0B8",
            "grass",
            "#EAEEE7",
            "farmland",
            "#F0F1EE",
            "sand",
            "#F3E9D1",
            "wetland",
            "#F0F1EE",
            "ice",
            "#F8F9FC",
            "#F8F9FC"
          ]
        ]
      }
    },
    {
      "id": "water",
      "type": "fill",
      "source": "openmaptiles",
      "source-layer": "water",
      "minzoom": 0,
      "maxzoom": 22,
      "paint": {
        "fill-color": "#B3CBD7",
        "fill-outline-color": "#B3CBD7"
      }
    },
    {
      "id": "water-way",
      "type": "line",
      "source": "openmaptiles",
      "source-layer": "waterway",
      "minzoom": 3,
      "maxzoom": 22,
      "paint": {
        "line-color": "#B3CBD7",
        "line-width": ["interpolate", ["linear"], ["zoom"], 3, 3, 14, 1, 16, 2]
      }
    },
    {
      "id": "bridges_and_piers",
      "type": "fill",
      "source": "openmaptiles",
      "source-layer": "transportation",
      "minzoom": 5,
      "maxzoom": 22,
      "filter": [
        "all",
        ["==", ["geometry-type"], "Polygon"],
        ["!=", ["get", "class"], "path"]
      ],
      "paint": {
        "fill-color": "#F8F9FC"
      }
    },
    {
      "id": "roads_casing",
      "type": "line",
      "source": "openmaptiles",
      "source-layer": "transportation",
      "minzoom": 5,
      "maxzoom": 22,
      "filter": [
        "all",
        ["==", ["geometry-type"], "LineString"],
        ["has", "class"],
        [
          "any",
          ["==", ["get", "class"], "motorway"],
          ["==", ["get", "class"], "trunk"],
          ["==", ["get", "class"], "primary"],
          ["==", ["get", "class"], "secondary"],
          ["==", ["get", "class"], "tertiary"],
          ["==", ["get", "class"], "minor"],
          ["==", ["get", "class"], "pier"]
        ]
      ],
      "layout": {
        "line-join": "round",
        "line-cap": "round"
      },
      "paint": {
        "line-color": [
          "match",
          ["get", "class"],
          "motorway",
          "#585E66",
          "trunk",
          "#616161",
          "primary",
          "#9E9E9E",
          "secondary",
          "#9E9E9E",
          "pier",
          "#F8F9FC",
          "#BDBDBD"
        ],
        "line-width": [
          "interpolate",
          ["exponential", 1],
          ["zoom"],
          5,
          0,
          5.5,
          ["match", ["get", "class"], "motorway", 0.1, 0],
          8.5,
          [
            "match",
            ["get", "class"],
            "motorway",
            2.5,
            "trunk",
            0.1,
            "primary",
            0.1,
            0
          ],
          10.5,
          [
            "match",
            ["get", "class"],
            "motorway",
            2.8,
            "trunk",
            2.5,
            "primary",
            2,
            "secondary",
            0.1,
            0
          ],
          12.5,
          [
            "match",
            ["get", "class"],
            "motorway",
            3.8,
            "trunk",
            3,
            "primary",
            2.5,
            "secondary",
            0.5,
            "tertiary",
            0,
            "minor",
            -1.5,
            "pier",
            -1.5,
            0
          ],
          13.5,
          [
            "match",
            ["get", "class"],
            "motorway",
            4,
            "trunk",
            3,
            "primary",
            2.8,
            "secondary",
            1,
            "tertiary",
            0.5,
            "minor",
            0.1,
            "pier",
            0.1,
            0
          ],
          16,
          [
            "match",
            ["get", "class"],
            "motorway",
            10,
            "trunk",
            9,
            "primary",
            8,
            "secondary",
            7,
            "tertiary",
            6,
            "pier",
            3,
            5
          ]
        ],
        "line-opacity": [
          "interpolate",
          ["exponential", 1.1],
          ["zoom"],
          5,
          0,
          8,
          [
            "match",
            ["get", "class"],
            "motorway",
            ["case", ["==", ["get", "brunnel"], "tunnel"], 0.4, 0.5],
            0
          ],
          12,
          ["case", ["==", ["get", "brunnel"], "tunnel"], 0.4, 1]
        ]
      }
    },
    {
      "id": "roads-fill",
      "type": "line",
      "source": "openmaptiles",
      "source-layer": "transportation",
      "minzoom": 5,
      "maxzoom": 22,
      "filter": [
        "all",
        ["has", "class"],
        [
          "in",
          "class",
          "motorway",
          "trunk",
          "primary",
          "secondary",
          "tertiary",
          "minor"
        ]
      ],
      "layout": {
        "line-join": "round",
        "line-cap": "round"
      },
      "paint": {
        "line-color": [
          "match",
          ["get", "class"],
          "motorway",
          "#9E9E9E",
          "trunk",
          "#BDBDBD",
          "primary",
          "#F1E4C7",
          "secondary",
          "#F1E4C7",
          "tertiary",
          "#F1E4C7",
          "minor",
          "#E0E0E0",
          "#F8F9FC"
        ],
        "line-width": [
          "interpolate",
          ["exponential", 1],
          ["zoom"],
          5,
          0,
          7,
          ["match", ["get", "class"], "motorway", 0, 0],
          8.5,
          ["match", ["get", "class"], "motorway", 1.5, "trunk", 0, 0],
          10.5,
          [
            "match",
            ["get", "class"],
            "motorway",
            1.8,
            "trunk",
            1.5,
            "primary",
            0,
            0
          ],
          12.5,
          [
            "match",
            ["get", "class"],
            "motorway",
            3.2,
            "trunk",
            2.4,
            "primary",
            1.9,
            "secondary",
            0,
            0
          ],
          13.5,
          [
            "match",
            ["get", "class"],
            "motorway",
            3.2,
            "trunk",
            2.2,
            "primary",
            2,
            "secondary",
            0.2,
            "tertiary",
            0,
            "minor",
            0,
            0
          ],
          16,
          [
            "match",
            ["get", "class"],
            "motorway",
            9,
            "trunk",
            8,
            "primary",
            7,
            "secondary",
            6,
            "tertiary",
            5,
            4
          ]
        ],
        "line-opacity": [
          "interpolate",
          ["exponential", 1.2],
          ["zoom"],
          5,
          0,
          8,
          [
            "match",
            ["get", "class"],
            "motorway",
            ["case", ["==", ["get", "brunnel"], "tunnel"], 0, 0.5],
            0
          ],
          12,
          ["case", ["==", ["get", "brunnel"], "tunnel"], 0, 1]
        ]
      }
    },
    {
      "id": "railway",
      "type": "line",
      "source": "openmaptiles",
      "source-layer": "transportation",
      "minzoom": 11,
      "maxzoom": 22,
      "filter": [
        "all",
        ["has", "subclass"],
        ["in", "subclass", "rail", "tram", "subway", "light_rail", "monorail"]
      ],
      "paint": {
        "line-color": "#9E9E9E",
        "line-width": ["interpolate", ["linear"], ["zoom"], 11, 0, 20, 1],
        "line-opacity": ["case", ["==", ["get", "brunnel"], "tunnel"], 0.2, 1]
      }
    },
    {
      "id": "railway_hash",
      "type": "line",
      "source": "openmaptiles",
      "source-layer": "transportation",
      "minzoom": 13,
      "maxzoom": 22,
      "filter": [
        "all",
        ["has", "subclass"],
        ["==", ["get", "subclass"], "rail"]
      ],
      "paint": {
        "line-color": "#9E9E9E",
        "line-dasharray": [0.1, 1.5],
        "line-width": ["interpolate", ["linear"], ["zoom"], 13.5, 0, 20, 10],
        "line-opacity": ["case", ["==", ["get", "brunnel"], "tunnel"], 0.2, 1]
      }
    },
    {
      "id": "roads-paths",
      "type": "line",
      "source": "openmaptiles",
      "source-layer": "transportation",
      "minzoom": 16,
      "maxzoom": 22,
      "filter": ["all", ["has", "class"], ["in", "class", "path", "ferry"]],
      "layout": {
        "line-join": "round",
        "line-cap": "round"
      },
      "paint": {
        "line-color": "#BDBDBD",
        "line-width": 1,
        "line-dasharray": [3, 3],
        "line-opacity": ["case", ["==", ["get", "brunnel"], "tunnel"], 0, 1]
      }
    },
    {
      "id": "osm_buildings",
      "type": "fill",
      "source": "openmaptiles",
      "source-layer": "building",
      "minzoom": 12,
      "maxzoom": 22,
      "layout": {
        "visibility": "visible"
      },
      "paint": {
        "fill-color": "#F2F2F2",
        "fill-outline-color": "#E4E4E4"
      }
    },
    {
      "id": "road_labels",
      "type": "symbol",
      "source": "openmaptiles",
      "source-layer": "transportation_name",
      "minzoom": 12,
      "maxzoom": 22,
      "filter": [
        "all",
        ["has", "class"],
        ["has", "name"],
        ["!=", ["get", "class"], "motorway"]
      ],
      "layout": {
        "symbol-placement": "line",
        "text-field": "{name}",
        "text-font": ["SourceSansPro-Regular"],
        "text-max-angle": 40,
        "text-padding": 15,
        "text-size": [
          "interpolate",
          ["exponential", 1.1],
          ["zoom"],
          14,
          11,
          15,
          12,
          20,
          15
        ],
        "text-transform": "uppercase",
        "text-rotation-alignment": "map"
      },
      "paint": {
        "text-color": "#212121",
        "text-halo-color": "#F8F9FC",
        "text-halo-width": 2,
        "text-halo-blur": 0
      }
    },
    {
      "id": "road_labels_NR",
      "type": "symbol",
      "source": "openmaptiles",
      "source-layer": "transportation_name",
      "minzoom": 7,
      "maxzoom": 22,
      "filter": [
        "all",
        ["has", "class"],
        ["has", "ref"],
        ["==", ["get", "class"], "motorway"]
      ],
      "layout": {
        "symbol-placement": "line",
        "text-field": "{ref}",
        "text-font": ["SourceSansPro-Bold"],
        "text-padding": [
          "interpolate",
          ["exponential", 1.1],
          ["zoom"],
          8,
          10,
          10,
          50,
          14,
          150,
          20,
          200
        ],
        "text-size": [
          "interpolate",
          ["exponential", 1.1],
          ["zoom"],
          14,
          12,
          15,
          14,
          20,
          16
        ],
        "text-transform": "uppercase",
        "text-rotation-alignment": "viewport"
      },
      "paint": {
        "text-color": "#F8F9FC",
        "text-halo-color": "#33373E",
        "text-halo-width": 15,
        "text-halo-blur": 0
      }
    },
    {
      "id": "adres-labels",
      "type": "symbol",
      "source": "openmaptiles",
      "source-layer": "housenumber",
      "minzoom": 17,
      "maxzoom": 22,
      "filter": ["has", "housenumber"],
      "layout": {
        "visibility": "visible",
        "symbol-placement": "point",
        "symbol-avoid-edges": false,
        "text-rotation-alignment": "viewport",
        "text-field": "{housenumber}",
        "text-font": ["SourceSansPro-Regular"],
        "text-size": 11,
        "text-max-width": 4,
        "text-anchor": "center",
        "text-line-height": 1.5,
        "text-justify": "center",
        "text-padding": 5,
        "text-allow-overlap": false,
        "text-pitch-alignment": "map"
      },
      "paint": {
        "text-color": "#3b3b3b",
        "text-halo-color": "#e3e3e3",
        "text-halo-width": 0.6,
        "text-halo-blur": 0.1
      }
    },
    {
      "id": "poi_symbols",
      "type": "symbol",
      "source": "openmaptiles",
      "minzoom": 16,
      "maxzoom": 22,
      "source-layer": "poi",
      "filter": [
        "all",
        ["has", "name"],
        ["has", "class"],
        ["!=", "name", ""],
        [
          "!in",
          "class",
          "railway",
          "bus",
          "attraction",
          "information",
          "toilets",
          "entrance",
          "bicycle_rental",
          "bicycle_parking",
          "bicycle",
          "cycle_barrier",
          "post",
          "lodging",
          "bollard",
          "art_gallery",
          "pitch",
          "playground",
          "waste_basket",
          "recycling",
          "gate",
          "lift_gate",
          "shelter",
          "sports_centre",
          "garden",
          "park",
          "golf",
          "hairdresser",
          "cemetery",
          "yoga",
          "undefined",
          "laundry"
        ]
      ],
      "layout": {
        "visibility": "visible",
        "icon-image": [
          "match",
          ["get", "subclass"],
          "restaurant",
          "restaurant-2-line",
          "fast_food",
          "restaurant-line",
          "bar",
          "goblet-line",
          "cafe",
          "cup-line",
          "pub",
          "cup-line",
          "atm",
          "loader-line",
          "pharmacy",
          "hospital-line",
          "supermarket",
          "shopping-cart-line",
          "shop",
          "shopping-basket-line",
          "museum",
          "bank-line",
          "ice_cream",
          "cake-3-line",
          "confectionery",
          "cake-3-line",
          [
            "match",
            ["get", "class"],
            "grocery",
            "shopping-cart-line",
            "shop",
            "shopping-basket-line",
            "clothing_store",
            "t-shirt-2-line",
            "bakery",
            "restaurant-line",
            "library",
            "bank-line",
            "doctors",
            "hospital-line",
            "fuel",
            "gas-station-fill",
            "car",
            "car-line",
            "place_of_worship",
            "loader-line",
            "town_hall",
            "bank-line",
            "checkbox-blank-circle-line"
          ]
        ],
        "icon-size": 0.7,
        "icon-padding": 3,
        "symbol-placement": "point",
        "icon-pitch-alignment": "map",
        "text-pitch-alignment": "map",
        "icon-rotation-alignment": "viewport",
        "symbol-avoid-edges": true,
        "text-field": "{name}",
        "text-font": ["SourceSansPro-Light"],
        "text-size": 11,
        "text-max-width": 5,
        "text-variable-anchor": [
          "top-right",
          "top-left",
          "bottom-right",
          "bottom-left",
          "right",
          "left",
          "top",
          "bottom"
        ],
        "text-line-height": 1.1,
        "text-radial-offset": 0.1,
        "text-justify": "center",
        "text-padding": 5,
        "text-allow-overlap": false,
        "text-rotation-alignment": "viewport"
      },
      "paint": {
        "icon-color": "#757575",
        "text-opacity": 1,
        "text-color": "#212121",
        "text-halo-color": "#F8F9FC",
        "text-halo-width": 1.5,
        "text-translate-anchor": "viewport"
      }
    },
    {
      "id": "poi_symbols_green",
      "type": "symbol",
      "source": "openmaptiles",
      "minzoom": 15,
      "maxzoom": 22,
      "source-layer": "poi",
      "filter": [
        "all",
        ["has", "name"],
        ["has", "class"],
        [
          "in",
          "class",
          "attraction",
          "playground",
          "garden",
          "park",
          "golf",
          "cemetery"
        ]
      ],
      "layout": {
        "visibility": "visible",
        "icon-image": [
          "match",
          ["get", "class"],
          "attraction",
          "loader-2-fill",
          "playground",
          "map-pin-3-line",
          "garden",
          "map-pin-3-line",
          "park",
          "map-pin-3-line",
          "golf",
          "radio-button-line",
          "radio-button-line"
        ],
        "icon-size": 0.7,
        "icon-padding": 3,
        "symbol-placement": "point",
        "icon-pitch-alignment": "viewport",
        "text-pitch-alignment": "viewport",
        "icon-rotation-alignment": "viewport",
        "symbol-avoid-edges": true,
        "text-field": "{name}",
        "text-font": ["SourceSansPro-It"],
        "text-size": 11,
        "text-max-width": 5,
        "text-variable-anchor": [
          "top-right",
          "top-left",
          "bottom-right",
          "bottom-left",
          "right",
          "left",
          "top",
          "bottom"
        ],
        "text-line-height": 1.1,
        "text-radial-offset": 0.1,
        "text-justify": "center",
        "text-padding": 5,
        "text-allow-overlap": false,
        "text-rotation-alignment": "viewport"
      },
      "paint": {
        "icon-color": "#39870C",
        "text-opacity": 1,
        "text-color": "#39870C",
        "text-halo-color": "#F8F9FC",
        "text-halo-width": 1.5,
        "text-translate-anchor": "viewport"
      }
    },
    {
      "id": "poi_symbols_transport",
      "type": "symbol",
      "source": "openmaptiles",
      "minzoom": 15,
      "maxzoom": 22,
      "source-layer": "poi",
      "filter": [
        "all",
        ["has", "class"],
        ["!=", "name", ""],
        ["has", "name"],
        [
          "in",
          "class",
          "railway",
          "bus",
          "entrance",
          "ferry_terminal",
          "parking"
        ]
      ],
      "layout": {
        "visibility": "visible",
        "icon-image": [
          "match",
          ["get", "subclass"],
          "subway_entrance",
          "subway-fill",
          "subway",
          "",
          "tram_stop",
          "subway-fill",
          "bus_stop",
          "bus-fill",
          "bus_station",
          "bus-fill",
          "station",
          "train-fill",
          "ferry_terminal",
          "ship-fill",
          "parking",
          "parking-fill",
          "radio-button-fill"
        ],
        "icon-size": [
          "interpolate",
          ["linear"],
          ["get", "rank"],
          1,
          0.8,
          14,
          0.5,
          80,
          0.4,
          97,
          0.3,
          98,
          0
        ],
        "icon-padding": 3,
        "symbol-placement": "point",
        "icon-pitch-alignment": "viewport",
        "text-pitch-alignment": "viewport",
        "icon-rotation-alignment": "viewport",
        "symbol-avoid-edges": true,
        "text-field": "{name}",
        "text-font": ["SourceSansPro-Light"],
        "text-size": 11,
        "text-max-width": 5,
        "text-variable-anchor": [
          "top-right",
          "top-left",
          "bottom-right",
          "bottom-left",
          "right",
          "left",
          "top",
          "bottom"
        ],
        "text-line-height": 1.1,
        "text-radial-offset": 0.3,
        "text-justify": "center",
        "text-padding": 5,
        "text-allow-overlap": false,
        "text-rotation-alignment": "viewport"
      },
      "paint": {
        "icon-color": "#616161",
        "text-opacity": 1,
        "text-color": "#212121",
        "text-halo-color": "#F8F9FC",
        "text-halo-width": 1.5,
        "text-translate-anchor": "viewport"
      }
    },
    {
      "id": "labels_populated_places",
      "type": "symbol",
      "source": "openmaptiles",
      "source-layer": "place",
      "minzoom": 5,
      "maxzoom": 22,
      "filter": [
        "all",
        ["has", "class"],
        ["in", "class", "city", "town", "village", "hamlet"]
      ],
      "layout": {
        "visibility": "visible",
        "symbol-placement": "point",
        "symbol-avoid-edges": false,
        "text-field": "{name}",
        "text-font": [
          "case",
          ["==", ["get", "class"], "city"],
          ["literal", ["SourceSansPro-Semibold"]],
          ["literal", ["SourceSansPro-Regular"]]
        ],
        "symbol-sort-key": ["get", "rank"],
        "text-size": [
          "interpolate",
          ["exponential", 1.2],
          ["get", "rank"],
          1,
          20,
          14,
          10
        ],
        "text-max-width": 8,
        "text-anchor": "center",
        "text-line-height": 1,
        "text-justify": "center",
        "text-padding": 25,
        "text-allow-overlap": false
      },
      "paint": {
        "text-color": [
          "case",
          ["==", ["get", "class"], "hamlet"],
          "#424242",
          "#212121"
        ],
        "text-halo-color": "#e3e3e3",
        "text-halo-width": 2,
        "text-halo-blur": 0.2
      }
    }
  ]
}
