<svg fill="none" xmlns="http://www.w3.org/2000/svg">
<path d="M76.5642 14.6875H41.9114V5.97051C41.912 5.24523 41.767 4.52694 41.4844 3.85674C41.2019 3.18654 40.7875 2.5776 40.265 2.06477C39.7424 1.55193 39.1219 1.14527 38.439 0.868056C37.7561 0.590841 37.0242 0.448514 36.2852 0.449221H5.62538C4.88643 0.448595 4.15461 0.590982 3.47179 0.868236C2.78898 1.14549 2.16857 1.55217 1.64607 2.065C1.12357 2.57783 0.709242 3.18674 0.42679 3.85689C0.144339 4.52705 -0.000690118 5.24529 2.46891e-06 5.97051V74.0295C0.0013255 75.4934 0.59441 76.8969 1.64907 77.9321C2.70374 78.9672 4.13381 79.5494 5.62538 79.5508H36.2851C37.7769 79.5495 39.2071 78.9675 40.2619 77.9323C41.3168 76.8971 41.91 75.4935 41.9114 74.0295V46.3281H76.5647C77.6346 46.3281 78.6607 45.911 79.4172 45.1685C80.1737 44.426 80.5987 43.419 80.5987 42.369V18.6471C80.5987 18.1271 80.4944 17.6122 80.2916 17.1318C80.0889 16.6514 79.7917 16.2149 79.4171 15.8472C79.0424 15.4796 78.5976 15.1879 78.1081 14.9889C77.6186 14.7899 77.094 14.6875 76.5642 14.6875ZM16.9257 3.80313H24.9856C25.52 3.80313 26.0325 4.01148 26.4104 4.38234C26.7883 4.7532 27.0006 5.25619 27.0006 5.78067C27.0006 6.30514 26.7883 6.80814 26.4104 7.179C26.0325 7.54986 25.52 7.75821 24.9856 7.75821H16.9257C16.3913 7.75821 15.8788 7.54986 15.5009 7.179C15.1231 6.80814 14.9108 6.30514 14.9108 5.78067C14.9108 5.25619 15.1231 4.7532 15.5009 4.38234C15.8788 4.01148 16.3913 3.80313 16.9257 3.80313ZM24.9848 76.1837H16.925C16.3905 76.1837 15.878 75.9754 15.5002 75.6045C15.1223 75.2336 14.91 74.7306 14.91 74.2062C14.91 73.6817 15.1223 73.1787 15.5002 72.8078C15.878 72.437 16.3905 72.2286 16.925 72.2286H24.9848C25.5192 72.2286 26.0317 72.437 26.4096 72.8078C26.7875 73.1787 26.9998 73.6817 26.9998 74.2062C26.9998 74.7306 26.7875 75.2336 26.4096 75.6045C26.0317 75.9754 25.5192 76.1837 24.9848 76.1837ZM38.3647 68.8721H3.54588V11.1279H38.3647V14.6875H16.8926C15.8326 14.6875 14.816 15.1008 14.0664 15.8364C13.3169 16.572 12.8958 17.5697 12.8958 18.61V42.4019C12.8958 42.9175 12.9993 43.428 13.2003 43.9044C13.4014 44.3808 13.696 44.8136 14.0675 45.1782C14.439 45.5428 14.88 45.832 15.3654 46.0293C15.8508 46.2266 16.371 46.3281 16.8963 46.3281H24.1796V52.6824C24.1796 53.0691 24.2965 53.4471 24.5154 53.7686C24.7343 54.0901 25.0454 54.3407 25.4094 54.4887C25.7734 54.6366 26.1739 54.6753 26.5604 54.5999C26.9468 54.5245 27.3017 54.3383 27.5803 54.0648L35.4635 46.3281H38.3647V68.8721ZM33.9962 31.9475C34.4587 32.211 34.7962 32.6433 34.9351 33.1501C35.074 33.6569 35.003 34.1971 34.7377 34.6527C34.6067 34.8794 34.431 35.0782 34.2211 35.2377C34.0111 35.3973 33.7709 35.5143 33.5145 35.5819C33.258 35.6496 32.9905 35.6667 32.7273 35.6321C32.4641 35.5975 32.2105 35.512 31.9813 35.3805L29.4185 33.925V36.8359C29.4185 37.3604 29.2063 37.8634 28.8284 38.2343C28.4505 38.6051 27.938 38.8135 27.4036 38.8135C26.8692 38.8135 26.3567 38.6051 25.9788 38.2343C25.6009 37.8634 25.3886 37.3604 25.3886 36.8359V33.925L22.825 35.3805C22.5958 35.512 22.3422 35.5975 22.079 35.6321C21.8158 35.6667 21.5483 35.6496 21.2918 35.5819C21.0354 35.5143 20.7952 35.3973 20.5852 35.2377C20.3752 35.0782 20.1996 34.8794 20.0686 34.6527C19.8036 34.197 19.7329 33.657 19.8718 33.1503C20.0107 32.6436 20.3479 32.2113 20.8101 31.9475L23.3736 30.5078L20.8101 29.0523C20.3462 28.7901 20.0075 28.3578 19.8685 27.8504C19.7294 27.3431 19.8014 26.8024 20.0686 26.3471C20.3358 25.8919 20.7763 25.5595 21.2933 25.423C21.8102 25.2866 22.3612 25.3572 22.825 25.6195L25.3886 27.0748V24.1797C25.3886 23.6552 25.6009 23.1522 25.9788 22.7814C26.3567 22.4105 26.8692 22.2022 27.4036 22.2022C27.938 22.2022 28.4505 22.4105 28.8284 22.7814C29.2063 23.1522 29.4185 23.6552 29.4185 24.1797V27.0748L31.9813 25.6195C32.4452 25.3572 32.9962 25.2866 33.5131 25.423C34.03 25.5595 34.4705 25.8919 34.7378 26.3471C35.005 26.8024 35.0769 27.3431 34.9379 27.8504C34.7988 28.3578 34.4601 28.7901 33.9963 29.0523L31.4335 30.5078L33.9962 31.9475ZM53.3399 31.9475C53.8024 32.211 54.1399 32.6433 54.2788 33.1501C54.4177 33.6569 54.3467 34.1971 54.0814 34.6527C53.9504 34.8794 53.7747 35.0782 53.5647 35.2377C53.3548 35.3973 53.1146 35.5143 52.8582 35.5819C52.6017 35.6496 52.3342 35.6667 52.071 35.6321C51.8078 35.5975 51.5542 35.512 51.325 35.3805L48.7622 33.925V36.8359C48.7622 37.3604 48.5499 37.8634 48.1721 38.2343C47.7942 38.6051 47.2817 38.8135 46.7473 38.8135C46.2129 38.8135 45.7004 38.6051 45.3225 38.2343C44.9446 37.8634 44.7323 37.3604 44.7323 36.8359V33.925L42.1687 35.3805C41.9395 35.512 41.6859 35.5975 41.4227 35.6321C41.1595 35.6667 40.892 35.6496 40.6355 35.5819C40.3791 35.5143 40.1389 35.3973 39.9289 35.2377C39.7189 35.0782 39.5433 34.8794 39.4123 34.6527C39.1473 34.197 39.0766 33.657 39.2155 33.1503C39.3544 32.6436 39.6916 32.2113 40.1538 31.9475L42.7173 30.5078L40.1538 29.0523C39.6899 28.7901 39.3512 28.3578 39.2122 27.8504C39.0731 27.3431 39.1451 26.8024 39.4123 26.3471C39.6795 25.8919 40.12 25.5595 40.637 25.423C41.1539 25.2866 41.7049 25.3572 42.1687 25.6195L44.7323 27.0748V24.1797C44.7323 23.6552 44.9446 23.1522 45.3225 22.7814C45.7004 22.4105 46.2129 22.2022 46.7473 22.2022C47.2817 22.2022 47.7942 22.4105 48.1721 22.7814C48.5499 23.1522 48.7622 23.6552 48.7622 24.1797V27.0748L51.325 25.6195C51.7889 25.3572 52.3399 25.2866 52.8568 25.423C53.3737 25.5595 53.8142 25.8919 54.0814 26.3471C54.3486 26.8024 54.4206 27.3431 54.2816 27.8504C54.1425 28.3578 53.8038 28.7901 53.34 29.0523L50.7772 30.5078L53.3399 31.9475ZM72.6836 31.9475C73.1461 32.211 73.4836 32.6433 73.6225 33.1501C73.7614 33.6569 73.6904 34.1971 73.4251 34.6527C73.2941 34.8794 73.1184 35.0782 72.9084 35.2377C72.6985 35.3973 72.4583 35.5143 72.2019 35.5819C71.9454 35.6496 71.6779 35.6667 71.4147 35.6321C71.1515 35.5975 70.8979 35.512 70.6687 35.3805L68.1059 33.925V36.8359C68.1059 37.3604 67.8936 37.8634 67.5158 38.2343C67.1379 38.6051 66.6254 38.8135 66.091 38.8135C65.5566 38.8135 65.0441 38.6051 64.6662 38.2343C64.2883 37.8634 64.076 37.3604 64.076 36.8359V33.925L61.5124 35.3805C61.2832 35.512 61.0296 35.5975 60.7664 35.6321C60.5032 35.6667 60.2357 35.6496 59.9792 35.5819C59.7228 35.5143 59.4826 35.3973 59.2726 35.2377C59.0626 35.0782 58.887 34.8794 58.7559 34.6527C58.491 34.197 58.4203 33.657 58.5592 33.1503C58.6981 32.6436 59.0353 32.2113 59.4975 31.9475L62.061 30.5078L59.4975 29.0523C59.0336 28.7901 58.6949 28.3578 58.5559 27.8504C58.4168 27.3431 58.4888 26.8024 58.756 26.3471C59.0232 25.8919 59.4637 25.5595 59.9807 25.423C60.4976 25.2866 61.0486 25.3572 61.5124 25.6195L64.076 27.0748V24.1797C64.076 23.6552 64.2883 23.1522 64.6662 22.7814C65.0441 22.4105 65.5566 22.2022 66.091 22.2022C66.6254 22.2022 67.1379 22.4105 67.5158 22.7814C67.8936 23.1522 68.1059 23.6552 68.1059 24.1797V27.0748L70.6687 25.6195C70.8984 25.4896 71.1519 25.4054 71.4147 25.3717C71.6775 25.338 71.9445 25.3555 72.2005 25.423C72.4565 25.4906 72.6963 25.607 72.9065 25.7655C73.1166 25.9241 73.2928 26.1217 73.4251 26.3471C73.5574 26.5725 73.6432 26.8213 73.6776 27.0793C73.7119 27.3372 73.6941 27.5992 73.6253 27.8504C73.5564 28.1016 73.4379 28.3371 73.2763 28.5433C73.1147 28.7495 72.9134 28.9225 72.6837 29.0523L70.1209 30.5078L72.6836 31.9475Z" fill="black"/>
</svg>
