<svg xmlns="http://www.w3.org/2000/svg" width="224" height="134" viewBox="-5 -5 234 144">
	<g stroke="currentColor" stroke-width="8" stroke-linecap="round">
		<path d="M 1 71 L 1 51"/>
		<path d="M 1 51 L 21 51"/>
		<path d="M 41 11 L 61 1"/>
		<path d="M 1 131 L 1 111"/>
		<path d="M 1 131 L 21 131"/>
		<path d="M 141 131 L 161 131"/>
		<path d="M 161 131 L 161 111"/>
		<path d="M 161 131 L 181 121"/>
		<path d="M 201 111 L 221 101"/>
		<path d="M 1 31 L 21 21"/>
		<path d="M 1 31 L 21 31"/>
		<path d="M 141 51 L 161 51"/>
		<path d="M 161 71 L 161 51"/>
		<path d="M 161 51 L 181 41"/>
		<path d="M 221 101 L 221 81"/>
		<path d="M 201 31 L 221 21"/>
		<path d="M 221 41 L 221 21"/>
		<path d="M 161 31 L 161 51"/>
		<path d="M 201 11 L 221 1"/>
		<path d="M 1 51 L 1 31"/>
		<path d="M 161 31 L 181 21"/>
		<path d="M 141 31 L 161 31"/>
		<path d="M 221 1 L 221 21"/>
		<path d="M 201 1 L 221 1"/>
		<path d="M 61 1 L 81 1"/>
	</g>
</svg>