<mxfile host="app.diagrams.net" modified="2020-08-25T20:20:14.442Z" agent="5.0 (X11)" etag="PV4xGHeiAOnUyarGy9jv" version="13.6.4" type="gitlab">
  <diagram id="rQuR-xrb6OMOjVoAbi6A" name="Page-1">
    <mxGraphModel dx="868" dy="455" grid="1" gridSize="10" guides="1" tooltips="1" connect="1" arrows="1" fold="1" page="1" pageScale="1" pageWidth="850" pageHeight="1100" math="0" shadow="0">
      <root>
        <mxCell id="0" />
        <mxCell id="1" parent="0" />
        <mxCell id="QQga4kTh_OcQtNgzNwWD-1" value="Query database" style="rounded=1;whiteSpace=wrap;html=1;fontSize=12;glass=0;strokeWidth=1;shadow=0;" vertex="1" parent="1">
          <mxGeometry x="530" y="195" width="120" height="40" as="geometry" />
        </mxCell>
        <mxCell id="QQga4kTh_OcQtNgzNwWD-2" value="" style="ellipse;html=1;shape=startState;fillColor=#000000;strokeColor=#ff0000;" vertex="1" parent="1">
          <mxGeometry x="80" y="115" width="30" height="30" as="geometry" />
        </mxCell>
        <mxCell id="QQga4kTh_OcQtNgzNwWD-3" value="" style="edgeStyle=orthogonalEdgeStyle;html=1;verticalAlign=bottom;endArrow=open;endSize=8;strokeColor=#ff0000;exitX=1;exitY=0.5;exitDx=0;exitDy=0;entryX=0;entryY=0.5;entryDx=0;entryDy=0;" edge="1" parent="1" source="QQga4kTh_OcQtNgzNwWD-2" target="QQga4kTh_OcQtNgzNwWD-4">
          <mxGeometry relative="1" as="geometry">
            <mxPoint x="210" y="130" as="targetPoint" />
          </mxGeometry>
        </mxCell>
        <mxCell id="QQga4kTh_OcQtNgzNwWD-4" value="&lt;div&gt;is phone&lt;br&gt;&lt;/div&gt;&lt;div&gt;variable present&lt;br&gt;&lt;/div&gt;" style="rhombus;whiteSpace=wrap;html=1;fillColor=#ffffc0;strokeColor=#ff0000;" vertex="1" parent="1">
          <mxGeometry x="170" y="90" width="140" height="60" as="geometry" />
        </mxCell>
        <mxCell id="QQga4kTh_OcQtNgzNwWD-5" value="no" style="edgeStyle=orthogonalEdgeStyle;html=1;align=left;verticalAlign=bottom;endArrow=open;endSize=8;strokeColor=#ff0000;entryX=0;entryY=0.5;entryDx=0;entryDy=0;" edge="1" parent="1" source="QQga4kTh_OcQtNgzNwWD-4" target="QQga4kTh_OcQtNgzNwWD-13">
          <mxGeometry x="-1" y="-98" relative="1" as="geometry">
            <mxPoint x="390" y="120" as="targetPoint" />
            <mxPoint x="-90" y="-58" as="offset" />
          </mxGeometry>
        </mxCell>
        <mxCell id="QQga4kTh_OcQtNgzNwWD-6" value="yes" style="edgeStyle=orthogonalEdgeStyle;html=1;align=left;verticalAlign=top;endArrow=open;endSize=8;strokeColor=#ff0000;entryX=0.5;entryY=0;entryDx=0;entryDy=0;" edge="1" parent="1" source="QQga4kTh_OcQtNgzNwWD-4" target="QQga4kTh_OcQtNgzNwWD-7">
          <mxGeometry x="-1" y="85" relative="1" as="geometry">
            <mxPoint x="240" y="220" as="targetPoint" />
            <Array as="points" />
            <mxPoint x="-25" y="-60" as="offset" />
          </mxGeometry>
        </mxCell>
        <mxCell id="QQga4kTh_OcQtNgzNwWD-7" value="&lt;div&gt;is id&lt;br&gt;&lt;/div&gt;variable present" style="rhombus;whiteSpace=wrap;html=1;fillColor=#ffffc0;strokeColor=#ff0000;" vertex="1" parent="1">
          <mxGeometry x="180" y="180" width="120" height="70" as="geometry" />
        </mxCell>
        <mxCell id="QQga4kTh_OcQtNgzNwWD-8" value="no" style="edgeStyle=orthogonalEdgeStyle;html=1;align=left;verticalAlign=bottom;endArrow=open;endSize=8;strokeColor=#ff0000;entryX=0;entryY=0.5;entryDx=0;entryDy=0;" edge="1" parent="1" source="QQga4kTh_OcQtNgzNwWD-7" target="QQga4kTh_OcQtNgzNwWD-16">
          <mxGeometry x="-1" y="-67" relative="1" as="geometry">
            <mxPoint x="350" y="215" as="targetPoint" />
            <mxPoint x="-50" y="-22" as="offset" />
          </mxGeometry>
        </mxCell>
        <mxCell id="QQga4kTh_OcQtNgzNwWD-9" value="yes" style="edgeStyle=orthogonalEdgeStyle;html=1;align=left;verticalAlign=top;endArrow=open;endSize=8;strokeColor=#ff0000;entryX=0.5;entryY=0;entryDx=0;entryDy=0;" edge="1" parent="1" source="QQga4kTh_OcQtNgzNwWD-7" target="QQga4kTh_OcQtNgzNwWD-10">
          <mxGeometry x="-1" y="85" relative="1" as="geometry">
            <mxPoint x="240" y="290" as="targetPoint" />
            <mxPoint x="-25" y="-60" as="offset" />
          </mxGeometry>
        </mxCell>
        <mxCell id="QQga4kTh_OcQtNgzNwWD-10" value="&lt;div&gt;is owner&lt;br&gt;&lt;/div&gt;variable present" style="rhombus;whiteSpace=wrap;html=1;fillColor=#ffffc0;strokeColor=#ff0000;" vertex="1" parent="1">
          <mxGeometry x="175" y="280" width="130" height="80" as="geometry" />
        </mxCell>
        <mxCell id="QQga4kTh_OcQtNgzNwWD-11" value="no" style="edgeStyle=orthogonalEdgeStyle;html=1;align=left;verticalAlign=bottom;endArrow=open;endSize=8;strokeColor=#ff0000;entryX=0;entryY=0.5;entryDx=0;entryDy=0;" edge="1" parent="1" source="QQga4kTh_OcQtNgzNwWD-10" target="QQga4kTh_OcQtNgzNwWD-19">
          <mxGeometry x="-1" y="-99" relative="1" as="geometry">
            <mxPoint x="350" y="320" as="targetPoint" />
            <mxPoint x="-85" y="-49" as="offset" />
          </mxGeometry>
        </mxCell>
        <mxCell id="QQga4kTh_OcQtNgzNwWD-12" value="yes" style="edgeStyle=orthogonalEdgeStyle;html=1;align=left;verticalAlign=top;endArrow=open;endSize=8;strokeColor=#ff0000;entryX=0;entryY=0.5;entryDx=0;entryDy=0;" edge="1" parent="1" source="QQga4kTh_OcQtNgzNwWD-10" target="QQga4kTh_OcQtNgzNwWD-25">
          <mxGeometry x="-1" y="85" relative="1" as="geometry">
            <mxPoint x="202.5" y="500" as="targetPoint" />
            <mxPoint x="-25" y="-60" as="offset" />
            <Array as="points">
              <mxPoint x="240" y="590" />
            </Array>
          </mxGeometry>
        </mxCell>
        <mxCell id="QQga4kTh_OcQtNgzNwWD-13" value="is it valid" style="rhombus;whiteSpace=wrap;html=1;fillColor=#ffffc0;strokeColor=#ff0000;" vertex="1" parent="1">
          <mxGeometry x="373.5" y="100" width="80" height="40" as="geometry" />
        </mxCell>
        <mxCell id="QQga4kTh_OcQtNgzNwWD-14" value="no" style="edgeStyle=orthogonalEdgeStyle;html=1;align=left;verticalAlign=bottom;endArrow=open;endSize=8;strokeColor=#ff0000;entryX=0.5;entryY=0;entryDx=0;entryDy=0;" edge="1" parent="1" source="QQga4kTh_OcQtNgzNwWD-13" target="QQga4kTh_OcQtNgzNwWD-1">
          <mxGeometry x="0.5745" y="-200" relative="1" as="geometry">
            <mxPoint x="580" y="90" as="targetPoint" />
            <mxPoint as="offset" />
          </mxGeometry>
        </mxCell>
        <mxCell id="QQga4kTh_OcQtNgzNwWD-15" value="yes" style="edgeStyle=orthogonalEdgeStyle;html=1;align=left;verticalAlign=top;endArrow=open;endSize=8;strokeColor=#ff0000;" edge="1" parent="1" source="QQga4kTh_OcQtNgzNwWD-13">
          <mxGeometry x="-0.6253" y="-88" relative="1" as="geometry">
            <mxPoint x="340" y="290" as="targetPoint" />
            <Array as="points">
              <mxPoint x="414" y="180" />
            </Array>
            <mxPoint x="37" y="8" as="offset" />
          </mxGeometry>
        </mxCell>
        <mxCell id="QQga4kTh_OcQtNgzNwWD-16" value="is it valid" style="rhombus;whiteSpace=wrap;html=1;fillColor=#ffffc0;strokeColor=#ff0000;" vertex="1" parent="1">
          <mxGeometry x="374" y="195" width="80" height="40" as="geometry" />
        </mxCell>
        <mxCell id="QQga4kTh_OcQtNgzNwWD-17" value="no" style="edgeStyle=orthogonalEdgeStyle;html=1;align=left;verticalAlign=bottom;endArrow=open;endSize=8;strokeColor=#ff0000;entryX=0;entryY=0.5;entryDx=0;entryDy=0;" edge="1" parent="1" source="QQga4kTh_OcQtNgzNwWD-16" target="QQga4kTh_OcQtNgzNwWD-1">
          <mxGeometry x="-1" y="-73" relative="1" as="geometry">
            <mxPoint x="584" y="190" as="targetPoint" />
            <mxPoint x="-64" y="-38" as="offset" />
          </mxGeometry>
        </mxCell>
        <mxCell id="QQga4kTh_OcQtNgzNwWD-18" value="yes" style="edgeStyle=orthogonalEdgeStyle;html=1;align=left;verticalAlign=top;endArrow=open;endSize=8;strokeColor=#ff0000;exitX=0.5;exitY=1;exitDx=0;exitDy=0;entryX=0.5;entryY=0;entryDx=0;entryDy=0;" edge="1" parent="1" source="QQga4kTh_OcQtNgzNwWD-16" target="QQga4kTh_OcQtNgzNwWD-25">
          <mxGeometry x="-0.9635" y="60" relative="1" as="geometry">
            <mxPoint x="320" y="520" as="targetPoint" />
            <mxPoint x="418" y="233" as="sourcePoint" />
            <Array as="points">
              <mxPoint x="410" y="235" />
              <mxPoint x="410" y="280" />
              <mxPoint x="340" y="280" />
              <mxPoint x="340" y="540" />
              <mxPoint x="355" y="540" />
            </Array>
            <mxPoint x="-20" y="-45" as="offset" />
          </mxGeometry>
        </mxCell>
        <mxCell id="QQga4kTh_OcQtNgzNwWD-19" value="is it valid" style="rhombus;whiteSpace=wrap;html=1;fillColor=#ffffc0;strokeColor=#ff0000;" vertex="1" parent="1">
          <mxGeometry x="370" y="300" width="80" height="40" as="geometry" />
        </mxCell>
        <mxCell id="QQga4kTh_OcQtNgzNwWD-20" value="no" style="edgeStyle=orthogonalEdgeStyle;html=1;align=left;verticalAlign=bottom;endArrow=open;endSize=8;strokeColor=#ff0000;entryX=0.5;entryY=1;entryDx=0;entryDy=0;" edge="1" parent="1" source="QQga4kTh_OcQtNgzNwWD-19" target="QQga4kTh_OcQtNgzNwWD-1">
          <mxGeometry x="-1" y="-42" relative="1" as="geometry">
            <mxPoint x="560" y="320" as="targetPoint" />
            <mxPoint x="-30" y="-12" as="offset" />
          </mxGeometry>
        </mxCell>
        <mxCell id="QQga4kTh_OcQtNgzNwWD-21" value="yes" style="edgeStyle=orthogonalEdgeStyle;html=1;align=left;verticalAlign=top;endArrow=open;endSize=8;strokeColor=#ff0000;" edge="1" parent="1" source="QQga4kTh_OcQtNgzNwWD-19">
          <mxGeometry x="0.4" y="108" relative="1" as="geometry">
            <mxPoint x="340" y="370" as="targetPoint" />
            <Array as="points">
              <mxPoint x="340" y="340" />
            </Array>
            <mxPoint x="-8" y="-40" as="offset" />
          </mxGeometry>
        </mxCell>
        <mxCell id="QQga4kTh_OcQtNgzNwWD-24" style="edgeStyle=orthogonalEdgeStyle;rounded=0;orthogonalLoop=1;jettySize=auto;html=1;" edge="1" parent="1" source="QQga4kTh_OcQtNgzNwWD-25" target="QQga4kTh_OcQtNgzNwWD-34">
          <mxGeometry relative="1" as="geometry" />
        </mxCell>
        <mxCell id="QQga4kTh_OcQtNgzNwWD-25" value="&lt;div&gt;send 400 &lt;br&gt;&lt;/div&gt;&lt;div&gt;error&lt;br&gt;&lt;/div&gt;" style="rounded=1;whiteSpace=wrap;html=1;fillColor=#f8cecc;strokeColor=#b85450;" vertex="1" parent="1">
          <mxGeometry x="310" y="570" width="90" height="40" as="geometry" />
        </mxCell>
        <mxCell id="QQga4kTh_OcQtNgzNwWD-26" value="&lt;div&gt;ressource &lt;br&gt;&lt;/div&gt;&lt;div&gt;found&lt;br&gt;&lt;/div&gt;" style="rhombus;whiteSpace=wrap;html=1;fillColor=#ffffc0;strokeColor=#ff0000;" vertex="1" parent="1">
          <mxGeometry x="630" y="390" width="80" height="40" as="geometry" />
        </mxCell>
        <mxCell id="QQga4kTh_OcQtNgzNwWD-27" value="no" style="edgeStyle=orthogonalEdgeStyle;html=1;align=left;verticalAlign=bottom;endArrow=open;endSize=8;strokeColor=#ff0000;entryX=0.51;entryY=0.3;entryDx=0;entryDy=0;entryPerimeter=0;" edge="1" parent="1" source="QQga4kTh_OcQtNgzNwWD-26" target="QQga4kTh_OcQtNgzNwWD-42">
          <mxGeometry x="-1" y="-67" relative="1" as="geometry">
            <mxPoint x="695" y="500" as="targetPoint" />
            <mxPoint x="7" y="-30" as="offset" />
            <Array as="points">
              <mxPoint x="670" y="440" />
              <mxPoint x="695" y="440" />
              <mxPoint x="695" y="450" />
              <mxPoint x="702" y="450" />
            </Array>
          </mxGeometry>
        </mxCell>
        <mxCell id="QQga4kTh_OcQtNgzNwWD-28" value="yes" style="edgeStyle=orthogonalEdgeStyle;html=1;align=left;verticalAlign=top;endArrow=open;endSize=8;strokeColor=#ff0000;entryX=0.5;entryY=0;entryDx=0;entryDy=0;" edge="1" parent="1" source="QQga4kTh_OcQtNgzNwWD-26" target="QQga4kTh_OcQtNgzNwWD-32">
          <mxGeometry y="150" relative="1" as="geometry">
            <mxPoint x="600" y="450" as="targetPoint" />
            <mxPoint as="offset" />
          </mxGeometry>
        </mxCell>
        <mxCell id="QQga4kTh_OcQtNgzNwWD-29" value="" style="endArrow=classic;html=1;exitX=1;exitY=0.5;exitDx=0;exitDy=0;entryX=0.5;entryY=0;entryDx=0;entryDy=0;" edge="1" parent="1" source="QQga4kTh_OcQtNgzNwWD-1" target="QQga4kTh_OcQtNgzNwWD-26">
          <mxGeometry width="50" height="50" relative="1" as="geometry">
            <mxPoint x="460" y="350" as="sourcePoint" />
            <mxPoint x="510" y="300" as="targetPoint" />
            <Array as="points">
              <mxPoint x="670" y="215" />
            </Array>
          </mxGeometry>
        </mxCell>
        <mxCell id="QQga4kTh_OcQtNgzNwWD-32" value="&lt;div&gt;Send 404&lt;/div&gt;&lt;div&gt;error&lt;br&gt;&lt;/div&gt;" style="rounded=1;whiteSpace=wrap;html=1;fillColor=#f8cecc;strokeColor=#b85450;" vertex="1" parent="1">
          <mxGeometry x="450" y="530" width="80" height="40" as="geometry" />
        </mxCell>
        <mxCell id="QQga4kTh_OcQtNgzNwWD-33" value="" style="endArrow=classic;html=1;exitX=0;exitY=0.5;exitDx=0;exitDy=0;" edge="1" parent="1" source="QQga4kTh_OcQtNgzNwWD-32" target="QQga4kTh_OcQtNgzNwWD-34">
          <mxGeometry width="50" height="50" relative="1" as="geometry">
            <mxPoint x="460" y="450" as="sourcePoint" />
            <mxPoint x="510" y="400" as="targetPoint" />
          </mxGeometry>
        </mxCell>
        <mxCell id="QQga4kTh_OcQtNgzNwWD-34" value="" style="ellipse;html=1;shape=endState;fillColor=#000000;strokeColor=#ff0000;" vertex="1" parent="1">
          <mxGeometry x="395" y="620" width="30" height="30" as="geometry" />
        </mxCell>
        <mxCell id="QQga4kTh_OcQtNgzNwWD-48" style="edgeStyle=orthogonalEdgeStyle;rounded=0;orthogonalLoop=1;jettySize=auto;html=1;exitX=0.25;exitY=0.5;exitDx=0;exitDy=0;exitPerimeter=0;entryX=0.5;entryY=0;entryDx=0;entryDy=0;" edge="1" parent="1" source="QQga4kTh_OcQtNgzNwWD-42" target="QQga4kTh_OcQtNgzNwWD-45">
          <mxGeometry relative="1" as="geometry" />
        </mxCell>
        <mxCell id="QQga4kTh_OcQtNgzNwWD-49" style="edgeStyle=orthogonalEdgeStyle;rounded=0;orthogonalLoop=1;jettySize=auto;html=1;exitX=0.75;exitY=0.5;exitDx=0;exitDy=0;exitPerimeter=0;entryX=0.5;entryY=0;entryDx=0;entryDy=0;" edge="1" parent="1" source="QQga4kTh_OcQtNgzNwWD-42" target="QQga4kTh_OcQtNgzNwWD-46">
          <mxGeometry relative="1" as="geometry" />
        </mxCell>
        <mxCell id="QQga4kTh_OcQtNgzNwWD-50" style="edgeStyle=orthogonalEdgeStyle;rounded=0;orthogonalLoop=1;jettySize=auto;html=1;entryX=0.5;entryY=0;entryDx=0;entryDy=0;" edge="1" parent="1" source="QQga4kTh_OcQtNgzNwWD-42" target="QQga4kTh_OcQtNgzNwWD-47">
          <mxGeometry relative="1" as="geometry" />
        </mxCell>
        <mxCell id="QQga4kTh_OcQtNgzNwWD-42" value="" style="shape=line;html=1;strokeWidth=6;strokeColor=#ff0000;" vertex="1" parent="1">
          <mxGeometry x="600" y="500" width="200" height="10" as="geometry" />
        </mxCell>
        <mxCell id="QQga4kTh_OcQtNgzNwWD-53" style="edgeStyle=orthogonalEdgeStyle;rounded=0;orthogonalLoop=1;jettySize=auto;html=1;entryX=0;entryY=0.5;entryDx=0;entryDy=0;entryPerimeter=0;" edge="1" parent="1" source="QQga4kTh_OcQtNgzNwWD-45" target="QQga4kTh_OcQtNgzNwWD-51">
          <mxGeometry relative="1" as="geometry" />
        </mxCell>
        <mxCell id="QQga4kTh_OcQtNgzNwWD-45" value="&lt;div&gt;set snack deleted &lt;br&gt;&lt;/div&gt;&lt;div&gt;to true&lt;br&gt;&lt;/div&gt;" style="rounded=1;whiteSpace=wrap;html=1;" vertex="1" parent="1">
          <mxGeometry x="550" y="560" width="120" height="40" as="geometry" />
        </mxCell>
        <mxCell id="QQga4kTh_OcQtNgzNwWD-54" style="edgeStyle=orthogonalEdgeStyle;rounded=0;orthogonalLoop=1;jettySize=auto;html=1;entryX=1;entryY=0.5;entryDx=0;entryDy=0;entryPerimeter=0;" edge="1" parent="1" source="QQga4kTh_OcQtNgzNwWD-46" target="QQga4kTh_OcQtNgzNwWD-51">
          <mxGeometry relative="1" as="geometry" />
        </mxCell>
        <mxCell id="QQga4kTh_OcQtNgzNwWD-46" value="&lt;div&gt;set snack deletion date&lt;br&gt;&lt;/div&gt;" style="rounded=1;whiteSpace=wrap;html=1;" vertex="1" parent="1">
          <mxGeometry x="730" y="560" width="120" height="40" as="geometry" />
        </mxCell>
        <mxCell id="QQga4kTh_OcQtNgzNwWD-55" style="edgeStyle=orthogonalEdgeStyle;rounded=0;orthogonalLoop=1;jettySize=auto;html=1;entryX=0.505;entryY=0.6;entryDx=0;entryDy=0;entryPerimeter=0;" edge="1" parent="1" source="QQga4kTh_OcQtNgzNwWD-47" target="QQga4kTh_OcQtNgzNwWD-51">
          <mxGeometry relative="1" as="geometry" />
        </mxCell>
        <mxCell id="QQga4kTh_OcQtNgzNwWD-47" value="&lt;div&gt;send snack &lt;br&gt;&lt;/div&gt;&lt;div&gt;deleted event&lt;br&gt;&lt;/div&gt;" style="rounded=1;whiteSpace=wrap;html=1;fillColor=#f5f5f5;strokeColor=#666666;fontColor=#333333;" vertex="1" parent="1">
          <mxGeometry x="640" y="630" width="120" height="40" as="geometry" />
        </mxCell>
        <mxCell id="QQga4kTh_OcQtNgzNwWD-51" value="" style="shape=line;html=1;strokeWidth=6;strokeColor=#ff0000;" vertex="1" parent="1">
          <mxGeometry x="600" y="720" width="200" height="10" as="geometry" />
        </mxCell>
        <mxCell id="QQga4kTh_OcQtNgzNwWD-52" value="" style="edgeStyle=orthogonalEdgeStyle;html=1;verticalAlign=bottom;endArrow=open;endSize=8;strokeColor=#ff0000;" edge="1" source="QQga4kTh_OcQtNgzNwWD-51" parent="1" target="QQga4kTh_OcQtNgzNwWD-56">
          <mxGeometry relative="1" as="geometry">
            <mxPoint x="700" y="790" as="targetPoint" />
          </mxGeometry>
        </mxCell>
        <mxCell id="QQga4kTh_OcQtNgzNwWD-57" style="edgeStyle=orthogonalEdgeStyle;rounded=0;orthogonalLoop=1;jettySize=auto;html=1;entryX=0.5;entryY=1;entryDx=0;entryDy=0;" edge="1" parent="1" source="QQga4kTh_OcQtNgzNwWD-56" target="QQga4kTh_OcQtNgzNwWD-34">
          <mxGeometry relative="1" as="geometry" />
        </mxCell>
        <mxCell id="QQga4kTh_OcQtNgzNwWD-56" value="Send 200 response" style="rounded=1;whiteSpace=wrap;html=1;fillColor=#d5e8d4;strokeColor=#82b366;" vertex="1" parent="1">
          <mxGeometry x="530" y="790" width="120" height="60" as="geometry" />
        </mxCell>
      </root>
    </mxGraphModel>
  </diagram>
</mxfile>
