{
    "layout": {
        "header": {
            "type": "label",
            "label": ""
        },
        "filters": {
            "id": null,
            "entityHash": null
        },
        "type": 2,
        "tabs": [
            {
                "name": "default",
                "label": "Servicio",
                "rows": [
                    {
                        "id": 0,
                        "columns": [
                            {
                                "id": 0,
                                "xs": 24,
                                "sm": 24,
                                "md": 24,
                                "lg": 24,
                                "specs": [
                                    {
                                        "id": "2",
                                        "icon": "list",
                                        "titleColor": "#058035",
                                        "viewType": 1,
                                        "loading": true,
                                        "label": "New Import",
                                        "hash": "importService",
                                        "specUrl": "service/rs/spec-import/",
                                        "dataUrl": "service/get",
                                        "multiple": false
                                    }
                                ]
                            }
                        ]
                    }
                ]
            },
            {
                "name": "Campos",
                "label": "Campos",
                "rows": [
                    {
                        "id": 0,
                        "columns": [
                            {
                                "id": 0,
                                "xs": 24,
                                "sm": 24,
                                "md": 24,
                                "lg": 24,
                                "specs": [
                                    {
                                        "id": "2",
                                        "icon": "list",
                                        "titleColor": "#058035",
                                        "viewType": 6,
                                        "layoutTypeName": "importService",
                                        "loading": true,
                                        "label": "Entidad Principal",
                                        "hash": "layoutEditorListFields",
                                        "specUrl": "layout/rs/spec-layoutEditorListFields/",
                                        "dataUrl": "entity/fields/"
                                    }
                                ]
                            }
                        ]
                    }
                ]
            }
        ]
    }
}