{
  "id": 30029,
  "label": {
    "format":[
      6625,", ",6635
    ]
  },
  "fields": [
    {
      "type": "text",
      "subtype": "text",
      "id": 6625,
      "label": "Apellido",
      "value": "Soñez",
      "placeholder": "Ingrese el apellido"
    },
    {
      "type": "text",
      "subtype": "text",
      "id": 6635,
      "label": "Nombre",
      "value": "Romina",
      "placeholder": "Ingrese el nombre"
    },
    {
      "type": "number",
      "subtype": "int",
      "id": 6636,
      "label": "Edad",
      "value": "35"
    },
    {
      "type": "number",
      "subtype": "decimal",
      "id": 6638,
      "label": "Sueldo",
      "value": "26000.76"
    },
    {
      "type": "select",
      "multiple": false,
      "id": 6637,
      "label": "Sexo",
      "value": "Femenino",
      "options": [
        {
          "value": 2244,
          "label": "Femenino"
        },
        {
          "value": 2245,
          "label": "Masculino"
        }
      ]
    }
  ]
}