{
  "builders":[
    {
      "type":"docker",
      "ecr_login": true,
      "login_server": "https://__AWS_ACCOUNT_ID__.dkr.ecr.__AWS_REGION__.amazonaws.com",
      "image":"__SOURCE_DOCKER_IMAGE__",
      "commit": true,
      "changes": [
        "ENTRYPOINT /bin/bash"
      ]
    }
  ],
  "provisioners":[
    {
      "type":"shell",
      "inline":[
        "mkdir -p /etc/chef/bootstrap"
      ]
    },
    {
      "type":"file",
      "source":"bootstrap.sh",
      "destination":"/etc/chef/bootstrap/bootstrap.sh"
    },
    {
      "type":"file",
      "source":"cookbooks.tar.gz",
      "destination":"/etc/chef/bootstrap/cookbooks.tar.gz"
    },
    {
      "type":"shell",
      "inline":[
        "bash -x /etc/chef/bootstrap/bootstrap.sh -c __COOKBOOK_NAME__ -e build -d"
      ]
    }
  ],
  "post-processors": [
    [
      {
        "type": "docker-tag",
        "repository": "__AWS_ACCOUNT_ID__.dkr.ecr.__AWS_REGION__.amazonaws.com/__COOKBOOK_NAME__",
        "tag": "latest"
      },
      {
        "type": "docker-push",
        "keep_input_artifact": false,
        "ecr_login": true,
        "login_server": "https://__AWS_ACCOUNT_ID__.dkr.ecr.__AWS_REGION__.amazonaws.com"
      }
    ]
  ]
}
