{
  "info": {
    "description": "The openapi spec for the Nextcloud API wrapper",
    "title": "Nextcloud API wrapper",
    "version": "0.1.0"
  },
  "tags": [],
  "paths": {
    "/api/healthcheck": {
      "get": {
        "parameters": [],
        "responses": {
          "200": {
            "content": {
              "application/json": {
                "schema": {
                  "$ref": "#/components/schemas/HealthcheckOut"
                }
              }
            },
            "description": "Successful response"
          }
        },
        "tags": [
          "healthcheck"
        ],
        "summary": "Return a healthcheck status",
        "operationId": "get_healthcheck"
      }
    },
    "/api/occ/app_password": {
      "post": {
        "parameters": [],
        "responses": {
          "201": {
            "content": {
              "application/json": {
                "schema": {
                  "$ref": "#/components/schemas/AppPasswordOut"
                }
              }
            },
            "description": "Successful response"
          },
          "422": {
            "content": {
              "application/json": {
                "schema": {
                  "$ref": "#/components/schemas/ValidationError"
                }
              }
            },
            "description": "Validation error"
          }
        },
        "tags": [
          "app_password"
        ],
        "summary": "Return a new app password for a user",
        "operationId": "create_app_password",
        "requestBody": {
          "content": {
            "application/json": {
              "schema": {
                "$ref": "#/components/schemas/AppPasswordIn"
              }
            }
          }
        }
      }
    }
  },
  "openapi": "3.0.3",
  "components": {
    "schemas": {
      "ValidationError": {
        "properties": {
          "detail": {
            "type": "object",
            "properties": {
              "<location>": {
                "type": "object",
                "properties": {
                  "<field_name>": {
                    "type": "array",
                    "items": {
                      "type": "string"
                    }
                  }
                }
              }
            }
          },
          "message": {
            "type": "string"
          }
        },
        "type": "object"
      },
      "HealthcheckOut": {
        "type": "object",
        "properties": {
          "status": {
            "type": "string"
          }
        }
      },
      "AppPasswordIn": {
        "type": "object",
        "properties": {
          "username": {
            "type": "string"
          },
          "password": {
            "type": "string"
          }
        },
        "required": [
          "password",
          "username"
        ]
      },
      "AppPasswordOut": {
        "type": "object",
        "properties": {
          "app_password": {
            "type": "string"
          }
        }
      }
    }
  }
}
