<svg xmlns="http://www.w3.org/2000/svg" width="137" height="27" fill="none" viewBox="0 0 137 27">
  <g clip-path="url(#a)">
    <path fill="#1E50A0" fill-rule="evenodd" d="M17.332 7.888a6.805 6.805 0 0 0-3.768-1.138V0c2.683 0 5.306.792 7.536 2.275a13.514 13.514 0 0 1 4.996 6.059 13.44 13.44 0 0 1 .772 7.8 13.48 13.48 0 0 1-3.712 6.912 13.584 13.584 0 0 1-6.945 3.695c-2.632.52-5.359.253-7.838-.769A13.55 13.55 0 0 1 2.286 21 13.455 13.455 0 0 1 0 13.5h6.782c0 1.335.398 2.64 1.143 3.75a6.775 6.775 0 0 0 3.044 2.486 6.812 6.812 0 0 0 7.391-1.463 6.72 6.72 0 0 0 1.47-7.356 6.757 6.757 0 0 0-2.498-3.03Z" clip-rule="evenodd"/>
    <path fill="#1E50A0" fill-rule="evenodd" d="M6.782 0a6.722 6.722 0 0 1-1.986 4.773A6.784 6.784 0 0 1 0 6.75v6.75c1.781 0 3.545-.35 5.19-1.028a13.57 13.57 0 0 0 4.401-2.926 13.494 13.494 0 0 0 2.94-4.38A13.444 13.444 0 0 0 13.565 0H6.782Z" clip-rule="evenodd"/>
    <path fill="#1E50A0" d="M85.197 9.755h-3.29V20.16h3.29V9.755Zm-2.925-1.947c.344.342.774.513 1.29.513.517 0 .94-.17 1.27-.513.33-.357.495-.785.495-1.285 0-.514-.165-.942-.496-1.284-.33-.343-.752-.514-1.269-.514-.516 0-.946.171-1.29.514-.33.342-.495.77-.495 1.284 0 .5.165.928.495 1.285ZM34.695 20.159V5.046h3.377v12.159h6.732v2.954H34.695Z"/>
    <path fill="#1E50A0" fill-rule="evenodd" d="M50.885 20.394c-1.075 0-2.05-.235-2.925-.706a5.512 5.512 0 0 1-2.043-1.97c-.502-.827-.753-1.755-.753-2.782 0-1.028.251-1.948.753-2.762a5.402 5.402 0 0 1 2.043-1.926c.86-.485 1.835-.728 2.925-.728 1.09 0 2.065.236 2.925.706a5.35 5.35 0 0 1 2.043 1.948c.502.814.753 1.734.753 2.762 0 1.027-.25 1.955-.753 2.782a5.51 5.51 0 0 1-2.043 1.97c-.86.47-1.835.706-2.925.706Zm0-2.975c.473 0 .89-.1 1.248-.3.358-.214.63-.506.817-.878.2-.385.301-.82.301-1.305s-.1-.906-.301-1.263a2.09 2.09 0 0 0-.839-.856c-.344-.215-.753-.322-1.226-.322-.459 0-.867.107-1.226.322a2.11 2.11 0 0 0-.839.856c-.2.37-.3.799-.3 1.284 0 .471.1.9.3 1.284.201.372.48.664.84.878.358.2.766.3 1.225.3Zm8.327 6.807c.875.4 1.886.6 3.033.6 1.118 0 2.115-.222 2.99-.664.874-.443 1.562-1.056 2.064-1.841.502-.785.753-1.713.753-2.783V9.756h-3.226v.699a3.48 3.48 0 0 0-.817-.507c-.56-.27-1.198-.407-1.915-.407-.96 0-1.814.229-2.56.685a4.748 4.748 0 0 0-1.763 1.841c-.43.771-.645 1.642-.645 2.612 0 .956.215 1.827.645 2.612a4.907 4.907 0 0 0 1.764 1.862c.745.457 1.599.685 2.56.685a4.42 4.42 0 0 0 1.913-.407c.278-.131.53-.286.753-.464v.657c0 .728-.236 1.291-.71 1.69-.458.4-1.096.6-1.914.6-.66 0-1.226-.114-1.699-.342a3.918 3.918 0 0 1-1.247-1.006l-2.022 2.012c.502.713 1.183 1.263 2.043 1.648Zm4.689-7.6c-.33.2-.724.3-1.183.3-.459 0-.86-.1-1.204-.3a2.111 2.111 0 0 1-.775-.813 2.416 2.416 0 0 1-.28-1.134c0-.428.094-.813.28-1.156a2.07 2.07 0 0 1 .796-.813c.344-.2.739-.3 1.183-.3.459 0 .853.1 1.183.3.344.2.602.47.774.813.187.343.28.728.28 1.156 0 .428-.093.813-.28 1.156-.172.328-.43.592-.774.792Zm11.076 3.768c-1.075 0-2.05-.235-2.925-.706a5.51 5.51 0 0 1-2.043-1.97c-.502-.827-.753-1.755-.753-2.782 0-1.028.25-1.948.753-2.762a5.4 5.4 0 0 1 2.043-1.926c.86-.485 1.835-.728 2.925-.728 1.09 0 2.065.236 2.925.706a5.349 5.349 0 0 1 2.043 1.948c.502.814.753 1.734.753 2.762 0 1.027-.25 1.955-.753 2.782a5.51 5.51 0 0 1-2.043 1.97c-.86.47-1.835.706-2.925.706Zm0-2.975c.473 0 .889-.1 1.248-.3.358-.214.63-.506.817-.878.2-.385.3-.82.3-1.305s-.1-.906-.3-1.263a2.093 2.093 0 0 0-.84-.856c-.343-.215-.752-.322-1.225-.322-.459 0-.868.107-1.226.322-.359.2-.638.485-.839.856-.2.37-.301.799-.301 1.284 0 .471.1.9.301 1.284.2.372.48.664.84.878.357.2.766.3 1.225.3Zm18.13 2.954a4.569 4.569 0 0 1-1.936-.407 4.12 4.12 0 0 1-.838-.51v5.091h-3.248V9.756h3.29v.718c.24-.195.505-.363.796-.504a4.374 4.374 0 0 1 1.936-.429c.99 0 1.864.236 2.624.707a4.878 4.878 0 0 1 1.807 1.927c.445.813.666 1.74.666 2.782s-.221 1.97-.666 2.783a4.88 4.88 0 0 1-1.807 1.927c-.76.47-1.635.706-2.624.706Zm-.602-2.954c.473 0 .882-.107 1.226-.321a2.25 2.25 0 0 0 .839-.878c.2-.37.3-.792.3-1.263 0-.485-.1-.913-.3-1.284a2.1 2.1 0 0 0-.84-.856c-.343-.214-.745-.321-1.204-.321-.458 0-.867.107-1.225.32-.345.2-.617.486-.817.857a2.653 2.653 0 0 0-.302 1.284c0 .471.093.892.28 1.263.2.371.48.664.839.878.358.214.76.321 1.204.321Z" clip-rule="evenodd"/>
    <path fill="#1E50A0" d="M101.424 20.18a7.225 7.225 0 0 0 1.828.235c1.305 0 2.337-.3 3.098-.899.773-.599 1.161-1.405 1.161-2.418 0-.657-.122-1.185-.366-1.584a2.834 2.834 0 0 0-.946-.985 5.654 5.654 0 0 0-1.226-.578 18.92 18.92 0 0 0-1.226-.364 4.472 4.472 0 0 1-.947-.343c-.243-.128-.365-.3-.365-.513 0-.2.094-.35.279-.45.187-.114.466-.171.839-.171.388 0 .782.078 1.183.235.416.157.789.428 1.119.814l1.871-1.884c-.473-.6-1.09-1.049-1.85-1.348-.745-.314-1.562-.471-2.452-.471-.845 0-1.584.142-2.215.428-.631.285-1.119.678-1.463 1.177-.343.485-.516 1.063-.516 1.734 0 .628.122 1.149.366 1.563.243.4.559.713.946.941.387.229.796.407 1.226.536.43.128.839.25 1.226.363.387.1.703.222.947.364.258.129.387.322.387.578 0 .2-.108.357-.323.471-.201.114-.494.171-.882.171-.559 0-1.075-.1-1.548-.3a3.775 3.775 0 0 1-1.226-.877l-1.871 1.884c.358.385.788.728 1.29 1.027a7.29 7.29 0 0 0 1.656.664Zm12.088.214c-.96 0-1.814-.192-2.559-.578a4.483 4.483 0 0 1-1.721-1.627c-.416-.699-.624-1.498-.624-2.397V9.755h3.291v5.994c0 .357.057.664.172.92.129.257.316.457.559.6.244.143.538.214.882.214.488 0 .875-.15 1.162-.45.287-.314.43-.742.43-1.284V9.755h3.29v6.015c0 .914-.207 1.72-.624 2.42a4.474 4.474 0 0 1-1.72 1.626c-.731.386-1.577.578-2.538.578Zm9.809-10.638h-3.291v10.403h3.291v-6.08c0-.356.072-.656.215-.898.158-.243.366-.429.624-.557.258-.143.552-.214.882-.214.473 0 .867.15 1.182.45.331.285.496.692.496 1.22v6.079h3.29v-6.08c0-.356.072-.656.215-.898.158-.243.366-.429.624-.557.258-.143.552-.214.882-.214.473 0 .867.15 1.183.45.329.285.494.692.494 1.22v6.079h3.292v-6.443c0-.87-.187-1.613-.56-2.226a3.585 3.585 0 0 0-1.484-1.435c-.616-.342-1.327-.514-2.13-.514-.817 0-1.555.179-2.215.536a4.01 4.01 0 0 0-1.123.88 3.669 3.669 0 0 0-1.092-.923c-.573-.328-1.226-.493-1.957-.493-.775 0-1.47.165-2.086.493-.269.136-.512.3-.732.49v-.768Z"/>
  </g>
  <defs>
    <clipPath id="a">
      <path fill="#fff" d="M0 0h137v27H0z"/>
    </clipPath>
  </defs>
</svg>
