[
  {
    "model": "accounts.language",
    "pk": 1,
    "fields": {
      "name": "Español",
      "iso_code": "es"
    }
  },
  {
    "model": "accounts.language",
    "pk": 2,
    "fields": {
      "name": "Português",
      "iso_code": "pt"
    }
  },
  {
    "model": "accounts.language",
    "pk": 3,
    "fields": {
      "name": "English",
      "iso_code": "en"
    }
  }
]
