<svg xmlns="http://www.w3.org/2000/svg" width="193" height="56" fill="none" viewBox="0 0 193 56">
  <rect width="193" height="56" fill="#6A74AD" rx="3"/>
  <path fill="#fff" d="M34.765 33c-.352 0-.624-.09-.816-.272-.181-.192-.272-.464-.272-.816v-9.104c0-.352.091-.619.272-.8.192-.192.464-.288.816-.288h3.84c.79 0 1.462.117 2.016.352.555.235.976.57 1.264 1.008.299.437.448.96.448 1.568 0 .683-.197 1.259-.592 1.728-.394.47-.933.784-1.616.944v-.24c.79.117 1.403.416 1.84.896.438.48.656 1.104.656 1.872 0 1.003-.341 1.781-1.024 2.336-.672.544-1.61.816-2.816.816h-4.016Zm.88-1.552h2.88c.726 0 1.259-.139 1.6-.416.342-.288.512-.715.512-1.28 0-.576-.17-1.003-.512-1.28-.341-.277-.874-.416-1.6-.416h-2.88v3.392Zm0-4.944h2.608c.704 0 1.227-.133 1.568-.4.352-.277.528-.683.528-1.216 0-.533-.176-.933-.528-1.2-.341-.277-.864-.416-1.568-.416h-2.608v3.232Zm12.712 6.656c-.885 0-1.648-.165-2.288-.496-.64-.33-1.136-.8-1.488-1.408-.341-.608-.512-1.328-.512-2.16 0-.81.165-1.52.496-2.128a3.721 3.721 0 0 1 1.392-1.424c.597-.352 1.275-.528 2.032-.528.555 0 1.05.09 1.488.272.448.181.827.443 1.136.784.32.341.56.757.72 1.248.17.48.256 1.024.256 1.632 0 .192-.07.341-.208.448-.128.096-.315.144-.56.144h-5.136v-1.152h4.496l-.256.24c0-.49-.075-.901-.224-1.232a1.561 1.561 0 0 0-.624-.752c-.267-.181-.603-.272-1.008-.272-.448 0-.832.107-1.152.32a1.98 1.98 0 0 0-.72.88c-.16.373-.24.821-.24 1.344v.112c0 .875.203 1.53.608 1.968.416.427 1.024.64 1.824.64.277 0 .587-.032.928-.096.352-.075.683-.197.992-.368.224-.128.421-.181.592-.16.17.01.304.07.4.176.107.107.17.24.192.4a.748.748 0 0 1-.096.464.99.99 0 0 1-.4.416A4.29 4.29 0 0 1 49.7 33c-.48.107-.928.16-1.344.16Zm8.464 2.88a8.709 8.709 0 0 1-1.68-.16 5.577 5.577 0 0 1-1.456-.496c-.203-.107-.342-.235-.416-.384a.87.87 0 0 1-.064-.464.93.93 0 0 1 .192-.4.812.812 0 0 1 .384-.24.606.606 0 0 1 .464.064c.47.235.912.384 1.328.448.426.075.79.112 1.088.112.715 0 1.248-.176 1.6-.528.362-.341.544-.853.544-1.536v-1.44h.144c-.16.544-.496.981-1.008 1.312-.502.32-1.072.48-1.712.48-.704 0-1.318-.16-1.84-.48a3.318 3.318 0 0 1-1.216-1.376c-.288-.587-.432-1.27-.432-2.048 0-.587.08-1.115.24-1.584.17-.48.405-.89.704-1.232a3.12 3.12 0 0 1 1.104-.784 3.543 3.543 0 0 1 1.44-.288c.661 0 1.237.165 1.728.496.501.32.826.747.976 1.28l-.16.4v-1.136c0-.33.085-.581.256-.752.181-.17.426-.256.736-.256.32 0 .565.085.736.256.17.17.256.421.256.752v6.16c0 1.27-.336 2.224-1.008 2.864-.672.64-1.648.96-2.928.96Zm-.048-4.752c.416 0 .773-.096 1.072-.288.299-.192.528-.464.688-.816.17-.363.256-.79.256-1.28 0-.736-.181-1.312-.544-1.728-.363-.427-.853-.64-1.472-.64-.416 0-.774.096-1.072.288a1.959 1.959 0 0 0-.704.816c-.16.352-.24.773-.24 1.264 0 .736.181 1.317.544 1.744.362.427.853.64 1.472.64Zm7.048 1.824c-.32 0-.565-.096-.736-.288-.17-.192-.256-.459-.256-.8v-5.872c0-.352.085-.619.256-.8.17-.192.416-.288.736-.288s.565.096.736.288c.181.181.272.448.272.8v5.872c0 .341-.085.608-.256.8-.17.192-.421.288-.752.288Zm0-9.536c-.373 0-.667-.09-.88-.272-.203-.192-.304-.453-.304-.784 0-.341.101-.603.304-.784.213-.181.507-.272.88-.272.384 0 .677.09.88.272.203.181.304.443.304.784 0 .33-.101.592-.304.784-.203.181-.496.272-.88.272Zm4.078 9.552c-.32 0-.565-.085-.736-.256-.17-.181-.256-.437-.256-.768v-6.048c0-.33.086-.581.256-.752.17-.17.41-.256.72-.256s.55.085.72.256c.17.17.256.421.256.752v1.088l-.176-.4c.235-.565.597-.992 1.088-1.28a3.25 3.25 0 0 1 1.696-.448c.63 0 1.147.117 1.552.352s.71.592.912 1.072c.203.47.304 1.067.304 1.792v3.872c0 .33-.085.587-.256.768-.17.17-.416.256-.736.256s-.57-.085-.752-.256c-.17-.181-.256-.437-.256-.768v-3.776c0-.608-.117-1.05-.352-1.328-.224-.277-.576-.416-1.056-.416-.587 0-1.056.187-1.408.56-.341.363-.512.848-.512 1.456v3.504c0 .683-.336 1.024-1.008 1.024Zm13.927 0c-.33 0-.586-.09-.768-.272-.17-.192-.256-.453-.256-.784V22.76c0-.341.091-.597.272-.768.182-.181.438-.272.768-.272h3.856c1.238 0 2.192.299 2.864.896.672.587 1.008 1.413 1.008 2.48 0 .693-.154 1.29-.464 1.792-.298.501-.736.885-1.312 1.152-.576.267-1.274.4-2.096.4l.144-.24h.528c.438 0 .816.107 1.136.32.331.213.619.55.864 1.008l1.2 2.224c.128.224.187.443.176.656a.743.743 0 0 1-.24.528c-.149.128-.368.192-.656.192-.288 0-.522-.059-.704-.176a1.648 1.648 0 0 1-.48-.576L86.05 29.4c-.192-.363-.421-.603-.688-.72-.256-.128-.586-.192-.992-.192h-1.52v3.584c0 .33-.085.592-.256.784-.17.181-.426.272-.768.272Zm1.024-6.16h2.496c.736 0 1.291-.15 1.664-.448.384-.31.576-.768.576-1.376 0-.597-.192-1.045-.576-1.344-.373-.31-.928-.464-1.664-.464H82.85v3.632Zm12.382 6.192c-.885 0-1.648-.165-2.288-.496-.64-.33-1.136-.8-1.488-1.408-.341-.608-.512-1.328-.512-2.16 0-.81.165-1.52.496-2.128a3.721 3.721 0 0 1 1.392-1.424c.597-.352 1.275-.528 2.032-.528.555 0 1.05.09 1.488.272.448.181.827.443 1.136.784.32.341.56.757.72 1.248.17.48.256 1.024.256 1.632 0 .192-.07.341-.208.448-.128.096-.315.144-.56.144H92.56v-1.152h4.496l-.256.24c0-.49-.075-.901-.224-1.232a1.561 1.561 0 0 0-.624-.752c-.267-.181-.603-.272-1.008-.272-.448 0-.832.107-1.152.32a1.98 1.98 0 0 0-.72.88c-.16.373-.24.821-.24 1.344v.112c0 .875.203 1.53.608 1.968.416.427 1.024.64 1.824.64.277 0 .587-.032.928-.096.352-.075.683-.197.992-.368.224-.128.421-.181.592-.16.17.01.304.07.4.176.107.107.17.24.192.4a.748.748 0 0 1-.096.464.99.99 0 0 1-.4.416 4.29 4.29 0 0 1-1.296.528c-.48.107-.928.16-1.344.16Zm8.464 2.88a8.709 8.709 0 0 1-1.68-.16 5.565 5.565 0 0 1-1.456-.496c-.203-.107-.342-.235-.416-.384a.86.86 0 0 1-.064-.464.93.93 0 0 1 .192-.4.806.806 0 0 1 .384-.24.606.606 0 0 1 .464.064c.469.235.912.384 1.328.448a6.43 6.43 0 0 0 1.088.112c.714 0 1.248-.176 1.6-.528.362-.341.544-.853.544-1.536v-1.44h.144c-.16.544-.496.981-1.008 1.312-.502.32-1.072.48-1.712.48-.704 0-1.318-.16-1.84-.48a3.316 3.316 0 0 1-1.216-1.376c-.288-.587-.432-1.27-.432-2.048 0-.587.08-1.115.24-1.584.17-.48.405-.89.704-1.232a3.112 3.112 0 0 1 1.104-.784 3.54 3.54 0 0 1 1.44-.288c.661 0 1.237.165 1.728.496.501.32.826.747.976 1.28l-.16.4v-1.136c0-.33.085-.581.256-.752.181-.17.426-.256.736-.256.32 0 .565.085.736.256.17.17.256.421.256.752v6.16c0 1.27-.336 2.224-1.008 2.864-.672.64-1.648.96-2.928.96Zm-.048-4.752c.416 0 .773-.096 1.072-.288.298-.192.528-.464.688-.816.17-.363.256-.79.256-1.28 0-.736-.182-1.312-.544-1.728-.363-.427-.854-.64-1.472-.64-.416 0-.774.096-1.072.288a1.952 1.952 0 0 0-.704.816c-.16.352-.24.773-.24 1.264 0 .736.181 1.317.544 1.744.362.427.853.64 1.472.64Zm7.048 1.824c-.32 0-.565-.096-.736-.288-.171-.192-.256-.459-.256-.8v-5.872c0-.352.085-.619.256-.8.171-.192.416-.288.736-.288s.565.096.736.288c.181.181.272.448.272.8v5.872c0 .341-.085.608-.256.8-.171.192-.421.288-.752.288Zm0-9.536c-.373 0-.667-.09-.88-.272-.203-.192-.304-.453-.304-.784 0-.341.101-.603.304-.784.213-.181.507-.272.88-.272.384 0 .677.09.88.272.203.181.304.443.304.784 0 .33-.101.592-.304.784-.203.181-.496.272-.88.272Zm5.95 9.584c-.458 0-.944-.048-1.456-.144a4.313 4.313 0 0 1-1.376-.496 1.018 1.018 0 0 1-.368-.368.92.92 0 0 1-.08-.432.787.787 0 0 1 .16-.384.666.666 0 0 1 .352-.208.72.72 0 0 1 .48.08c.427.203.827.347 1.2.432.374.075.742.112 1.104.112.512 0 .891-.085 1.136-.256.256-.181.384-.416.384-.704 0-.245-.085-.432-.256-.56-.16-.139-.405-.24-.736-.304l-1.6-.304c-.661-.128-1.168-.368-1.52-.72-.341-.363-.512-.827-.512-1.392 0-.512.139-.955.416-1.328.288-.373.683-.661 1.184-.864.502-.203 1.078-.304 1.728-.304.47 0 .907.053 1.312.16.416.096.816.25 1.2.464.16.085.267.197.32.336a.67.67 0 0 1 .048.432.932.932 0 0 1-.192.384.667.667 0 0 1-.368.208c-.138.021-.298-.01-.48-.096a4.28 4.28 0 0 0-.96-.368 3.55 3.55 0 0 0-.864-.112c-.522 0-.912.09-1.168.272a.853.853 0 0 0-.368.72c0 .224.075.41.224.56.15.15.379.25.688.304l1.6.304c.694.128 1.216.363 1.568.704.363.341.544.8.544 1.376 0 .779-.304 1.392-.912 1.84-.608.437-1.418.656-2.432.656Zm8.455 0c-.694 0-1.275-.117-1.744-.352a2.265 2.265 0 0 1-1.024-1.024c-.224-.459-.336-1.024-.336-1.696V26.68h-.832c-.256 0-.454-.064-.592-.192-.139-.139-.208-.325-.208-.56 0-.245.069-.432.208-.56.138-.128.336-.192.592-.192h.832V23.72c0-.33.085-.581.256-.752.181-.17.432-.256.752-.256s.565.085.736.256c.17.17.256.421.256.752v1.456h1.696c.256 0 .453.064.592.192.138.128.208.315.208.56 0 .235-.07.421-.208.56-.139.128-.336.192-.592.192h-1.696v3.296c0 .512.112.896.336 1.152.224.256.586.384 1.088.384.181 0 .341-.016.48-.048.138-.032.261-.053.368-.064a.367.367 0 0 1 .32.128c.085.085.128.267.128.544 0 .213-.038.405-.112.576a.58.58 0 0 1-.368.336c-.139.043-.32.08-.544.112a3.214 3.214 0 0 1-.592.064Zm3.58-.032c-.33 0-.586-.085-.768-.256-.17-.181-.256-.437-.256-.768v-6.048c0-.33.086-.581.256-.752.171-.17.411-.256.72-.256.31 0 .55.085.72.256.171.17.256.421.256.752v1.008h-.16c.15-.64.443-1.125.88-1.456.438-.33 1.019-.528 1.744-.592.224-.021.4.037.528.176.139.128.219.33.24.608.022.267-.042.485-.192.656-.138.16-.352.256-.64.288l-.352.032c-.65.064-1.141.267-1.472.608-.33.33-.496.8-.496 1.408v3.312c0 .33-.085.587-.256.768-.17.17-.421.256-.752.256Zm7.74.032a3.491 3.491 0 0 1-1.52-.32 2.75 2.75 0 0 1-1.04-.896 2.245 2.245 0 0 1-.368-1.264c0-.576.149-1.03.448-1.36.298-.341.784-.587 1.456-.736.672-.15 1.573-.224 2.704-.224h.8v1.152h-.784c-.662 0-1.19.032-1.584.096-.395.064-.678.176-.848.336-.16.15-.24.363-.24.64 0 .352.122.64.368.864.245.224.586.336 1.024.336.352 0 .661-.08.928-.24.277-.17.496-.4.656-.688.16-.288.24-.619.24-.992v-1.84c0-.533-.118-.917-.352-1.152-.235-.235-.63-.352-1.184-.352-.31 0-.646.037-1.008.112a5.362 5.362 0 0 0-1.12.384c-.203.096-.384.123-.544.08a.61.61 0 0 1-.352-.256.834.834 0 0 1-.128-.448c0-.16.042-.315.128-.464a.76.76 0 0 1 .432-.352c.49-.203.96-.347 1.408-.432a6.87 6.87 0 0 1 1.248-.128c.768 0 1.397.117 1.888.352.501.235.874.592 1.12 1.072.245.47.368 1.077.368 1.824v3.84c0 .33-.08.587-.24.768-.16.17-.39.256-.688.256-.299 0-.534-.085-.704-.256-.16-.181-.24-.437-.24-.768v-.768h.128a2.223 2.223 0 0 1-.448.976 2.179 2.179 0 0 1-.816.624c-.331.15-.71.224-1.136.224Zm9.758 0c-.694 0-1.275-.117-1.744-.352a2.265 2.265 0 0 1-1.024-1.024c-.224-.459-.336-1.024-.336-1.696V26.68h-.832c-.256 0-.454-.064-.592-.192-.139-.139-.208-.325-.208-.56 0-.245.069-.432.208-.56.138-.128.336-.192.592-.192h.832V23.72c0-.33.085-.581.256-.752.181-.17.432-.256.752-.256s.565.085.736.256c.17.17.256.421.256.752v1.456h1.696c.256 0 .453.064.592.192.138.128.208.315.208.56 0 .235-.07.421-.208.56-.139.128-.336.192-.592.192h-1.696v3.296c0 .512.112.896.336 1.152.224.256.586.384 1.088.384.181 0 .341-.016.48-.048.138-.032.261-.053.368-.064a.367.367 0 0 1 .32.128c.085.085.128.267.128.544 0 .213-.038.405-.112.576a.58.58 0 0 1-.368.336c-.139.043-.32.08-.544.112a3.214 3.214 0 0 1-.592.064Zm3.751-.048c-.32 0-.565-.096-.736-.288-.17-.192-.256-.459-.256-.8v-5.872c0-.352.086-.619.256-.8.171-.192.416-.288.736-.288s.566.096.736.288c.182.181.272.448.272.8v5.872c0 .341-.085.608-.256.8-.17.192-.421.288-.752.288Zm0-9.536c-.373 0-.666-.09-.88-.272-.202-.192-.304-.453-.304-.784 0-.341.102-.603.304-.784.214-.181.507-.272.88-.272.384 0 .678.09.88.272.203.181.304.443.304.784 0 .33-.101.592-.304.784-.202.181-.496.272-.88.272Zm6.655 9.584c-.811 0-1.515-.165-2.112-.496a3.462 3.462 0 0 1-1.392-1.408c-.331-.619-.496-1.344-.496-2.176 0-.63.09-1.19.272-1.68.192-.501.464-.928.816-1.28a3.355 3.355 0 0 1 1.264-.816 4.488 4.488 0 0 1 1.648-.288c.81 0 1.514.165 2.112.496.597.33 1.061.8 1.392 1.408.33.608.496 1.328.496 2.16 0 .63-.096 1.195-.288 1.696a3.596 3.596 0 0 1-.8 1.296 3.644 3.644 0 0 1-1.264.816 4.729 4.729 0 0 1-1.648.272Zm0-1.52c.394 0 .741-.096 1.04-.288.298-.192.528-.475.688-.848.17-.384.256-.859.256-1.424 0-.853-.182-1.488-.544-1.904-.363-.427-.843-.64-1.44-.64-.395 0-.742.096-1.04.288-.299.181-.534.464-.704.848-.16.373-.24.843-.24 1.408 0 .843.181 1.483.544 1.92.362.427.842.64 1.44.64Zm6.642 1.488c-.32 0-.565-.085-.736-.256-.17-.181-.256-.437-.256-.768v-6.048c0-.33.086-.581.256-.752.171-.17.411-.256.72-.256.31 0 .55.085.72.256.171.17.256.421.256.752v1.088l-.176-.4c.235-.565.598-.992 1.088-1.28a3.252 3.252 0 0 1 1.696-.448c.63 0 1.147.117 1.552.352.406.235.71.592.912 1.072.203.47.304 1.067.304 1.792v3.872c0 .33-.085.587-.256.768-.17.17-.416.256-.736.256s-.57-.085-.752-.256c-.17-.181-.256-.437-.256-.768v-3.776c0-.608-.117-1.05-.352-1.328-.224-.277-.576-.416-1.056-.416-.586 0-1.056.187-1.408.56-.341.363-.512.848-.512 1.456v3.504c0 .683-.336 1.024-1.008 1.024Z"/>
</svg>
