{
  "kind": "collectionType",
  "collectionName": "publications",
  "info": {
    "singularName": "publication",
    "pluralName": "publications",
    "displayName": "Publication",
    "description": ""
  },
  "options": {
    "draftAndPublish": true,
    "privateAttributes": []
  },
  "pluginOptions": {},
  "attributes": {
    "identifier": {
      "type": "uid",
      "required": false
    },
    "title": {
      "type": "string",
      "required": true
    },
    "description": {
      "type": "text",
      "required": true
    },
    "coverage": {
      "type": "string",
      "required": true
    },
    "publisher": {
      "type": "string",
      "required": true
    },
    "date": {
      "type": "datetime",
      "required": true
    },
    "rights": {
      "type": "text",
      "required": true
    },
    "creator": {
      "type": "string"
    },
    "content": {
      "type": "richtext"
    },
    "purpose": {
      "type": "enumeration",
      "enum": [
        "publication",
        "serie"
      ],
      "default": "publication"
    },
    "subject": {
      "type": "relation",
      "relation": "manyToOne",
      "target": "api::category.category",
      "inversedBy": "publications"
    },
    "tags": {
      "type": "text"
    },
    "views": {
      "type": "integer",
      "default": 0
    },
    "relation": {
      "type": "media",
      "multiple": false,
      "required": false,
      "allowedTypes": [
        "images"
      ]
    },
    "files": {
      "type": "relation",
      "relation": "oneToMany",
      "target": "api::publication-file.publication-file",
      "mappedBy": "publication"
    },
    "language": {
      "type": "string",
      "required": true
    },
    "disapprovalReason": {
      "type": "text",
      "maxLength": 1000
    },
    "disapprovedAt": {
      "type": "datetime"
    }
  }
}
