{
  "kind": "collectionType",
  "collectionName": "media_groups",
  "info": {
    "singularName": "media-group",
    "pluralName": "media-groups",
    "displayName": "MediaGroup"
  },
  "options": {
    "draftAndPublish": false
  },
  "pluginOptions": {},
  "attributes": {
    "token": {
      "type": "string",
      "required": true,
      "unique": true
    },
    "avatar": {
      "allowedTypes": [
        "images"
      ],
      "type": "media",
      "multiple": false,
      "required": false
    }
  }
}
