{
  "kind": "collectionType",
  "collectionName": "publication_files",
  "info": {
    "singularName": "publication-file",
    "pluralName": "publication-files",
    "displayName": "PublicationFile",
    "description": ""
  },
  "options": {
    "draftAndPublish": false
  },
  "pluginOptions": {},
  "attributes": {
    "title": {
      "type": "string",
      "required": true
    },
    "description": {
      "type": "text",
      "required": true
    },
    "language": {
      "type": "string",
      "maxLength": 10,
      "required": true
    },
    "identifier": {
      "type": "uid",
      "required": true
    },
    "creator": {
      "type": "string"
    },
    "format": {
      "type": "string",
      "required": true
    },
    "extent_size": {
      "type": "decimal"
    },
    "extent_duration": {
      "type": "decimal"
    },
    "media": {
      "type": "media",
      "multiple": false,
      "required": false,
      "allowedTypes": [
        "images",
        "files",
        "videos",
        "audios"
      ]
    },
    "downloads": {
      "type": "integer",
      "default": 0
    },
    "tags": {
      "type": "text"
    },
    "publication": {
      "type": "relation",
      "relation": "manyToOne",
      "target": "api::publication.publication",
      "inversedBy": "files"
    },
    "position": {
      "type": "integer"
    }
  }
}
