C:\Users\Cstrife\Desktop\quoco-rest\dodgydrivers\src\main\java\service\dodgydrivers\DDQService.java
C:\Users\Cstrife\Desktop\quoco-rest\dodgydrivers\src\main\java\service\dodgydrivers\NoSuchQuotationException.java
C:\Users\Cstrife\Desktop\quoco-rest\dodgydrivers\src\main\java\service\dodgydrivers\Application.java
