label,sub_category_key,tertiary_category_key
0,Sunglasses & Eyewear Accessories,Aviators
1,"Hats, Caps & Headwear",Balaclavas & Face Masks
2,"Hats, Caps & Headwear",Bandanas
3,"Hats, Caps & Headwear",Baseball Caps
4,Belts,Belts
5,"Wallets, Card Cases & Money Organizers",Bifold Wallets
6,Ties,Bow Ties
7,"Hats, Caps & Headwear",Bucket Hats
8,Sunglasses & Eyewear Accessories,Cat-Eye Sunglasses
9,"Hats, Caps & Headwear",Fedoras
10,"Hats, Caps & Headwear",Gaiters
11,Cold Weather Accessories,"Gloves, Earmuffs & Mittens"
12,Golf Accessories,Golf Gloves
13,Golf Accessories,Golf Grips
14,Golf Accessories,Golf Head Covers
15,"Hats, Caps & Headwear",Headbands
16,"Wallets, Card Cases & Money Organizers",ID & Card Holders/Cases
17,Shoe Accessories,Inserts & Insoles
18,Keyrings & Keychains,Keyrings & Keychains
19,"Wallets, Card Cases & Money Organizers",Money Clips
20,Ties,Neckties
21,"Hats, Caps & Headwear",Newsboy Caps
22,Golf Accessories,Other Golf Accessories
23,"Hats, Caps & Headwear",Other Hats
24,Sunglasses & Eyewear Accessories,Other Sunglasses & Eyewear Accessories
25,Ties,Other Ties
26,"Wallets, Card Cases & Money Organizers",Other Wallets
27,"Wallets, Card Cases & Money Organizers",Purse & Coin Pouches
28,Sunglasses & Eyewear Accessories,Rectangle Sunglasses
29,Sunglasses & Eyewear Accessories,Replacement Lens
30,Sunglasses & Eyewear Accessories,Round Sunglasses
31,Cold Weather Accessories,Scarves & Wraps
32,"Hats, Caps & Headwear","Skullies, Knit Hats & Beanies"
33,Sunglasses & Eyewear Accessories,Square Sunglasses
34,Suspenders,Suspenders
35,"Wallets, Card Cases & Money Organizers",Trifold Wallets
36,"Hats, Caps & Headwear",Trucker Hats
37,Umbrellas,Umbrellas
38,"Hats, Caps & Headwear",Visors
39,"Wallets, Card Cases & Money Organizers",Zip Wallets
