label,sub_category_key,tertiary_category_key
0,Bikinis,Bikini Bottoms
1,Bikinis,Bikini Sets
2,Bikinis,Bikini Tops
3,Cover-Ups,Caftan & Tunic Cover-Ups
4,One-Piece Swimsuits,One-Piece Swimsuits
5,Cover-Ups,Other Cover-Ups
6,Other Swimsuits & Cover-Ups,Other Swimsuits & Cover-Ups
7,Rash Guards,Rash Guards
8,Cover-Ups,Sarongs
9,Swim Trunks & Board Shorts,Swim Trunks & Board Shorts
10,Tankinis,Tankinis
11,Two-Piece Swimsuits,Two-Piece Swimsuits
