module AutoPrintPage = Toolkit__Ui_AutoPrintPage
module Button = Toolkit__Ui_Button
module ButtonGroup = Toolkit__Ui_ButtonGroup
module ButtonGroup2 = Toolkit__Ui_ButtonGroup2
module Spinner = Toolkit__Ui_Spinner
module Card = Toolkit__Ui_Card
module Modal = Toolkit__Ui_Modal
module Spread = Toolkit__Ui_Spread
module DatetimeInput = Toolkit__Ui_DatetimeInput
module TextInput = Toolkit__Ui_TextInput
module Tooltip = Toolkit__Ui_Tooltip
module Switch = Toolkit__Ui_Switch
module Radio = Toolkit__Ui_Radio
module Checkbox = Toolkit__Ui_Checkbox
module TextareaInput = Toolkit__Ui_TextareaInput
module Label = Toolkit__Ui_Label
module Snackbar = Toolkit__Ui_Snackbar
module Alert = Toolkit__Ui_Alert
module IconButton = Toolkit__Ui_IconButton
module Tag = Toolkit__Ui_Tag
module Select = Toolkit__Ui_Select
module SelectPolyvariant = Toolkit__Ui_SelectPolyvariant
module Listbox = Toolkit__Ui_Listbox
module Table = Toolkit__Ui_Table
module Reference = Toolkit__Ui_Reference
module RichText = Toolkit__Ui_RichText
module ProgressBar = Toolkit__Ui_ProgressBar
module Dropdown = Toolkit__Ui_Dropdown
module PortalDropdown = Toolkit__Ui_PortalDropdown
module DropdownList = Toolkit__Ui_DropdownList
module Layout = Toolkit__Ui_Layout
module SpinnerFullScreen = Toolkit__Ui_SpinnerFullScreen
module MultiSelect = Toolkit__Ui_MultiSelect
module MultiSelectWithValidation = Toolkit__Ui_MultiSelectWithValidation
module SelectWithValidation = Toolkit__Ui_SelectWithValidation
module Notice = Toolkit__Ui_Notice
module NativeDatePicker = Toolkit__Ui_NativeDatePicker
module ErrorBoundary = Toolkit__Ui_ErrorBoundary
module WeekDateFilter = Toolkit__Ui_WeekDateFilter
module Coordinates = Toolkit__Ui_Coordinates
module Autocomplete = Toolkit__Ui_Autocomplete
module WeekdayNavigation = Toolkit__Ui_WeekdayNavigation
module Popover = Toolkit__Ui_Popover
module DropdownMenu = Toolkit__Ui_DropdownMenu
module ScrollArea = Toolkit__Ui_ScrollArea
module PasswordRulesNotice = Toolkit__Ui_PasswordRulesNotice
module SectionCard = Toolkit__Ui_SectionCard
module SuspenseImage = Toolkit__Ui_SuspenseImage
