open Toolkit__Ui

@react.component
let make = () => {
  let html = `
    <h1>
      test 2
    </h1>
  `
  let link = "https://www.colisweb.com"
  <div className="flex flex-col gap-4">
    <RichText text="test" />
    <RichText text=html />
    <RichText text=link />
  </div>
}
