{
	"success": true,
	"errorCode": 0,
	"data": [
		{"a":1, "b":2},
		{"a":1, "b":2},
		{"a":1, "b":2},
		{"a":1, "b":2},
		{"a":1, "b":2},
		{"a":1, "b":2},
		{"a":1, "b":2},
		{"a":1, "b":2},
		{"a":1, "b":2},
		{"a":1, "b":2},
		{"a":1, "b":2},
		{"a":1, "b":2},
		{"a":1, "b":2},
		{"a":1, "b":2}
	]
}
