<?xml version="1.0" standalone="no"?>
<!DOCTYPE svg PUBLIC "-//W3C//DTD SVG 1.1//EN" "http://www.w3.org/Graphics/SVG/1.1/DTD/svg11.dtd" >
<svg xmlns="http://www.w3.org/2000/svg">
<metadata>
Created by FontForge 20120731 at Fri Feb  5 07:40:21 2016
 By Ads
</metadata>
<defs>
<font id="iconfont" horiz-adv-x="1024" >
  <font-face 
    font-family="iconfont"
    font-weight="500"
    font-stretch="normal"
    units-per-em="1024"
    panose-1="2 0 6 3 0 0 0 0 0 0"
    ascent="896"
    descent="-128"
    x-height="792"
    bbox="0 -128 1024 896"
    underline-thickness="50"
    underline-position="-100"
    unicode-range="U+0078-E606"
  />
<missing-glyph horiz-adv-x="374" 
d="M34 0v682h272v-682h-272zM68 34h204v614h-204v-614z" />
    <glyph glyph-name=".notdef" horiz-adv-x="374" 
d="M34 0v682h272v-682h-272zM68 34h204v614h-204v-614z" />
    <glyph glyph-name=".null" horiz-adv-x="0" 
 />
    <glyph glyph-name="nonmarkingreturn" horiz-adv-x="341" 
 />
    <glyph glyph-name="x" unicode="x" horiz-adv-x="1001" 
d="M281 543q-27 -1 -53 -1h-83q-18 0 -36.5 -6t-32.5 -18.5t-23 -32t-9 -45.5v-76h912v41q0 16 -0.5 30t-0.5 18q0 13 -5 29t-17 29.5t-31.5 22.5t-49.5 9h-133v-97h-438v97zM955 310v-52q0 -23 0.5 -52t0.5 -58t-10.5 -47.5t-26 -30t-33 -16t-31.5 -4.5q-14 -1 -29.5 -0.5
t-29.5 0.5h-32l-45 128h-439l-44 -128h-29h-34q-20 0 -45 1q-25 0 -41 9.5t-25.5 23t-13.5 29.5t-4 30v167h911zM163 247q-12 0 -21 -8.5t-9 -21.5t9 -21.5t21 -8.5q13 0 22 8.5t9 21.5t-9 21.5t-22 8.5zM316 123q-8 -26 -14 -48q-5 -19 -10.5 -37t-7.5 -25t-3 -15t1 -14.5
t9.5 -10.5t21.5 -4h37h67h81h80h64h36q23 0 34 12t2 38q-5 13 -9.5 30.5t-9.5 34.5q-5 19 -11 39h-368zM336 498v228q0 11 2.5 23t10 21.5t20.5 15.5t34 6h188q31 0 51.5 -14.5t20.5 -52.5v-227h-327z" />
    <glyph glyph-name="uniE600" unicode="&#xe600;" 
d="M512 896q-104 0 -199 -40.5t-163.5 -109t-109 -163.5t-40.5 -199t40.5 -199t109 -163.5t163.5 -109t199 -40.5q83 0 161.5 26t141.5 73t110 110t73 141.5t26 161.5q0 104 -40.5 199t-109 163.5t-163.5 109t-199 40.5zM538 205q-3 -3 -8.5 -7.5t-19 -11.5t-24.5 -7
q-5 0 -11 1.5t-11 4t-9.5 5t-8 5t-6.5 5.5l-3 3l-2 2l-230 179q0 2 0.5 5t3 11t8 11t15 5.5t24.5 -6.5q48 -46 150 -126q68 -54 80 -54q11 0 77 81.5t130.5 169t74.5 108.5q41 20 50 -20l1 -6z" />
    <glyph glyph-name="uniE601" unicode="&#xe601;" 
d="M672 -16q-20 0 -34 14l-352 352q-9 9 -12.5 21.5t0 25t12.5 21.5l352 352q14 14 34 14t34 -14q9 -9 12.5 -21.5t0 -25t-12.5 -21.5l-318 -318l318 -318q14 -14 14 -34t-14 -34q-7 -7 -16 -10.5t-18 -3.5z" />
    <glyph glyph-name="uniE602" unicode="&#xe602;" 
d="M512 -64q-185 0 -316.5 131.5t-131.5 316.5t131.5 316.5t316.5 131.5t316.5 -131.5t131.5 -316.5t-131.5 -316.5t-316.5 -131.5zM512 768q-159 0 -271.5 -112.5t-112.5 -271.5t112.5 -271.5t271.5 -112.5t271.5 112.5t112.5 271.5t-112.5 271.5t-271.5 112.5zM669 395
q-2 3 -3.5 5.5t-3.5 4.5v0l-159 160q-9 9 -22.5 9t-23 -9t-9.5 -22.5t10 -22.5l136 -137l-138 -136q-9 -9 -9 -22.5t9.5 -23t22.5 -9.5q13 1 22 10l161 158q15 15 7 35z" />
    <glyph glyph-name="uniE603" unicode="&#xe603;" 
d="M890 565q-6 6 -14 8t-16.5 0t-14.5 -8l-328 -331l-332 329q-6 7 -14.5 9t-16.5 -0.5t-14 -8.5q-10 -9 -10 -22.5t10 -22.5l353 -350h1l1 -1v-1q5 -4 10.5 -6.5t12 -2.5t12.5 2.5t10 6.5l350 354q10 9 10 22.5t-10 22.5z" />
    <glyph glyph-name="uniE604" unicode="&#xe604;" 
d="M507 831q-90 0 -172.5 -35t-142 -94.5t-94.5 -141.5t-35 -172.5t35 -172.5t94.5 -141.5t142 -94.5t172.5 -35q72 0 140 22.5t122.5 63.5t95.5 95.5t63.5 122t22.5 140.5q0 90 -35.5 172t-94.5 141.5t-141.5 94.5t-172.5 35zM701 253q13 -12 13 -29.5t-13 -30.5
q-6 -6 -14 -9t-16 -3t-15.5 3t-14.5 9l-134 135l-135 -135q-6 -6 -14 -9t-16 -3t-15.5 3t-13.5 9q-13 13 -13 30.5t12 29.5l135 135l-134 134q-13 13 -13 30.5t12.5 29.5t30 12t29.5 -12l135 -135l134 135q13 12 30.5 12t29.5 -12q30 -30 0 -60l-134 -134zM701 253z" />
    <glyph glyph-name="uniE605" unicode="&#xe605;" 
d="M512.5 869q-98.5 0 -188.5 -38.5t-155 -103.5t-103.5 -155t-38.5 -188.5t38.5 -188.5t103.5 -155t155 -103.5t188.5 -38.5t188.5 38.5t155 103.5t103.5 155t38.5 188.5t-38.5 188.5t-103.5 155t-155 103.5t-188.5 38.5zM415 141l-243 243l68 68l175 -175l369 369l68 -68z
" />
    <glyph glyph-name="uniE606" unicode="&#xe606;" 
d="M511 864q-97 0 -186 -38t-153 -102t-102 -153t-38 -186.5t38 -186.5t102 -153t153 -102t186.5 -38t186.5 38t153 102t102 153t38 187q0 65 -17.5 127t-48 114.5t-75 97t-97 75.5t-114.5 48t-128 17zM583 73q0 -20 -14 -34t-34 -14h-48q-19 0 -33 14t-14 34v48q0 20 14 34
t33 14h48q13 0 24.5 -6.5t17.5 -17.5t6 -24v-48zM583 313q0 -13 -6 -24t-17.5 -17.5t-24.5 -6.5h-48q-19 0 -33 14t-14 34l-24 407q0 13 6 24t17 17.5t24 6.5h96q13 0 24.5 -6.5t17.5 -17.5t6 -24z" />
  </font>
</defs></svg>
