<?xml version="1.0" standalone="no"?>
<!DOCTYPE svg PUBLIC "-//W3C//DTD SVG 1.1//EN" "http://www.w3.org/Graphics/SVG/1.1/DTD/svg11.dtd" >
<svg xmlns="http://www.w3.org/2000/svg">
<metadata>
Created by FontForge 20120731 at Sun Jun 28 20:47:48 2015
 By Ads
</metadata>
<defs>
<font id="iconfont" horiz-adv-x="1024" >
  <font-face 
    font-family="iconfont"
    font-weight="500"
    font-stretch="normal"
    units-per-em="1024"
    panose-1="2 0 6 3 0 0 0 0 0 0"
    ascent="812"
    descent="-212"
    x-height="792"
    bbox="0 -212 1024 812"
    underline-thickness="50"
    underline-position="-100"
    unicode-range="U+0078-F0055"
  />
<missing-glyph horiz-adv-x="374" 
d="M34 0v682h272v-682h-272zM68 34h204v614h-204v-614z" />
    <glyph glyph-name=".notdef" horiz-adv-x="374" 
d="M34 0v682h272v-682h-272zM68 34h204v614h-204v-614z" />
    <glyph glyph-name=".null" horiz-adv-x="0" 
 />
    <glyph glyph-name="nonmarkingreturn" horiz-adv-x="341" 
 />
    <glyph glyph-name="x" unicode="x" horiz-adv-x="1001" 
d="M281 543q-27 -1 -53 -1h-83q-18 0 -36.5 -6t-32.5 -18.5t-23 -32t-9 -45.5v-76h912v41q0 16 -0.5 30t-0.5 18q0 13 -5 29t-17 29.5t-31.5 22.5t-49.5 9h-133v-97h-438v97zM955 310v-52q0 -23 0.5 -52t0.5 -58t-10.5 -47.5t-26 -30t-33 -16t-31.5 -4.5q-14 -1 -29.5 -0.5
t-29.5 0.5h-32l-45 128h-439l-44 -128h-29h-34q-20 0 -45 1q-25 0 -41 9.5t-25.5 23t-13.5 29.5t-4 30v167h911zM163 247q-12 0 -21 -8.5t-9 -21.5t9 -21.5t21 -8.5q13 0 22 8.5t9 21.5t-9 21.5t-22 8.5zM316 123q-8 -26 -14 -48q-5 -19 -10.5 -37t-7.5 -25t-3 -15t1 -14.5
t9.5 -10.5t21.5 -4h37h67h81h80h64h36q23 0 34 12t2 38q-5 13 -9.5 30.5t-9.5 34.5q-5 19 -11 39h-368zM336 498v228q0 11 2.5 23t10 21.5t20.5 15.5t34 6h188q31 0 51.5 -14.5t20.5 -52.5v-227h-327z" />
    <glyph glyph-name="uniE610" unicode="&#xe610;" 
d="M830 683h-636q-30 0 -51.5 -21.5t-21.5 -52.5v-476q0 -29 20.5 -45t52.5 -16h294q19 0 43.5 -9t45.5 -22.5t36 -27.5l43 -46q17 -18 30 -18q9 0 15.5 12t6.5 31q0 20 9.5 38.5t26.5 30t37 11.5h49q32 0 52.5 16t20.5 45v476q0 10 -2.5 19.5t-7.5 17.5t-11.5 15
t-14.5 11.5t-17.5 7.5t-19.5 3zM854 133q0 -9 -6 -11.5t-18 -2.5h-49q-26 0 -50 -12t-41 -32t-25 -45l-18 20q-28 29 -74 49t-85 20h-294q-23 3 -24 14v476q0 5 2 9.5t5 8t7.5 5.5t9.5 2h636q6 0 12 -3.5t9 -9t3 -12.5v-476zM292 462h244q11 0 18 7.5t7 17.5q0 4 -1.5 7.5
t-3.5 6.5t-5 5.5t-7 3.5t-8 1h-244q-10 0 -17 -7t-7 -17t7 -17.5t17 -7.5zM708 389h-416q-7 0 -12.5 -3.5t-8.5 -9t-3 -12.5q0 -10 7 -17t17 -7h416q4 0 7.5 1t6.5 3.5t5.5 5.5t3.5 6.5t1 7.5q0 7 -3.5 12.5t-9 9t-11.5 3.5zM708 291h-416q-7 0 -12.5 -3.5t-8.5 -9t-3 -12.5
q0 -10 7 -17t17 -7h416q6 0 11.5 3t9 9t3.5 12q0 5 -2 9.5t-5 8t-7.5 5.5t-9.5 2z" />
    <glyph glyph-name="uniE667" unicode="&#xe667;" 
d="M791 40l-160 159q55 65 51.5 152t-65.5 149q-43 43 -100.5 58t-115.5 0t-101 -58q-65 -66 -65 -158.5t65 -158.5q41 -41 95 -56.5t108.5 -4.5t97.5 47l159 -160zM330.5 213q-53.5 53 -53.5 128t53 129q35 34 82 46.5t93.5 0t81.5 -47t47 -81.5t0 -93.5t-47 -81.5
q-53 -53 -128 -53t-128.5 53z" />
    <glyph glyph-name="uniE693" unicode="&#xe693;" 
d="M944 320l-165 -142q-16 -16 -12 -39l38 -227q5 -27 -14 -41q-13 -10 -29 -10q-11 0 -22 6l-208 112q-10 5 -21 5t-20 -5l-200 -112q-12 -6 -25.5 -5t-24.5 9q-28 19 -24 41l48 232q2 11 -1.5 21.5t-11.5 17.5l-174 137q-21 21 -12 49q4 13 14.5 22t24.5 11l226 39
q11 2 19.5 8.5t13.5 16.5l104 219q13 27 43 27t43 -27l100 -219q11 -21 34 -25l230 -39q9 -2 16.5 -6t13.5 -11t8 -16q3 -9 2.5 -17.5t-4 -17t-10.5 -14.5z" />
    <glyph glyph-name="uniE6AD" unicode="&#xe6ad;" 
d="M796 684h-594q-30 0 -52 -21.5t-22 -52.5v-669l149 154h519q20 0 37 8.5t27 24t10 35.5v447q0 12 -3.5 23.5t-10.5 20.5t-16 16t-20.5 10.5t-23.5 3.5zM281 428h436v-77h-436v77zM589 223h-308v77h308v-77zM717 479h-436v77h436v-77z" />
    <glyph glyph-name="uF0055" unicode="&#xf0055;" 
d="M829 -208l-317 204l-313 -208l86 380l-285 290l369 1l138 353l146 -354l371 1l-286 -288z" />
  </font>
</defs></svg>
