<?xml version="1.0" standalone="no"?>
<!DOCTYPE svg PUBLIC "-//W3C//DTD SVG 1.1//EN" "http://www.w3.org/Graphics/SVG/1.1/DTD/svg11.dtd" >
<svg xmlns="http://www.w3.org/2000/svg">
<metadata>
Created by FontForge 20120731 at Wed Jul 29 07:29:02 2015
 By Ads
</metadata>
<defs>
<font id="iconfont" horiz-adv-x="1024" >
  <font-face 
    font-family="iconfont"
    font-weight="500"
    font-stretch="normal"
    units-per-em="1024"
    panose-1="2 0 6 3 0 0 0 0 0 0"
    ascent="812"
    descent="-212"
    x-height="792"
    bbox="34 -169.6 964 792"
    underline-thickness="50"
    underline-position="-100"
    unicode-range="U+0078-F0091"
  />
<missing-glyph horiz-adv-x="374" 
d="M34 0v682h272v-682h-272zM68 34h204v614h-204v-614z" />
    <glyph glyph-name=".notdef" horiz-adv-x="374" 
d="M34 0v682h272v-682h-272zM68 34h204v614h-204v-614z" />
    <glyph glyph-name=".null" horiz-adv-x="0" 
 />
    <glyph glyph-name="nonmarkingreturn" horiz-adv-x="341" 
 />
    <glyph glyph-name="x" unicode="x" horiz-adv-x="1001" 
d="M281 543q-27 -1 -53 -1h-83q-18 0 -36.5 -6t-32.5 -18.5t-23 -32t-9 -45.5v-76h912v41q0 16 -0.5 30t-0.5 18q0 13 -5 29t-17 29.5t-31.5 22.5t-49.5 9h-133v-97h-438v97zM955 310v-52q0 -23 0.5 -52t0.5 -58t-10.5 -47.5t-26 -30t-33 -16t-31.5 -4.5q-14 -1 -29.5 -0.5
t-29.5 0.5h-32l-45 128h-439l-44 -128h-29h-34q-20 0 -45 1q-25 0 -41 9.5t-25.5 23t-13.5 29.5t-4 30v167h911zM163 247q-12 0 -21 -8.5t-9 -21.5t9 -21.5t21 -8.5q13 0 22 8.5t9 21.5t-9 21.5t-22 8.5zM316 123q-8 -26 -14 -48q-5 -19 -10.5 -37t-7.5 -25t-3 -15t1 -14.5
t9.5 -10.5t21.5 -4h37h67h81h80h64h36q23 0 34 12t2 38q-5 13 -9.5 30.5t-9.5 34.5q-5 19 -11 39h-368zM336 498v228q0 11 2.5 23t10 21.5t20.5 15.5t34 6h188q31 0 51.5 -14.5t20.5 -52.5v-227h-327z" />
    <glyph glyph-name="uniE626" unicode="&#xe626;" 
d="M307 473q-23 0 -39 -16.5t-16 -40t16 -40t39 -16.5t39 16.5t16 39.5q0 16 -7.5 29t-20 20.5t-27.5 7.5zM526 473q-23 0 -39 -16.5t-16 -40.5q0 -9 3 -17.5t8 -15.5t11.5 -12.5t15 -8t17.5 -2.5q11 0 21 4.5t17.5 12t12 18t4.5 21.5q0 24 -16 40.5t-39 16.5zM745 473
q-23 0 -39 -16.5t-16 -40t16 -40t39 -16.5t39 16.5t16 39.5q0 16 -7.5 29t-20 20.5t-27.5 7.5zM854 757h-656q-23 0 -43 -9t-34.5 -24t-23.5 -36t-9 -44v-426q0 -48 33 -84.5t79 -36.5h167q29 -31 149 -155q10 -10 20 0q88 100 145 155h171q15 0 29.5 4.5t27 13t22.5 19.5
t17.5 24.5t11.5 28.5t4 31v426q0 13 -3 25.5t-8.5 24t-13 21t-17 17.5t-20 13.5t-23 8.5t-25.5 3zM909 218q0 -24 -17 -44t-40 -20h-168q-9 0 -18.5 -5.5t-14.5 -10.5l-6 -5l-117 -123l-118 123q-23 21 -42 21h-168q-23 0 -40 20t-17 44v426q0 15 7.5 28t20 20.5t27.5 7.5
h656q12 0 22 -4.5t17 -12t11.5 -18t4.5 -21.5v-426z" />
    <glyph glyph-name="uniE629" unicode="&#xe629;" 
d="M938 319q1 -5 -1 -11l-73 -322q-1 -6 -5 -11q-4 -8 -9 -15t-11.5 -13t-14.5 -11q-25 -16 -54 -16l-469 1q-3 -1 -5 -1t-5 1h-125l-5 -1q-9 0 -17 4.5t-12.5 12.5t-4.5 17v406q0 14 10 24t24 10q1 0 2 -0.5t2 -0.5l112 1q78 6 132 62t56 135v8q0 20 7.5 38.5t21 31.5
t31.5 21t38 8q35 0 61.5 -21.5t34.5 -54.5q3 -13 5 -25.5t3 -25.5t1 -27q0 -60 -20 -116l189 -1h5q53 -2 81 -47q18 -28 15 -61zM195 -12h67v338h-67v-338zM866 344q-10 17 -29 16v0h-239q-7 0 -13 2.5t-10.5 7t-7 11t-2.5 13.5q0 8 3 15q20 38 29 82q1 2 1.5 6t1.5 17.5
t1 29.5q0 12 -1 25.5t-2 20.5l-2 7v1q0 9 -4 16t-11.5 11.5t-15.5 4.5q-14 0 -23 -9.5t-9 -22.5v-1v-1v-3q0 -2 -1 -8v-12q-1 -6 -2 -14.5t-2 -16.5q-3 -15 -8 -31q-22 -65 -72.5 -112.5t-117.5 -64.5v-346h440h5q7 1 12 4q9 6 13 15l70 310q1 4 1 7v6q0 4 -1.5 7.5
t-3.5 6.5z" />
    <glyph glyph-name="uniE649" unicode="&#xe649;" 
d="M134 106q20 43 43 81.5t59 81t78 74t99.5 55t122.5 29.5q19 2 33 17.5t14 35.5v2v2v77q0 5 2 9.5t5 8t7.5 5t9.5 1.5q8 0 15 -5l1 -1l250 -232l3 -3q16 -17 16 -40q0 -4 -0.5 -8t-1.5 -7.5t-2.5 -7t-3.5 -7t-5 -6.5l-9 -8l-246 -238l-1 -1q-4 -3 -8 -4.5t-8 -1.5
q-10 0 -17 7t-7 17v96v2v2q0 11 -4.5 21t-11.5 17t-16.5 11t-20.5 4q-121 -2 -205.5 -25.5t-150.5 -86.5q-3 -2 -5 -5q-6 -4 -14 -4q-9 0 -16 7t-7 18q0 5 2 10z" />
    <glyph glyph-name="uniE6A4" unicode="&#xe6a4;" 
d="M814 410l-145 -1l60 91q17 32 20 63t-5 51.5t-18 36t-19 22.5l-9 8q-18 13 -34 14.5t-26.5 -5.5t-18 -16t-11.5 -17l-3 -7q-33 -70 -77.5 -120t-84 -72t-75 -32.5t-55.5 -12t-21 0.5h-55h-63q-2 0 -6 -0.5t-13.5 -4t-17 -9.5t-13.5 -19t-6 -30v-354q0 -13 3.5 -23.5
t8.5 -17t11 -11.5t11.5 -7.5t10.5 -4t7 -1.5l3 -1h42h167h373q13 0 24 2t19.5 7.5t16 13t13.5 18t11.5 24t10.5 30.5l59 235q6 36 -0.5 65.5t-21.5 47t-34 27t-39 9.5zM219 -11q0 -4 -1.5 -7.5t-4 -6.5t-6.5 -4.5t-8 -1.5q-3 0 -6 1t-5.5 3t-4.5 4.5t-3 5.5t-1 6v361
q0 4 2 7.5t4.5 6.5t6 4.5t7.5 1.5q3 0 5 -0.5t4 -1.5l4 -2l2 -4q2 -1 3 -3t1.5 -4.5t0.5 -4.5v-361z" />
    <glyph glyph-name="uF0091" unicode="&#xf0091;" 
d="M954 569v43q0 17 -6.5 33t-17.5 27.5t-26.5 18t-33.5 6.5h-728q-36 -2 -58 -19.5t-22 -49.5v-530q2 -34 26.5 -58t59.5 -24h46h167q20 0 31.5 7.5t11.5 24.5q0 11 -6 19.5t-15.5 12.5t-21.5 4h-182q-26 1 -36 8.5t-13 27.5v474q1 6 3 10.5t4.5 8.5t6.5 6.5t9 4t11 2.5
t14 2h707v-1l-56 1q32 -1 43 -9t13 -33v-462q-2 -24 -11.5 -32t-37.5 -9h-295q-7 2 -14.5 1t-14.5 -5q-10 -5 -15 -13l-169 -166q-13 -14 -15.5 -30.5t9.5 -29.5q13 -12 30 -9t31 16l171 169h270h46q24 0 43 11.5t29.5 31t10.5 43.5v43h1v424zM885 83h-22h22zM829 628h-29
h29zM559 356q0 10 -4 19.5t-11 16.5t-16.5 11t-19.5 4q-14 0 -26 -7t-19 -18.5t-7 -25.5q0 -22 15 -36.5t37 -14.5q13 0 25 6.5t19 18.5t7 26zM267 356q0 -14 7 -26t19 -18.5t26 -6.5q21 0 36 14.5t15 36.5q0 10 -4 19.5t-11 16.5t-16.5 11t-19.5 4q-9 0 -16.5 -2.5
t-14 -7.5t-11 -11t-7.5 -14t-3 -16zM748 355.5q0 21.5 -15 36.5t-37 15q-14 0 -25.5 -7t-18.5 -18.5t-7 -25.5q0 -11 4 -20.5t11 -16t16.5 -10.5t19.5 -4q22 0 37 14.5t15 36z" />
  </font>
</defs></svg>
