M48
;DRILL file {KiCad 4.0.5-e0-6337~49~ubuntu16.04.1} date Sat Feb 18 14:25:49 2017
;FORMAT={-:-/ absolute / metric / decimal}
FMAT,2
METRIC,TZ
T1C1.000
%
G90
G05
M71
T1
X2.54Y-3.175
X2.54Y-5.715
X2.54Y-8.255
X2.54Y-10.795
X5.08Y-3.175
X5.08Y-5.715
X5.08Y-8.255
X5.08Y-10.795
X22.225Y-12.065
X22.86Y-1.905
X24.765Y-12.065
X25.4Y-1.905
X27.305Y-12.065
X27.94Y-1.905
X29.845Y-12.065
X33.655Y-12.065
X36.195Y-12.065
X45.72Y-3.175
X45.72Y-5.715
X45.72Y-8.255
X45.72Y-10.795
X48.26Y-3.175
X48.26Y-5.715
X48.26Y-8.255
X48.26Y-10.795
T0
M30
