{
    "version": 2,
    "general" : {
        "dot_size": 0.1,
        "travel_feedrate": 10000,
        "off_during_travel": true,
        "optimize": 2,
        "scale": 1.0,
        "align": "top-left"
    },
    "layers": [
        {
            "name": "engrave",
            "pwm": {
                "type": "const",
                "value": 255
            },
            "feedrate": {
                "type": "const",
                "value": 1500
            },
            "cut": {
                "type": "continuous",
                "depth": 0.0,
                "steps": 1,
                "passes": 1,
                "sequential": false
            }
        },
        {
            "name": "cut",
            "pwm": {
                "type": "const",
                "value": 255
            },
            "feedrate": {
                "type": "const",
                "value": 900
            },
            "cut": {
                "type": "continuous",
                "depth": 0.0,
                "steps": 1,
                "passes": 1,
                "sequential": false
            }
        }
    ]
}
