G04 PROTEUS GERBER X2 FILE*
%TF.GenerationSoftware,Labcenter,Proteus,8.6-SP2-Build23525*%
%TF.CreationDate,2018-03-28T07:28:25+00:00*%
%TF.FileFunction,Soldermask,Bot*%
%TF.FilePolarity,Negative*%
%TF.Part,Single*%
%FSLAX45Y45*%
%MOMM*%
G01*
%TA.AperFunction,Material*%
%ADD33C,1.270000*%
%AMPPAD028*
4,1,68,
1.270000,1.016000,
1.270000,-1.016000,
1.268720,-1.042400,
1.264950,-1.067930,
1.258800,-1.092490,
1.250400,-1.115960,
1.239870,-1.138220,
1.227300,-1.159150,
1.212840,-1.178650,
1.196580,-1.196580,
1.178640,-1.212840,
1.159150,-1.227300,
1.138220,-1.239860,
1.115960,-1.250400,
1.092490,-1.258800,
1.067930,-1.264950,
1.042400,-1.268720,
1.016000,-1.270000,
-1.016000,-1.270000,
-1.042400,-1.268720,
-1.067930,-1.264950,
-1.092490,-1.258800,
-1.115960,-1.250400,
-1.138220,-1.239860,
-1.159150,-1.227300,
-1.178640,-1.212840,
-1.196580,-1.196580,
-1.212840,-1.178650,
-1.227300,-1.159150,
-1.239870,-1.138220,
-1.250400,-1.115960,
-1.258800,-1.092490,
-1.264950,-1.067930,
-1.268720,-1.042400,
-1.270000,-1.016000,
-1.270000,1.016000,
-1.268720,1.042400,
-1.264950,1.067930,
-1.258800,1.092490,
-1.250400,1.115960,
-1.239870,1.138220,
-1.227300,1.159150,
-1.212840,1.178650,
-1.196580,1.196580,
-1.178640,1.212840,
-1.159150,1.227300,
-1.138220,1.239860,
-1.115960,1.250400,
-1.092490,1.258800,
-1.067930,1.264950,
-1.042400,1.268720,
-1.016000,1.270000,
1.016000,1.270000,
1.042400,1.268720,
1.067930,1.264950,
1.092490,1.258800,
1.115960,1.250400,
1.138220,1.239860,
1.159150,1.227300,
1.178640,1.212840,
1.196580,1.196580,
1.212840,1.178650,
1.227300,1.159150,
1.239870,1.138220,
1.250400,1.115960,
1.258800,1.092490,
1.264950,1.067930,
1.268720,1.042400,
1.270000,1.016000,
0*%
%TA.AperFunction,Material*%
%ADD34PPAD028*%
%AMPPAD039*
4,1,68,
0.889000,0.635000,
0.889000,-0.635000,
0.887720,-0.661400,
0.883950,-0.686930,
0.877800,-0.711490,
0.869400,-0.734960,
0.858870,-0.757220,
0.846300,-0.778150,
0.831840,-0.797650,
0.815580,-0.815580,
0.797640,-0.831840,
0.778150,-0.846300,
0.757220,-0.858860,
0.734960,-0.869400,
0.711490,-0.877800,
0.686930,-0.883950,
0.661400,-0.887720,
0.635000,-0.889000,
-0.635000,-0.889000,
-0.661400,-0.887720,
-0.686930,-0.883950,
-0.711490,-0.877800,
-0.734960,-0.869400,
-0.757220,-0.858860,
-0.778150,-0.846300,
-0.797640,-0.831840,
-0.815580,-0.815580,
-0.831840,-0.797650,
-0.846300,-0.778150,
-0.858870,-0.757220,
-0.869400,-0.734960,
-0.877800,-0.711490,
-0.883950,-0.686930,
-0.887720,-0.661400,
-0.889000,-0.635000,
-0.889000,0.635000,
-0.887720,0.661400,
-0.883950,0.686930,
-0.877800,0.711490,
-0.869400,0.734960,
-0.858870,0.757220,
-0.846300,0.778150,
-0.831840,0.797650,
-0.815580,0.815580,
-0.797640,0.831840,
-0.778150,0.846300,
-0.757220,0.858860,
-0.734960,0.869400,
-0.711490,0.877800,
-0.686930,0.883950,
-0.661400,0.887720,
-0.635000,0.889000,
0.635000,0.889000,
0.661400,0.887720,
0.686930,0.883950,
0.711490,0.877800,
0.734960,0.869400,
0.757220,0.858860,
0.778150,0.846300,
0.797640,0.831840,
0.815580,0.815580,
0.831840,0.797650,
0.846300,0.778150,
0.858870,0.757220,
0.869400,0.734960,
0.877800,0.711490,
0.883950,0.686930,
0.887720,0.661400,
0.889000,0.635000,
0*%
%TA.AperFunction,Material*%
%ADD45PPAD039*%
%ADD46C,2.286000*%
%TA.AperFunction,Material*%
%ADD49C,2.540000*%
%TA.AperFunction,Profile*%
%ADD29C,0.203200*%
%TD.AperFunction*%
D33*
X-6111240Y+7401560D03*
X-3891280Y+7391400D03*
X-7287562Y+9777700D03*
X-6611467Y+9968598D03*
X-4583128Y+10029857D03*
D34*
X-10854000Y+10475000D03*
X-10600000Y+10475000D03*
X-10854000Y+10221000D03*
X-10600000Y+10221000D03*
X-10854000Y+9967000D03*
X-10600000Y+9967000D03*
X-10854000Y+9713000D03*
X-10600000Y+9713000D03*
X-10854000Y+9459000D03*
X-10600000Y+9459000D03*
X-10854000Y+9205000D03*
X-10600000Y+9205000D03*
X-10854000Y+8951000D03*
X-10600000Y+8951000D03*
X-10854000Y+8697000D03*
X-10600000Y+8697000D03*
X-10854000Y+8443000D03*
X-10600000Y+8443000D03*
X-10854000Y+8189000D03*
X-10600000Y+8189000D03*
X-10854000Y+7935000D03*
X-10600000Y+7935000D03*
X-10854000Y+7681000D03*
X-10600000Y+7681000D03*
X-10854000Y+7427000D03*
X-10600000Y+7427000D03*
D45*
X-9508846Y+9380566D03*
D46*
X-9508846Y+9126566D03*
X-9508846Y+8872566D03*
X-9508846Y+8618566D03*
X-9508846Y+8364566D03*
X-9508846Y+8110566D03*
X-9508846Y+7856566D03*
X-9508846Y+7602566D03*
X-9508846Y+7348566D03*
X-8746846Y+7348566D03*
X-8746846Y+7602566D03*
X-8746846Y+7856566D03*
X-8746846Y+8110566D03*
X-8746846Y+8364566D03*
X-8746846Y+8618566D03*
X-8746846Y+8872566D03*
X-8746846Y+9126566D03*
X-8746846Y+9380566D03*
D49*
X-10350000Y+9950000D03*
X-10350000Y+10850000D03*
X-4758846Y+8830566D03*
X-4758846Y+9480566D03*
X-10200000Y+7350000D03*
X-10200000Y+7950000D03*
X-8900000Y+10050000D03*
X-8900000Y+10700000D03*
X-6500000Y+9800000D03*
X-6500000Y+9400000D03*
X-5150000Y+9650000D03*
X-5150000Y+10050000D03*
D29*
X-11300000Y+7000000D02*
X-3000000Y+7000000D01*
X-3000000Y+11000000D01*
X-11300000Y+11000000D01*
X-11300000Y+7000000D01*
M02*
