{
    "KernelAArch64SErrorIgnore": {
        "type": "BOOL",
        "value": "OFF"
    },
    "KernelArch": {
        "type": "STRING",
        "value": "arm"
    },
    "KernelArmDisableWFIWFETraps": {
        "type": "BOOL",
        "value": "OFF"
    },
    "KernelArmExportPCNTUser": {
        "type": "BOOL",
        "value": "OFF"
    },
    "KernelArmExportPMUUser": {
        "type": "BOOL",
        "value": "OFF"
    },
    "KernelArmExportPTMRUser": {
        "type": "BOOL",
        "value": "OFF"
    },
    "KernelArmExportVCNTUser": {
        "type": "BOOL",
        "value": "OFF"
    },
    "KernelArmExportVTMRUser": {
        "type": "BOOL",
        "value": "OFF"
    },
    "KernelArmGicV3": {
        "type": "BOOL",
        "value": "OFF"
    },
    "KernelArmHypervisorSupport": {
        "type": "BOOL",
        "value": "ON"
    },
    "KernelArmVtimerUpdateVOffset": {
        "type": "BOOL",
        "value": "ON"
    },
    "KernelBenchmarks": {
        "type": "STRING",
        "value": "none"
    },
    "KernelClz32": {
        "type": "BOOL",
        "value": "OFF"
    },
    "KernelClz64": {
        "type": "BOOL",
        "value": "OFF"
    },
    "KernelClzNoBuiltin": {
        "type": "BOOL",
        "value": "OFF"
    },
    "KernelColourPrinting": {
        "type": "BOOL",
        "value": "ON"
    },
    "KernelCtz32": {
        "type": "BOOL",
        "value": "OFF"
    },
    "KernelCtz64": {
        "type": "BOOL",
        "value": "OFF"
    },
    "KernelCtzNoBuiltin": {
        "type": "BOOL",
        "value": "OFF"
    },
    "KernelCustomDTS": {
        "type": "FILEPATH",
        "value": ""
    },
    "KernelCustomDTSOverlay": {
        "type": "FILEPATH",
        "value": ""
    },
    "KernelDangerousCodeInjection": {
        "type": "BOOL",
        "value": "OFF"
    },
    "KernelDebugBuild": {
        "type": "BOOL",
        "value": "ON"
    },
    "KernelDebugDisableBranchPrediction": {
        "type": "BOOL",
        "value": "OFF"
    },
    "KernelDebugDisableL2Cache": {
        "type": "BOOL",
        "value": "OFF"
    },
    "KernelDomainSchedule": {
        "type": "FILEPATH",
        "value": "/local/seL4-quickstart-bundle/seL4-bundle/kernel/src/config/default_domain.c"
    },
    "KernelFPUMaxRestoresSinceSwitch": {
        "type": "STRING",
        "value": "64"
    },
    "KernelFWholeProgram": {
        "type": "BOOL",
        "value": "OFF"
    },
    "KernelFastpath": {
        "type": "BOOL",
        "value": "ON"
    },
    "KernelIRQReporting": {
        "type": "BOOL",
        "value": "ON"
    },
    "KernelInvocationReportErrorIPC": {
        "type": "BOOL",
        "value": "OFF"
    },
    "KernelIsMCS": {
        "type": "BOOL",
        "value": "OFF"
    },
    "KernelMaxNumBootinfoUntypedCaps": {
        "type": "STRING",
        "value": "230"
    },
    "KernelMaxNumNodes": {
        "type": "STRING",
        "value": "2"
    },
    "KernelMaxNumWorkUnitsPerPreemption": {
        "type": "STRING",
        "value": "100"
    },
    "KernelNumDomains": {
        "type": "STRING",
        "value": "1"
    },
    "KernelNumPriorities": {
        "type": "STRING",
        "value": "256"
    },
    "KernelOptimisation": {
        "type": "STRING",
        "value": "-O2"
    },
    "KernelOptimisationCloneFunctions": {
        "type": "BOOL",
        "value": "ON"
    },
    "KernelPlatform": {
        "type": "STRING",
        "value": "qemu-arm-virt"
    },
    "KernelPrinting": {
        "type": "BOOL",
        "value": "ON"
    },
    "KernelResetChunkBits": {
        "type": "STRING",
        "value": "8"
    },
    "KernelRetypeFanOutLimit": {
        "type": "STRING",
        "value": "256"
    },
    "KernelRootCNodeSizeBits": {
        "type": "STRING",
        "value": "12"
    },
    "KernelSel4Arch": {
        "type": "STRING",
        "value": "aarch64"
    },
    "KernelStackBits": {
        "type": "STRING",
        "value": "12"
    },
    "KernelTimeSlice": {
        "type": "STRING",
        "value": "5"
    },
    "KernelTimerTickMS": {
        "type": "STRING",
        "value": "2"
    },
    "KernelUserStackTraceLength": {
        "type": "STRING",
        "value": "16"
    },
    "KernelVerificationBuild": {
        "type": "BOOL",
        "value": "OFF"
    },
    "LibSel4FunctionAttributes": {
        "type": "STRING",
        "value": "public"
    },
    "LibSel4StubsUseIPCBufferOnly": {
        "type": "BOOL",
        "value": "OFF"
    }
}