^C:\USERS\COLEW\ONEDRIVE\DOCUMENTS\SCHOOL\DATA STRUCTURES\COLE WILSHIRE_PROJECT 02 RECURSION\PROJECT_02 QUESTION 20\PROJECT_02 QUESTION 20\DEBUG\MAIN.OBJ
C:\USERS\COLEW\ONEDRIVE\DOCUMENTS\SCHOOL\DATA STRUCTURES\COLE WILSHIRE_PROJECT 02 RECURSION\PROJECT_02 QUESTION 20\DEBUG\PROJECT_02 QUESTION 20.EXE
C:\USERS\COLEW\ONEDRIVE\DOCUMENTS\SCHOOL\DATA STRUCTURES\COLE WILSHIRE_PROJECT 02 RECURSION\PROJECT_02 QUESTION 20\DEBUG\PROJECT_02 QUESTION 20.ILK
C:\USERS\COLEW\ONEDRIVE\DOCUMENTS\SCHOOL\DATA STRUCTURES\COLE WILSHIRE_PROJECT 02 RECURSION\PROJECT_02 QUESTION 20\DEBUG\PROJECT_02 QUESTION 20.PDB
^C:\USERS\COLEW\ONEDRIVE\DOCUMENTS\SCHOOL\PORTFOLIO\COLE WILSHIRE_PROJECT 02 RECURSION\PROJECT_02 QUESTION 20\PROJECT_02 QUESTION 20\DEBUG\MAIN.OBJ
C:\USERS\COLEW\ONEDRIVE\DOCUMENTS\SCHOOL\PORTFOLIO\COLE WILSHIRE_PROJECT 02 RECURSION\PROJECT_02 QUESTION 20\DEBUG\PROJECT_02 QUESTION 20.EXE
C:\USERS\COLEW\ONEDRIVE\DOCUMENTS\SCHOOL\PORTFOLIO\COLE WILSHIRE_PROJECT 02 RECURSION\PROJECT_02 QUESTION 20\DEBUG\PROJECT_02 QUESTION 20.ILK
C:\USERS\COLEW\ONEDRIVE\DOCUMENTS\SCHOOL\PORTFOLIO\COLE WILSHIRE_PROJECT 02 RECURSION\PROJECT_02 QUESTION 20\DEBUG\PROJECT_02 QUESTION 20.PDB
